{"text_format":"1","workbook":"xlsx","n_sheets":8,"sheets":["Shooter Information","Stage 1","Stage 2","Stage 3","Stage 4","Stage 5","Stage 6","Score Summary"],"not_rendered":{"charts":0,"images":0,"macros":1,"external_links":0,"defined_names":4,"comments":0,"pivot_tables":0},"unopened":[],"bounds":{"document_bytes":16777216,"sheet_cells":100000,"rows_first":2000,"rows_last":500,"rows_between":2000,"halvings":0,"cell_chars":16384,"cell_head_chars":4096},"cells_cut":0,"cells_raw":0,"read":"whole","date_system":"1900"}

{"sheet":"Shooter Information","index":0,"n_rows":80,"n_cols":7,"rows_kept":80,"cut":false,"hidden":false,"merged":[]}
[null,"CAS SHOOTER INFORMATION",null,"Club:","Cavalier Cowboys"]
[null,null,null,"Date:","Wednesday April 9th, 2014"]
[null,null,null,"Number of Shooters:",{"$f":"COUNTA(B6:B80)","v":4},"of",{"$f":"COUNT(A6:A151)","v":75}]
[]
["Roster #","Shooter","Class",null,"Posse","Shooting #"]
[{"$f":"ROW()-5","v":1},"Striker"]
[2,"Doc Deadwood"]
[3,"Cold Blue Mike"]
[4,"B.S. Walker"]
[5]
[6]
[7]
[8]
[9]
[10]
[11]
[12]
[13]
[14]
[15]
[16]
[17]
[18]
[19]
[20]
[21]
[22]
[23]
[24]
[25]
[26]
[27]
[28]
[29]
[30]
[31]
[32]
[{"$f":"ROW()-5","v":33}]
[34]
[35]
[36]
[37]
[38]
[39]
[40]
[41]
[42]
[43]
[44]
[45]
[46]
[47]
[48]
[49]
[50]
[51]
[52]
[53]
[54]
[55]
[56]
[57]
[58]
[59]
[60]
[61]
[62]
[63]
[64]
[{"$f":"ROW()-5","v":65}]
[66]
[67]
[68]
[69]
[70]
[71]
[72]
[73]
[74]
[75]

{"sheet":"Stage 1","index":1,"n_rows":78,"n_cols":13,"rows_kept":78,"cut":false,"hidden":false,"merged":[[0,4,0,5]]}
[null,"CAS SCORE SHEET",null,"Date:",{"$f":"'Shooter Information'!$E$2","v":"Wednesday April 9th, 2014"}]
[null,"Stage 1"]
["Roster #","Shooter","Class","Misses","Raw Time","Bonus","10 Sec","30 Sec","DNF","DQ","Total","Rank","Penalties"]
[{"$f":"ROW()-3","v":1},{"$f":"'Shooter Information'!B6","v":"Striker"},{"$f":"'Shooter Information'!C6","v":0},null,22.75,null,null,null,null,null,{"$f":"(D4*5)+E4-F4+(G4*10)+(H4*30)+(I4*999)+(J4*999.99)","v":22.75},{"$f":"IF('Shooter Information'!$E$3-('Shooter Information'!$G$3-RANK(K4,K$4:K$78,1))<0,0,'Shooter Information'!$E$3-('Shooter Information'!$G$3-RANK(K4,K$4:K$78,1)))","v":1},{"$f":"(SUM(D4+G4+H4+I4+J4))","v":0}]
[{"$f":"ROW()-3","v":2},{"$f":"'Shooter Information'!B7","v":"Doc Deadwood"},{"$f":"'Shooter Information'!C7","v":0},null,31.73,null,null,null,null,null,{"$f":"(D5*5)+E5-F5+(G5*10)+(H5*30)+(I5*999)+(J5*999.99)","v":31.73},{"$f":"IF('Shooter Information'!$E$3-('Shooter Information'!$G$3-RANK(K5,K$4:K$78,1))<0,0,'Shooter Information'!$E$3-('Shooter Information'!$G$3-RANK(K5,K$4:K$78,1)))","v":4},{"$f":"(SUM(D5+G5+H5+I5+J5))","v":0}]
[3,{"$f":"'Shooter Information'!B8","v":"Cold Blue Mike"},{"$f":"'Shooter Information'!C8","v":0},null,24.07,null,null,null,null,null,24.07,{"$f":"IF('Shooter Information'!$E$3-('Shooter Information'!$G$3-RANK(K6,K$4:K$78,1))<0,0,'Shooter Information'!$E$3-('Shooter Information'!$G$3-RANK(K6,K$4:K$78,1)))","v":3},0]
[4,{"$f":"'Shooter Information'!B9","v":"B.S. Walker"},{"$f":"'Shooter Information'!C9","v":0},null,23.61,null,null,null,null,null,23.61,{"$f":"IF('Shooter Information'!$E$3-('Shooter Information'!$G$3-RANK(K7,K$4:K$78,1))<0,0,'Shooter Information'!$E$3-('Shooter Information'!$G$3-RANK(K7,K$4:K$78,1)))","v":2},0]
[5,{"$f":"'Shooter Information'!B10","v":0},{"$f":"'Shooter Information'!C10","v":0},null,null,null,null,null,null,null,0,{"$f":"IF('Shooter Information'!$E$3-('Shooter Information'!$G$3-RANK(K8,K$4:K$78,1))<0,0,'Shooter Information'!$E$3-('Shooter Information'!$G$3-RANK(K8,K$4:K$78,1)))","v":0},0]
[6,{"$f":"'Shooter Information'!B11","v":0},{"$f":"'Shooter Information'!C11","v":0},null,null,null,null,null,null,null,0,{"$f":"IF('Shooter Information'!$E$3-('Shooter Information'!$G$3-RANK(K9,K$4:K$78,1))<0,0,'Shooter Information'!$E$3-('Shooter Information'!$G$3-RANK(K9,K$4:K$78,1)))","v":0},0]
[7,{"$f":"'Shooter Information'!B12","v":0},{"$f":"'Shooter Information'!C12","v":0},null,null,null,null,null,null,null,0,{"$f":"IF('Shooter Information'!$E$3-('Shooter Information'!$G$3-RANK(K10,K$4:K$78,1))<0,0,'Shooter Information'!$E$3-('Shooter Information'!$G$3-RANK(K10,K$4:K$78,1)))","v":0},0]
[8,{"$f":"'Shooter Information'!B13","v":0},{"$f":"'Shooter Information'!C13","v":0},null,null,null,null,null,null,null,0,{"$f":"IF('Shooter Information'!$E$3-('Shooter Information'!$G$3-RANK(K11,K$4:K$78,1))<0,0,'Shooter Information'!$E$3-('Shooter Information'!$G$3-RANK(K11,K$4:K$78,1)))","v":0},0]
[9,{"$f":"'Shooter Information'!B14","v":0},{"$f":"'Shooter Information'!C14","v":0},null,null,null,null,null,null,null,0,{"$f":"IF('Shooter Information'!$E$3-('Shooter Information'!$G$3-RANK(K12,K$4:K$78,1))<0,0,'Shooter Information'!$E$3-('Shooter Information'!$G$3-RANK(K12,K$4:K$78,1)))","v":0},0]
[10,{"$f":"'Shooter Information'!B15","v":0},{"$f":"'Shooter Information'!C15","v":0},null,null,null,null,null,null,null,0,{"$f":"IF('Shooter Information'!$E$3-('Shooter Information'!$G$3-RANK(K13,K$4:K$78,1))<0,0,'Shooter Information'!$E$3-('Shooter Information'!$G$3-RANK(K13,K$4:K$78,1)))","v":0},0]
[11,{"$f":"'Shooter Information'!B16","v":0},{"$f":"'Shooter Information'!C16","v":0},null,null,null,null,null,null,null,0,{"$f":"IF('Shooter Information'!$E$3-('Shooter Information'!$G$3-RANK(K14,K$4:K$78,1))<0,0,'Shooter Information'!$E$3-('Shooter Information'!$G$3-RANK(K14,K$4:K$78,1)))","v":0},0]
[12,{"$f":"'Shooter Information'!B17","v":0},{"$f":"'Shooter Information'!C17","v":0},null,null,null,null,null,null,null,0,{"$f":"IF('Shooter Information'!$E$3-('Shooter Information'!$G$3-RANK(K15,K$4:K$78,1))<0,0,'Shooter Information'!$E$3-('Shooter Information'!$G$3-RANK(K15,K$4:K$78,1)))","v":0},0]
[13,{"$f":"'Shooter Information'!B18","v":0},{"$f":"'Shooter Information'!C18","v":0},null,null,null,null,null,null,null,0,{"$f":"IF('Shooter Information'!$E$3-('Shooter Information'!$G$3-RANK(K16,K$4:K$78,1))<0,0,'Shooter Information'!$E$3-('Shooter Information'!$G$3-RANK(K16,K$4:K$78,1)))","v":0},0]
[14,{"$f":"'Shooter Information'!B19","v":0},{"$f":"'Shooter Information'!C19","v":0},null,null,null,null,null,null,null,0,{"$f":"IF('Shooter Information'!$E$3-('Shooter Information'!$G$3-RANK(K17,K$4:K$78,1))<0,0,'Shooter Information'!$E$3-('Shooter Information'!$G$3-RANK(K17,K$4:K$78,1)))","v":0},0]
[15,{"$f":"'Shooter Information'!B20","v":0},{"$f":"'Shooter Information'!C20","v":0},null,null,null,null,null,null,null,0,{"$f":"IF('Shooter Information'!$E$3-('Shooter Information'!$G$3-RANK(K18,K$4:K$78,1))<0,0,'Shooter Information'!$E$3-('Shooter Information'!$G$3-RANK(K18,K$4:K$78,1)))","v":0},0]
[16,{"$f":"'Shooter Information'!B21","v":0},{"$f":"'Shooter Information'!C21","v":0},null,null,null,null,null,null,null,0,{"$f":"IF('Shooter Information'!$E$3-('Shooter Information'!$G$3-RANK(K19,K$4:K$78,1))<0,0,'Shooter Information'!$E$3-('Shooter Information'!$G$3-RANK(K19,K$4:K$78,1)))","v":0},0]
[17,{"$f":"'Shooter Information'!B22","v":0},{"$f":"'Shooter Information'!C22","v":0},null,null,null,null,null,null,null,0,{"$f":"IF('Shooter Information'!$E$3-('Shooter Information'!$G$3-RANK(K20,K$4:K$78,1))<0,0,'Shooter Information'!$E$3-('Shooter Information'!$G$3-RANK(K20,K$4:K$78,1)))","v":0},0]
[18,{"$f":"'Shooter Information'!B23","v":0},{"$f":"'Shooter Information'!C23","v":0},null,null,null,null,null,null,null,0,{"$f":"IF('Shooter Information'!$E$3-('Shooter Information'!$G$3-RANK(K21,K$4:K$78,1))<0,0,'Shooter Information'!$E$3-('Shooter Information'!$G$3-RANK(K21,K$4:K$78,1)))","v":0},0]
[19,{"$f":"'Shooter Information'!B24","v":0},{"$f":"'Shooter Information'!C24","v":0},null,null,null,null,null,null,null,0,{"$f":"IF('Shooter Information'!$E$3-('Shooter Information'!$G$3-RANK(K22,K$4:K$78,1))<0,0,'Shooter Information'!$E$3-('Shooter Information'!$G$3-RANK(K22,K$4:K$78,1)))","v":0},0]
[20,{"$f":"'Shooter Information'!B25","v":0},{"$f":"'Shooter Information'!C25","v":0},null,null,null,null,null,null,null,0,{"$f":"IF('Shooter Information'!$E$3-('Shooter Information'!$G$3-RANK(K23,K$4:K$78,1))<0,0,'Shooter Information'!$E$3-('Shooter Information'!$G$3-RANK(K23,K$4:K$78,1)))","v":0},0]
[21,{"$f":"'Shooter Information'!B26","v":0},{"$f":"'Shooter Information'!C26","v":0},null,null,null,null,null,null,null,0,{"$f":"IF('Shooter Information'!$E$3-('Shooter Information'!$G$3-RANK(K24,K$4:K$78,1))<0,0,'Shooter Information'!$E$3-('Shooter Information'!$G$3-RANK(K24,K$4:K$78,1)))","v":0},0]
[22,{"$f":"'Shooter Information'!B27","v":0},{"$f":"'Shooter Information'!C27","v":0},null,null,null,null,null,null,null,0,{"$f":"IF('Shooter Information'!$E$3-('Shooter Information'!$G$3-RANK(K25,K$4:K$78,1))<0,0,'Shooter Information'!$E$3-('Shooter Information'!$G$3-RANK(K25,K$4:K$78,1)))","v":0},0]
[23,{"$f":"'Shooter Information'!B28","v":0},{"$f":"'Shooter Information'!C28","v":0},null,null,null,null,null,null,null,0,{"$f":"IF('Shooter Information'!$E$3-('Shooter Information'!$G$3-RANK(K26,K$4:K$78,1))<0,0,'Shooter Information'!$E$3-('Shooter Information'!$G$3-RANK(K26,K$4:K$78,1)))","v":0},0]
[24,{"$f":"'Shooter Information'!B29","v":0},{"$f":"'Shooter Information'!C29","v":0},null,null,null,null,null,null,null,0,{"$f":"IF('Shooter Information'!$E$3-('Shooter Information'!$G$3-RANK(K27,K$4:K$78,1))<0,0,'Shooter Information'!$E$3-('Shooter Information'!$G$3-RANK(K27,K$4:K$78,1)))","v":0},0]
[25,{"$f":"'Shooter Information'!B30","v":0},{"$f":"'Shooter Information'!C30","v":0},null,null,null,null,null,null,null,0,{"$f":"IF('Shooter Information'!$E$3-('Shooter Information'!$G$3-RANK(K28,K$4:K$78,1))<0,0,'Shooter Information'!$E$3-('Shooter Information'!$G$3-RANK(K28,K$4:K$78,1)))","v":0},0]
[26,{"$f":"'Shooter Information'!B31","v":0},{"$f":"'Shooter Information'!C31","v":0},null,null,null,null,null,null,null,0,{"$f":"IF('Shooter Information'!$E$3-('Shooter Information'!$G$3-RANK(K29,K$4:K$78,1))<0,0,'Shooter Information'!$E$3-('Shooter Information'!$G$3-RANK(K29,K$4:K$78,1)))","v":0},0]
[27,{"$f":"'Shooter Information'!B32","v":0},{"$f":"'Shooter Information'!C32","v":0},null,null,null,null,null,null,null,0,{"$f":"IF('Shooter Information'!$E$3-('Shooter Information'!$G$3-RANK(K30,K$4:K$78,1))<0,0,'Shooter Information'!$E$3-('Shooter Information'!$G$3-RANK(K30,K$4:K$78,1)))","v":0},0]
[28,{"$f":"'Shooter Information'!B33","v":0},{"$f":"'Shooter Information'!C33","v":0},null,null,null,null,null,null,null,0,{"$f":"IF('Shooter Information'!$E$3-('Shooter Information'!$G$3-RANK(K31,K$4:K$78,1))<0,0,'Shooter Information'!$E$3-('Shooter Information'!$G$3-RANK(K31,K$4:K$78,1)))","v":0},0]
[29,{"$f":"'Shooter Information'!B34","v":0},{"$f":"'Shooter Information'!C34","v":0},null,null,null,null,null,null,null,0,{"$f":"IF('Shooter Information'!$E$3-('Shooter Information'!$G$3-RANK(K32,K$4:K$78,1))<0,0,'Shooter Information'!$E$3-('Shooter Information'!$G$3-RANK(K32,K$4:K$78,1)))","v":0},0]
[30,{"$f":"'Shooter Information'!B35","v":0},{"$f":"'Shooter Information'!C35","v":0},null,null,null,null,null,null,null,0,{"$f":"IF('Shooter Information'!$E$3-('Shooter Information'!$G$3-RANK(K33,K$4:K$78,1))<0,0,'Shooter Information'!$E$3-('Shooter Information'!$G$3-RANK(K33,K$4:K$78,1)))","v":0},0]
[31,{"$f":"'Shooter Information'!B36","v":0},{"$f":"'Shooter Information'!C36","v":0},null,null,null,null,null,null,null,0,{"$f":"IF('Shooter Information'!$E$3-('Shooter Information'!$G$3-RANK(K34,K$4:K$78,1))<0,0,'Shooter Information'!$E$3-('Shooter Information'!$G$3-RANK(K34,K$4:K$78,1)))","v":0},0]
[32,{"$f":"'Shooter Information'!B37","v":0},{"$f":"'Shooter Information'!C37","v":0},null,null,null,null,null,null,null,0,{"$f":"IF('Shooter Information'!$E$3-('Shooter Information'!$G$3-RANK(K35,K$4:K$78,1))<0,0,'Shooter Information'!$E$3-('Shooter Information'!$G$3-RANK(K35,K$4:K$78,1)))","v":0},0]
[33,{"$f":"'Shooter Information'!B38","v":0},{"$f":"'Shooter Information'!C38","v":0},null,null,null,null,null,null,null,0,{"$f":"IF('Shooter Information'!$E$3-('Shooter Information'!$G$3-RANK(K36,K$4:K$78,1))<0,0,'Shooter Information'!$E$3-('Shooter Information'!$G$3-RANK(K36,K$4:K$78,1)))","v":0},0]
[34,{"$f":"'Shooter Information'!B39","v":0},{"$f":"'Shooter Information'!C39","v":0},null,null,null,null,null,null,null,0,{"$f":"IF('Shooter Information'!$E$3-('Shooter Information'!$G$3-RANK(K37,K$4:K$78,1))<0,0,'Shooter Information'!$E$3-('Shooter Information'!$G$3-RANK(K37,K$4:K$78,1)))","v":0},0]
[35,{"$f":"'Shooter Information'!B40","v":0},{"$f":"'Shooter Information'!C40","v":0},null,null,null,null,null,null,null,0,{"$f":"IF('Shooter Information'!$E$3-('Shooter Information'!$G$3-RANK(K38,K$4:K$78,1))<0,0,'Shooter Information'!$E$3-('Shooter Information'!$G$3-RANK(K38,K$4:K$78,1)))","v":0},0]
[36,{"$f":"'Shooter Information'!B41","v":0},{"$f":"'Shooter Information'!C41","v":0},null,null,null,null,null,null,null,0,{"$f":"IF('Shooter Information'!$E$3-('Shooter Information'!$G$3-RANK(K39,K$4:K$78,1))<0,0,'Shooter Information'!$E$3-('Shooter Information'!$G$3-RANK(K39,K$4:K$78,1)))","v":0},0]
[37,{"$f":"'Shooter Information'!B42","v":0},{"$f":"'Shooter Information'!C42","v":0},null,null,null,null,null,null,null,0,{"$f":"IF('Shooter Information'!$E$3-('Shooter Information'!$G$3-RANK(K40,K$4:K$78,1))<0,0,'Shooter Information'!$E$3-('Shooter Information'!$G$3-RANK(K40,K$4:K$78,1)))","v":0},0]
[38,{"$f":"'Shooter Information'!B43","v":0},{"$f":"'Shooter Information'!C43","v":0},null,null,null,null,null,null,null,0,{"$f":"IF('Shooter Information'!$E$3-('Shooter Information'!$G$3-RANK(K41,K$4:K$78,1))<0,0,'Shooter Information'!$E$3-('Shooter Information'!$G$3-RANK(K41,K$4:K$78,1)))","v":0},0]
[39,{"$f":"'Shooter Information'!B44","v":0},{"$f":"'Shooter Information'!C44","v":0},null,null,null,null,null,null,null,0,{"$f":"IF('Shooter Information'!$E$3-('Shooter Information'!$G$3-RANK(K42,K$4:K$78,1))<0,0,'Shooter Information'!$E$3-('Shooter Information'!$G$3-RANK(K42,K$4:K$78,1)))","v":0},0]
[40,{"$f":"'Shooter Information'!B45","v":0},{"$f":"'Shooter Information'!C45","v":0},null,null,null,null,null,null,null,0,{"$f":"IF('Shooter Information'!$E$3-('Shooter Information'!$G$3-RANK(K43,K$4:K$78,1))<0,0,'Shooter Information'!$E$3-('Shooter Information'!$G$3-RANK(K43,K$4:K$78,1)))","v":0},0]
[41,{"$f":"'Shooter Information'!B46","v":0},{"$f":"'Shooter Information'!C46","v":0},null,null,null,null,null,null,null,0,{"$f":"IF('Shooter Information'!$E$3-('Shooter Information'!$G$3-RANK(K44,K$4:K$78,1))<0,0,'Shooter Information'!$E$3-('Shooter Information'!$G$3-RANK(K44,K$4:K$78,1)))","v":0},0]
[42,{"$f":"'Shooter Information'!B47","v":0},{"$f":"'Shooter Information'!C47","v":0},null,null,null,null,null,null,null,0,{"$f":"IF('Shooter Information'!$E$3-('Shooter Information'!$G$3-RANK(K45,K$4:K$78,1))<0,0,'Shooter Information'!$E$3-('Shooter Information'!$G$3-RANK(K45,K$4:K$78,1)))","v":0},0]
[43,{"$f":"'Shooter Information'!B48","v":0},{"$f":"'Shooter Information'!C48","v":0},null,null,null,null,null,null,null,0,{"$f":"IF('Shooter Information'!$E$3-('Shooter Information'!$G$3-RANK(K46,K$4:K$78,1))<0,0,'Shooter Information'!$E$3-('Shooter Information'!$G$3-RANK(K46,K$4:K$78,1)))","v":0},0]
[44,{"$f":"'Shooter Information'!B49","v":0},{"$f":"'Shooter Information'!C49","v":0},null,null,null,null,null,null,null,0,{"$f":"IF('Shooter Information'!$E$3-('Shooter Information'!$G$3-RANK(K47,K$4:K$78,1))<0,0,'Shooter Information'!$E$3-('Shooter Information'!$G$3-RANK(K47,K$4:K$78,1)))","v":0},0]
[45,{"$f":"'Shooter Information'!B50","v":0},{"$f":"'Shooter Information'!C50","v":0},null,null,null,null,null,null,null,0,{"$f":"IF('Shooter Information'!$E$3-('Shooter Information'!$G$3-RANK(K48,K$4:K$78,1))<0,0,'Shooter Information'!$E$3-('Shooter Information'!$G$3-RANK(K48,K$4:K$78,1)))","v":0},0]
[46,{"$f":"'Shooter Information'!B51","v":0},{"$f":"'Shooter Information'!C51","v":0},null,null,null,null,null,null,null,0,{"$f":"IF('Shooter Information'!$E$3-('Shooter Information'!$G$3-RANK(K49,K$4:K$78,1))<0,0,'Shooter Information'!$E$3-('Shooter Information'!$G$3-RANK(K49,K$4:K$78,1)))","v":0},0]
[47,{"$f":"'Shooter Information'!B52","v":0},{"$f":"'Shooter Information'!C52","v":0},null,null,null,null,null,null,null,0,{"$f":"IF('Shooter Information'!$E$3-('Shooter Information'!$G$3-RANK(K50,K$4:K$78,1))<0,0,'Shooter Information'!$E$3-('Shooter Information'!$G$3-RANK(K50,K$4:K$78,1)))","v":0},0]
[48,{"$f":"'Shooter Information'!B53","v":0},{"$f":"'Shooter Information'!C53","v":0},null,null,null,null,null,null,null,0,{"$f":"IF('Shooter Information'!$E$3-('Shooter Information'!$G$3-RANK(K51,K$4:K$78,1))<0,0,'Shooter Information'!$E$3-('Shooter Information'!$G$3-RANK(K51,K$4:K$78,1)))","v":0},0]
[49,{"$f":"'Shooter Information'!B54","v":0},{"$f":"'Shooter Information'!C54","v":0},null,null,null,null,null,null,null,0,{"$f":"IF('Shooter Information'!$E$3-('Shooter Information'!$G$3-RANK(K52,K$4:K$78,1))<0,0,'Shooter Information'!$E$3-('Shooter Information'!$G$3-RANK(K52,K$4:K$78,1)))","v":0},0]
[50,{"$f":"'Shooter Information'!B55","v":0},{"$f":"'Shooter Information'!C55","v":0},null,null,null,null,null,null,null,0,{"$f":"IF('Shooter Information'!$E$3-('Shooter Information'!$G$3-RANK(K53,K$4:K$78,1))<0,0,'Shooter Information'!$E$3-('Shooter Information'!$G$3-RANK(K53,K$4:K$78,1)))","v":0},0]
[51,{"$f":"'Shooter Information'!B56","v":0},{"$f":"'Shooter Information'!C56","v":0},null,null,null,null,null,null,null,0,{"$f":"IF('Shooter Information'!$E$3-('Shooter Information'!$G$3-RANK(K54,K$4:K$78,1))<0,0,'Shooter Information'!$E$3-('Shooter Information'!$G$3-RANK(K54,K$4:K$78,1)))","v":0},0]
[52,{"$f":"'Shooter Information'!B57","v":0},{"$f":"'Shooter Information'!C57","v":0},null,null,null,null,null,null,null,0,{"$f":"IF('Shooter Information'!$E$3-('Shooter Information'!$G$3-RANK(K55,K$4:K$78,1))<0,0,'Shooter Information'!$E$3-('Shooter Information'!$G$3-RANK(K55,K$4:K$78,1)))","v":0},0]
[53,{"$f":"'Shooter Information'!B58","v":0},{"$f":"'Shooter Information'!C58","v":0},null,null,null,null,null,null,null,0,{"$f":"IF('Shooter Information'!$E$3-('Shooter Information'!$G$3-RANK(K56,K$4:K$78,1))<0,0,'Shooter Information'!$E$3-('Shooter Information'!$G$3-RANK(K56,K$4:K$78,1)))","v":0},0]
[54,{"$f":"'Shooter Information'!B59","v":0},{"$f":"'Shooter Information'!C59","v":0},null,null,null,null,null,null,null,0,{"$f":"IF('Shooter Information'!$E$3-('Shooter Information'!$G$3-RANK(K57,K$4:K$78,1))<0,0,'Shooter Information'!$E$3-('Shooter Information'!$G$3-RANK(K57,K$4:K$78,1)))","v":0},0]
[55,{"$f":"'Shooter Information'!B60","v":0},{"$f":"'Shooter Information'!C60","v":0},null,null,null,null,null,null,null,0,{"$f":"IF('Shooter Information'!$E$3-('Shooter Information'!$G$3-RANK(K58,K$4:K$78,1))<0,0,'Shooter Information'!$E$3-('Shooter Information'!$G$3-RANK(K58,K$4:K$78,1)))","v":0},0]
[56,{"$f":"'Shooter Information'!B61","v":0},{"$f":"'Shooter Information'!C61","v":0},null,null,null,null,null,null,null,0,{"$f":"IF('Shooter Information'!$E$3-('Shooter Information'!$G$3-RANK(K59,K$4:K$78,1))<0,0,'Shooter Information'!$E$3-('Shooter Information'!$G$3-RANK(K59,K$4:K$78,1)))","v":0},0]
[57,{"$f":"'Shooter Information'!B62","v":0},{"$f":"'Shooter Information'!C62","v":0},null,null,null,null,null,null,null,0,{"$f":"IF('Shooter Information'!$E$3-('Shooter Information'!$G$3-RANK(K60,K$4:K$78,1))<0,0,'Shooter Information'!$E$3-('Shooter Information'!$G$3-RANK(K60,K$4:K$78,1)))","v":0},0]
[58,{"$f":"'Shooter Information'!B63","v":0},{"$f":"'Shooter Information'!C63","v":0},null,null,null,null,null,null,null,0,{"$f":"IF('Shooter Information'!$E$3-('Shooter Information'!$G$3-RANK(K61,K$4:K$78,1))<0,0,'Shooter Information'!$E$3-('Shooter Information'!$G$3-RANK(K61,K$4:K$78,1)))","v":0},0]
[59,{"$f":"'Shooter Information'!B64","v":0},{"$f":"'Shooter Information'!C64","v":0},null,null,null,null,null,null,null,0,{"$f":"IF('Shooter Information'!$E$3-('Shooter Information'!$G$3-RANK(K62,K$4:K$78,1))<0,0,'Shooter Information'!$E$3-('Shooter Information'!$G$3-RANK(K62,K$4:K$78,1)))","v":0},0]
[60,{"$f":"'Shooter Information'!B65","v":0},{"$f":"'Shooter Information'!C65","v":0},null,null,null,null,null,null,null,0,{"$f":"IF('Shooter Information'!$E$3-('Shooter Information'!$G$3-RANK(K63,K$4:K$78,1))<0,0,'Shooter Information'!$E$3-('Shooter Information'!$G$3-RANK(K63,K$4:K$78,1)))","v":0},0]
[61,{"$f":"'Shooter Information'!B66","v":0},{"$f":"'Shooter Information'!C66","v":0},null,null,null,null,null,null,null,{"$f":"(D64*5)+E64-F64+(G64*10)+(H64*30)+(I64*999)+(J64*999.99)","v":0},{"$f":"IF('Shooter Information'!$E$3-('Shooter Information'!$G$3-RANK(K64,K$4:K$78,1))<0,0,'Shooter Information'!$E$3-('Shooter Information'!$G$3-RANK(K64,K$4:K$78,1)))","v":0},{"$f":"(SUM(D64+G64+H64+I64+J64))","v":0}]
[62,{"$f":"'Shooter Information'!B67","v":0},{"$f":"'Shooter Information'!C67","v":0},null,null,null,null,null,null,null,{"$f":"(D65*5)+E65-F65+(G65*10)+(H65*30)+(I65*999)+(J65*999.99)","v":0},{"$f":"IF('Shooter Information'!$E$3-('Shooter Information'!$G$3-RANK(K65,K$4:K$78,1))<0,0,'Shooter Information'!$E$3-('Shooter Information'!$G$3-RANK(K65,K$4:K$78,1)))","v":0},{"$f":"(SUM(D65+G65+H65+I65+J65))","v":0}]
[63,{"$f":"'Shooter Information'!B68","v":0},{"$f":"'Shooter Information'!C68","v":0},null,null,null,null,null,null,null,0,{"$f":"IF('Shooter Information'!$E$3-('Shooter Information'!$G$3-RANK(K66,K$4:K$78,1))<0,0,'Shooter Information'!$E$3-('Shooter Information'!$G$3-RANK(K66,K$4:K$78,1)))","v":0},0]
[64,{"$f":"'Shooter Information'!B69","v":0},{"$f":"'Shooter Information'!C69","v":0},null,null,null,null,null,null,null,0,{"$f":"IF('Shooter Information'!$E$3-('Shooter Information'!$G$3-RANK(K67,K$4:K$78,1))<0,0,'Shooter Information'!$E$3-('Shooter Information'!$G$3-RANK(K67,K$4:K$78,1)))","v":0},0]
[65,{"$f":"'Shooter Information'!B70","v":0},{"$f":"'Shooter Information'!C70","v":0},null,null,null,null,null,null,null,0,{"$f":"IF('Shooter Information'!$E$3-('Shooter Information'!$G$3-RANK(K68,K$4:K$78,1))<0,0,'Shooter Information'!$E$3-('Shooter Information'!$G$3-RANK(K68,K$4:K$78,1)))","v":0},0]
[66,{"$f":"'Shooter Information'!B71","v":0},{"$f":"'Shooter Information'!C71","v":0},null,null,null,null,null,null,null,0,{"$f":"IF('Shooter Information'!$E$3-('Shooter Information'!$G$3-RANK(K69,K$4:K$78,1))<0,0,'Shooter Information'!$E$3-('Shooter Information'!$G$3-RANK(K69,K$4:K$78,1)))","v":0},0]
[67,{"$f":"'Shooter Information'!B72","v":0},{"$f":"'Shooter Information'!C72","v":0},null,null,null,null,null,null,null,0,{"$f":"IF('Shooter Information'!$E$3-('Shooter Information'!$G$3-RANK(K70,K$4:K$78,1))<0,0,'Shooter Information'!$E$3-('Shooter Information'!$G$3-RANK(K70,K$4:K$78,1)))","v":0},0]
[68,{"$f":"'Shooter Information'!B73","v":0},{"$f":"'Shooter Information'!C73","v":0},null,null,null,null,null,null,null,0,{"$f":"IF('Shooter Information'!$E$3-('Shooter Information'!$G$3-RANK(K71,K$4:K$78,1))<0,0,'Shooter Information'!$E$3-('Shooter Information'!$G$3-RANK(K71,K$4:K$78,1)))","v":0},0]
[69,{"$f":"'Shooter Information'!B74","v":0},{"$f":"'Shooter Information'!C74","v":0},null,null,null,null,null,null,null,0,{"$f":"IF('Shooter Information'!$E$3-('Shooter Information'!$G$3-RANK(K72,K$4:K$78,1))<0,0,'Shooter Information'!$E$3-('Shooter Information'!$G$3-RANK(K72,K$4:K$78,1)))","v":0},0]
[70,{"$f":"'Shooter Information'!B75","v":0},{"$f":"'Shooter Information'!C75","v":0},null,null,null,null,null,null,null,0,{"$f":"IF('Shooter Information'!$E$3-('Shooter Information'!$G$3-RANK(K73,K$4:K$78,1))<0,0,'Shooter Information'!$E$3-('Shooter Information'!$G$3-RANK(K73,K$4:K$78,1)))","v":0},0]
[71,{"$f":"'Shooter Information'!B76","v":0},{"$f":"'Shooter Information'!C76","v":0},null,null,null,null,null,null,null,0,{"$f":"IF('Shooter Information'!$E$3-('Shooter Information'!$G$3-RANK(K74,K$4:K$78,1))<0,0,'Shooter Information'!$E$3-('Shooter Information'!$G$3-RANK(K74,K$4:K$78,1)))","v":0},0]
[72,{"$f":"'Shooter Information'!B77","v":0},{"$f":"'Shooter Information'!C77","v":0},null,null,null,null,null,null,null,0,{"$f":"IF('Shooter Information'!$E$3-('Shooter Information'!$G$3-RANK(K75,K$4:K$78,1))<0,0,'Shooter Information'!$E$3-('Shooter Information'!$G$3-RANK(K75,K$4:K$78,1)))","v":0},0]
[73,{"$f":"'Shooter Information'!B78","v":0},{"$f":"'Shooter Information'!C78","v":0},null,null,null,null,null,null,null,0,{"$f":"IF('Shooter Information'!$E$3-('Shooter Information'!$G$3-RANK(K76,K$4:K$78,1))<0,0,'Shooter Information'!$E$3-('Shooter Information'!$G$3-RANK(K76,K$4:K$78,1)))","v":0},0]
[74,{"$f":"'Shooter Information'!B79","v":0},{"$f":"'Shooter Information'!C79","v":0},null,null,null,null,null,null,null,0,{"$f":"IF('Shooter Information'!$E$3-('Shooter Information'!$G$3-RANK(K77,K$4:K$78,1))<0,0,'Shooter Information'!$E$3-('Shooter Information'!$G$3-RANK(K77,K$4:K$78,1)))","v":0},0]
[75,{"$f":"'Shooter Information'!B80","v":0},{"$f":"'Shooter Information'!C80","v":0},null,null,null,null,null,null,null,{"$f":"(D78*5)+E78-F78+(G78*10)+(H78*30)+(I78*999)+(J78*999.99)","v":0},{"$f":"IF('Shooter Information'!$E$3-('Shooter Information'!$G$3-RANK(K78,K$4:K$78,1))<0,0,'Shooter Information'!$E$3-('Shooter Information'!$G$3-RANK(K78,K$4:K$78,1)))","v":0},{"$f":"(SUM(D78+G78+H78+I78+J78))","v":0}]

{"sheet":"Stage 2","index":2,"n_rows":78,"n_cols":13,"rows_kept":78,"cut":false,"hidden":false,"merged":[]}
[null,"CAS SCORE SHEET",null,"Date:",{"$f":"'Shooter Information'!$E$2","v":"Wednesday April 9th, 2014"}]
[null,"Stage 2"]
["Roster #","Shooter","Class","Misses","Raw Time","Bonus","10 Sec","30 Sec","DNF","DQ","Total","Rank","Penalties"]
[{"$f":"ROW()-3","v":1},{"$f":"'Shooter Information'!B6","v":"Striker"},{"$f":"'Shooter Information'!C6","v":0},null,27.22,null,null,null,null,null,{"$f":"(D4*5)+E4-F4+(G4*10)+(H4*30)+(I4*999)+(J4*999.99)","v":27.22},{"$f":"IF('Shooter Information'!$E$3-('Shooter Information'!$G$3-RANK(K4,K$4:K$78,1))<0,0,'Shooter Information'!$E$3-('Shooter Information'!$G$3-RANK(K4,K$4:K$78,1)))","v":1},{"$f":"(SUM(D4+G4+H4+I4+J4))","v":0}]
[{"$f":"ROW()-3","v":2},{"$f":"'Shooter Information'!B7","v":"Doc Deadwood"},{"$f":"'Shooter Information'!C7","v":0},1,41.81,null,null,null,null,null,{"$f":"(D5*5)+E5-F5+(G5*10)+(H5*30)+(I5*999)+(J5*999.99)","v":46.81},{"$f":"IF('Shooter Information'!$E$3-('Shooter Information'!$G$3-RANK(K5,K$4:K$78,1))<0,0,'Shooter Information'!$E$3-('Shooter Information'!$G$3-RANK(K5,K$4:K$78,1)))","v":4},{"$f":"(SUM(D5+G5+H5+I5+J5))","v":1}]
[3,{"$f":"'Shooter Information'!B8","v":"Cold Blue Mike"},{"$f":"'Shooter Information'!C8","v":0},null,31.3,null,null,null,null,null,31.3,{"$f":"IF('Shooter Information'!$E$3-('Shooter Information'!$G$3-RANK(K6,K$4:K$78,1))<0,0,'Shooter Information'!$E$3-('Shooter Information'!$G$3-RANK(K6,K$4:K$78,1)))","v":3},0]
[4,{"$f":"'Shooter Information'!B9","v":"B.S. Walker"},{"$f":"'Shooter Information'!C9","v":0},null,30.24,null,null,null,null,null,30.24,{"$f":"IF('Shooter Information'!$E$3-('Shooter Information'!$G$3-RANK(K7,K$4:K$78,1))<0,0,'Shooter Information'!$E$3-('Shooter Information'!$G$3-RANK(K7,K$4:K$78,1)))","v":2},0]
[5,{"$f":"'Shooter Information'!B10","v":0},{"$f":"'Shooter Information'!C10","v":0},null,null,null,null,null,null,null,0,{"$f":"IF('Shooter Information'!$E$3-('Shooter Information'!$G$3-RANK(K8,K$4:K$78,1))<0,0,'Shooter Information'!$E$3-('Shooter Information'!$G$3-RANK(K8,K$4:K$78,1)))","v":0},0]
[6,{"$f":"'Shooter Information'!B11","v":0},{"$f":"'Shooter Information'!C11","v":0},null,null,null,null,null,null,null,0,{"$f":"IF('Shooter Information'!$E$3-('Shooter Information'!$G$3-RANK(K9,K$4:K$78,1))<0,0,'Shooter Information'!$E$3-('Shooter Information'!$G$3-RANK(K9,K$4:K$78,1)))","v":0},0]
[7,{"$f":"'Shooter Information'!B12","v":0},{"$f":"'Shooter Information'!C12","v":0},null,null,null,null,null,null,null,0,{"$f":"IF('Shooter Information'!$E$3-('Shooter Information'!$G$3-RANK(K10,K$4:K$78,1))<0,0,'Shooter Information'!$E$3-('Shooter Information'!$G$3-RANK(K10,K$4:K$78,1)))","v":0},0]
[8,{"$f":"'Shooter Information'!B13","v":0},{"$f":"'Shooter Information'!C13","v":0},null,null,null,null,null,null,null,0,{"$f":"IF('Shooter Information'!$E$3-('Shooter Information'!$G$3-RANK(K11,K$4:K$78,1))<0,0,'Shooter Information'!$E$3-('Shooter Information'!$G$3-RANK(K11,K$4:K$78,1)))","v":0},0]
[9,{"$f":"'Shooter Information'!B14","v":0},{"$f":"'Shooter Information'!C14","v":0},null,null,null,null,null,null,null,0,{"$f":"IF('Shooter Information'!$E$3-('Shooter Information'!$G$3-RANK(K12,K$4:K$78,1))<0,0,'Shooter Information'!$E$3-('Shooter Information'!$G$3-RANK(K12,K$4:K$78,1)))","v":0},0]
[10,{"$f":"'Shooter Information'!B15","v":0},{"$f":"'Shooter Information'!C15","v":0},null,null,null,null,null,null,null,0,{"$f":"IF('Shooter Information'!$E$3-('Shooter Information'!$G$3-RANK(K13,K$4:K$78,1))<0,0,'Shooter Information'!$E$3-('Shooter Information'!$G$3-RANK(K13,K$4:K$78,1)))","v":0},0]
[11,{"$f":"'Shooter Information'!B16","v":0},{"$f":"'Shooter Information'!C16","v":0},null,null,null,null,null,null,null,0,{"$f":"IF('Shooter Information'!$E$3-('Shooter Information'!$G$3-RANK(K14,K$4:K$78,1))<0,0,'Shooter Information'!$E$3-('Shooter Information'!$G$3-RANK(K14,K$4:K$78,1)))","v":0},0]
[12,{"$f":"'Shooter Information'!B17","v":0},{"$f":"'Shooter Information'!C17","v":0},null,null,null,null,null,null,null,0,{"$f":"IF('Shooter Information'!$E$3-('Shooter Information'!$G$3-RANK(K15,K$4:K$78,1))<0,0,'Shooter Information'!$E$3-('Shooter Information'!$G$3-RANK(K15,K$4:K$78,1)))","v":0},0]
[13,{"$f":"'Shooter Information'!B18","v":0},{"$f":"'Shooter Information'!C18","v":0},null,null,null,null,null,null,null,0,{"$f":"IF('Shooter Information'!$E$3-('Shooter Information'!$G$3-RANK(K16,K$4:K$78,1))<0,0,'Shooter Information'!$E$3-('Shooter Information'!$G$3-RANK(K16,K$4:K$78,1)))","v":0},0]
[14,{"$f":"'Shooter Information'!B19","v":0},{"$f":"'Shooter Information'!C19","v":0},null,null,null,null,null,null,null,0,{"$f":"IF('Shooter Information'!$E$3-('Shooter Information'!$G$3-RANK(K17,K$4:K$78,1))<0,0,'Shooter Information'!$E$3-('Shooter Information'!$G$3-RANK(K17,K$4:K$78,1)))","v":0},0]
[15,{"$f":"'Shooter Information'!B20","v":0},{"$f":"'Shooter Information'!C20","v":0},null,null,null,null,null,null,null,0,{"$f":"IF('Shooter Information'!$E$3-('Shooter Information'!$G$3-RANK(K18,K$4:K$78,1))<0,0,'Shooter Information'!$E$3-('Shooter Information'!$G$3-RANK(K18,K$4:K$78,1)))","v":0},0]
[16,{"$f":"'Shooter Information'!B21","v":0},{"$f":"'Shooter Information'!C21","v":0},null,null,null,null,null,null,null,0,{"$f":"IF('Shooter Information'!$E$3-('Shooter Information'!$G$3-RANK(K19,K$4:K$78,1))<0,0,'Shooter Information'!$E$3-('Shooter Information'!$G$3-RANK(K19,K$4:K$78,1)))","v":0},0]
[17,{"$f":"'Shooter Information'!B22","v":0},{"$f":"'Shooter Information'!C22","v":0},null,null,null,null,null,null,null,0,{"$f":"IF('Shooter Information'!$E$3-('Shooter Information'!$G$3-RANK(K20,K$4:K$78,1))<0,0,'Shooter Information'!$E$3-('Shooter Information'!$G$3-RANK(K20,K$4:K$78,1)))","v":0},0]
[18,{"$f":"'Shooter Information'!B23","v":0},{"$f":"'Shooter Information'!C23","v":0},null,null,null,null,null,null,null,0,{"$f":"IF('Shooter Information'!$E$3-('Shooter Information'!$G$3-RANK(K21,K$4:K$78,1))<0,0,'Shooter Information'!$E$3-('Shooter Information'!$G$3-RANK(K21,K$4:K$78,1)))","v":0},0]
[19,{"$f":"'Shooter Information'!B24","v":0},{"$f":"'Shooter Information'!C24","v":0},null,null,null,null,null,null,null,0,{"$f":"IF('Shooter Information'!$E$3-('Shooter Information'!$G$3-RANK(K22,K$4:K$78,1))<0,0,'Shooter Information'!$E$3-('Shooter Information'!$G$3-RANK(K22,K$4:K$78,1)))","v":0},0]
[20,{"$f":"'Shooter Information'!B25","v":0},{"$f":"'Shooter Information'!C25","v":0},null,null,null,null,null,null,null,0,{"$f":"IF('Shooter Information'!$E$3-('Shooter Information'!$G$3-RANK(K23,K$4:K$78,1))<0,0,'Shooter Information'!$E$3-('Shooter Information'!$G$3-RANK(K23,K$4:K$78,1)))","v":0},0]
[21,{"$f":"'Shooter Information'!B26","v":0},{"$f":"'Shooter Information'!C26","v":0},null,null,null,null,null,null,null,0,{"$f":"IF('Shooter Information'!$E$3-('Shooter Information'!$G$3-RANK(K24,K$4:K$78,1))<0,0,'Shooter Information'!$E$3-('Shooter Information'!$G$3-RANK(K24,K$4:K$78,1)))","v":0},0]
[22,{"$f":"'Shooter Information'!B27","v":0},{"$f":"'Shooter Information'!C27","v":0},null,null,null,null,null,null,null,0,{"$f":"IF('Shooter Information'!$E$3-('Shooter Information'!$G$3-RANK(K25,K$4:K$78,1))<0,0,'Shooter Information'!$E$3-('Shooter Information'!$G$3-RANK(K25,K$4:K$78,1)))","v":0},0]
[23,{"$f":"'Shooter Information'!B28","v":0},{"$f":"'Shooter Information'!C28","v":0},null,null,null,null,null,null,null,0,{"$f":"IF('Shooter Information'!$E$3-('Shooter Information'!$G$3-RANK(K26,K$4:K$78,1))<0,0,'Shooter Information'!$E$3-('Shooter Information'!$G$3-RANK(K26,K$4:K$78,1)))","v":0},0]
[24,{"$f":"'Shooter Information'!B29","v":0},{"$f":"'Shooter Information'!C29","v":0},null,null,null,null,null,null,null,0,{"$f":"IF('Shooter Information'!$E$3-('Shooter Information'!$G$3-RANK(K27,K$4:K$78,1))<0,0,'Shooter Information'!$E$3-('Shooter Information'!$G$3-RANK(K27,K$4:K$78,1)))","v":0},0]
[25,{"$f":"'Shooter Information'!B30","v":0},{"$f":"'Shooter Information'!C30","v":0},null,null,null,null,null,null,null,0,{"$f":"IF('Shooter Information'!$E$3-('Shooter Information'!$G$3-RANK(K28,K$4:K$78,1))<0,0,'Shooter Information'!$E$3-('Shooter Information'!$G$3-RANK(K28,K$4:K$78,1)))","v":0},0]
[26,{"$f":"'Shooter Information'!B31","v":0},{"$f":"'Shooter Information'!C31","v":0},null,null,null,null,null,null,null,0,{"$f":"IF('Shooter Information'!$E$3-('Shooter Information'!$G$3-RANK(K29,K$4:K$78,1))<0,0,'Shooter Information'!$E$3-('Shooter Information'!$G$3-RANK(K29,K$4:K$78,1)))","v":0},0]
[27,{"$f":"'Shooter Information'!B32","v":0},{"$f":"'Shooter Information'!C32","v":0},null,null,null,null,null,null,null,0,{"$f":"IF('Shooter Information'!$E$3-('Shooter Information'!$G$3-RANK(K30,K$4:K$78,1))<0,0,'Shooter Information'!$E$3-('Shooter Information'!$G$3-RANK(K30,K$4:K$78,1)))","v":0},0]
[28,{"$f":"'Shooter Information'!B33","v":0},{"$f":"'Shooter Information'!C33","v":0},null,null,null,null,null,null,null,0,{"$f":"IF('Shooter Information'!$E$3-('Shooter Information'!$G$3-RANK(K31,K$4:K$78,1))<0,0,'Shooter Information'!$E$3-('Shooter Information'!$G$3-RANK(K31,K$4:K$78,1)))","v":0},0]
[29,{"$f":"'Shooter Information'!B34","v":0},{"$f":"'Shooter Information'!C34","v":0},null,null,null,null,null,null,null,0,{"$f":"IF('Shooter Information'!$E$3-('Shooter Information'!$G$3-RANK(K32,K$4:K$78,1))<0,0,'Shooter Information'!$E$3-('Shooter Information'!$G$3-RANK(K32,K$4:K$78,1)))","v":0},0]
[30,{"$f":"'Shooter Information'!B35","v":0},{"$f":"'Shooter Information'!C35","v":0},null,null,null,null,null,null,null,0,{"$f":"IF('Shooter Information'!$E$3-('Shooter Information'!$G$3-RANK(K33,K$4:K$78,1))<0,0,'Shooter Information'!$E$3-('Shooter Information'!$G$3-RANK(K33,K$4:K$78,1)))","v":0},0]
[31,{"$f":"'Shooter Information'!B36","v":0},{"$f":"'Shooter Information'!C36","v":0},null,null,null,null,null,null,null,0,{"$f":"IF('Shooter Information'!$E$3-('Shooter Information'!$G$3-RANK(K34,K$4:K$78,1))<0,0,'Shooter Information'!$E$3-('Shooter Information'!$G$3-RANK(K34,K$4:K$78,1)))","v":0},0]
[32,{"$f":"'Shooter Information'!B37","v":0},{"$f":"'Shooter Information'!C37","v":0},null,null,null,null,null,null,null,0,{"$f":"IF('Shooter Information'!$E$3-('Shooter Information'!$G$3-RANK(K35,K$4:K$78,1))<0,0,'Shooter Information'!$E$3-('Shooter Information'!$G$3-RANK(K35,K$4:K$78,1)))","v":0},0]
[33,{"$f":"'Shooter Information'!B38","v":0},{"$f":"'Shooter Information'!C38","v":0},null,null,null,null,null,null,null,0,{"$f":"IF('Shooter Information'!$E$3-('Shooter Information'!$G$3-RANK(K36,K$4:K$78,1))<0,0,'Shooter Information'!$E$3-('Shooter Information'!$G$3-RANK(K36,K$4:K$78,1)))","v":0},0]
[34,{"$f":"'Shooter Information'!B39","v":0},{"$f":"'Shooter Information'!C39","v":0},null,null,null,null,null,null,null,0,{"$f":"IF('Shooter Information'!$E$3-('Shooter Information'!$G$3-RANK(K37,K$4:K$78,1))<0,0,'Shooter Information'!$E$3-('Shooter Information'!$G$3-RANK(K37,K$4:K$78,1)))","v":0},0]
[35,{"$f":"'Shooter Information'!B40","v":0},{"$f":"'Shooter Information'!C40","v":0},null,null,null,null,null,null,null,0,{"$f":"IF('Shooter Information'!$E$3-('Shooter Information'!$G$3-RANK(K38,K$4:K$78,1))<0,0,'Shooter Information'!$E$3-('Shooter Information'!$G$3-RANK(K38,K$4:K$78,1)))","v":0},0]
[36,{"$f":"'Shooter Information'!B41","v":0},{"$f":"'Shooter Information'!C41","v":0},null,null,null,null,null,null,null,0,{"$f":"IF('Shooter Information'!$E$3-('Shooter Information'!$G$3-RANK(K39,K$4:K$78,1))<0,0,'Shooter Information'!$E$3-('Shooter Information'!$G$3-RANK(K39,K$4:K$78,1)))","v":0},0]
[37,{"$f":"'Shooter Information'!B42","v":0},{"$f":"'Shooter Information'!C42","v":0},null,null,null,null,null,null,null,0,{"$f":"IF('Shooter Information'!$E$3-('Shooter Information'!$G$3-RANK(K40,K$4:K$78,1))<0,0,'Shooter Information'!$E$3-('Shooter Information'!$G$3-RANK(K40,K$4:K$78,1)))","v":0},0]
[38,{"$f":"'Shooter Information'!B43","v":0},{"$f":"'Shooter Information'!C43","v":0},null,null,null,null,null,null,null,0,{"$f":"IF('Shooter Information'!$E$3-('Shooter Information'!$G$3-RANK(K41,K$4:K$78,1))<0,0,'Shooter Information'!$E$3-('Shooter Information'!$G$3-RANK(K41,K$4:K$78,1)))","v":0},0]
[39,{"$f":"'Shooter Information'!B44","v":0},{"$f":"'Shooter Information'!C44","v":0},null,null,null,null,null,null,null,0,{"$f":"IF('Shooter Information'!$E$3-('Shooter Information'!$G$3-RANK(K42,K$4:K$78,1))<0,0,'Shooter Information'!$E$3-('Shooter Information'!$G$3-RANK(K42,K$4:K$78,1)))","v":0},0]
[40,{"$f":"'Shooter Information'!B45","v":0},{"$f":"'Shooter Information'!C45","v":0},null,null,null,null,null,null,null,0,{"$f":"IF('Shooter Information'!$E$3-('Shooter Information'!$G$3-RANK(K43,K$4:K$78,1))<0,0,'Shooter Information'!$E$3-('Shooter Information'!$G$3-RANK(K43,K$4:K$78,1)))","v":0},0]
[41,{"$f":"'Shooter Information'!B46","v":0},{"$f":"'Shooter Information'!C46","v":0},null,null,null,null,null,null,null,0,{"$f":"IF('Shooter Information'!$E$3-('Shooter Information'!$G$3-RANK(K44,K$4:K$78,1))<0,0,'Shooter Information'!$E$3-('Shooter Information'!$G$3-RANK(K44,K$4:K$78,1)))","v":0},0]
[42,{"$f":"'Shooter Information'!B47","v":0},{"$f":"'Shooter Information'!C47","v":0},null,null,null,null,null,null,null,0,{"$f":"IF('Shooter Information'!$E$3-('Shooter Information'!$G$3-RANK(K45,K$4:K$78,1))<0,0,'Shooter Information'!$E$3-('Shooter Information'!$G$3-RANK(K45,K$4:K$78,1)))","v":0},0]
[43,{"$f":"'Shooter Information'!B48","v":0},{"$f":"'Shooter Information'!C48","v":0},null,null,null,null,null,null,null,0,{"$f":"IF('Shooter Information'!$E$3-('Shooter Information'!$G$3-RANK(K46,K$4:K$78,1))<0,0,'Shooter Information'!$E$3-('Shooter Information'!$G$3-RANK(K46,K$4:K$78,1)))","v":0},0]
[44,{"$f":"'Shooter Information'!B49","v":0},{"$f":"'Shooter Information'!C49","v":0},null,null,null,null,null,null,null,0,{"$f":"IF('Shooter Information'!$E$3-('Shooter Information'!$G$3-RANK(K47,K$4:K$78,1))<0,0,'Shooter Information'!$E$3-('Shooter Information'!$G$3-RANK(K47,K$4:K$78,1)))","v":0},0]
[45,{"$f":"'Shooter Information'!B50","v":0},{"$f":"'Shooter Information'!C50","v":0},null,null,null,null,null,null,null,0,{"$f":"IF('Shooter Information'!$E$3-('Shooter Information'!$G$3-RANK(K48,K$4:K$78,1))<0,0,'Shooter Information'!$E$3-('Shooter Information'!$G$3-RANK(K48,K$4:K$78,1)))","v":0},0]
[46,{"$f":"'Shooter Information'!B51","v":0},{"$f":"'Shooter Information'!C51","v":0},null,null,null,null,null,null,null,{"$f":"(D49*5)+E49-F49+(G49*10)+(H49*30)+(I49*999)+(J49*999.99)","v":0},{"$f":"IF('Shooter Information'!$E$3-('Shooter Information'!$G$3-RANK(K49,K$4:K$78,1))<0,0,'Shooter Information'!$E$3-('Shooter Information'!$G$3-RANK(K49,K$4:K$78,1)))","v":0},0]
[47,{"$f":"'Shooter Information'!B52","v":0},{"$f":"'Shooter Information'!C52","v":0},null,null,null,null,null,null,null,0,{"$f":"IF('Shooter Information'!$E$3-('Shooter Information'!$G$3-RANK(K50,K$4:K$78,1))<0,0,'Shooter Information'!$E$3-('Shooter Information'!$G$3-RANK(K50,K$4:K$78,1)))","v":0},0]
[48,{"$f":"'Shooter Information'!B53","v":0},{"$f":"'Shooter Information'!C53","v":0},null,null,null,null,null,null,null,0,{"$f":"IF('Shooter Information'!$E$3-('Shooter Information'!$G$3-RANK(K51,K$4:K$78,1))<0,0,'Shooter Information'!$E$3-('Shooter Information'!$G$3-RANK(K51,K$4:K$78,1)))","v":0},0]
[49,{"$f":"'Shooter Information'!B54","v":0},{"$f":"'Shooter Information'!C54","v":0},null,null,null,null,null,null,null,0,{"$f":"IF('Shooter Information'!$E$3-('Shooter Information'!$G$3-RANK(K52,K$4:K$78,1))<0,0,'Shooter Information'!$E$3-('Shooter Information'!$G$3-RANK(K52,K$4:K$78,1)))","v":0},0]
[50,{"$f":"'Shooter Information'!B55","v":0},{"$f":"'Shooter Information'!C55","v":0},null,null,null,null,null,null,null,0,{"$f":"IF('Shooter Information'!$E$3-('Shooter Information'!$G$3-RANK(K53,K$4:K$78,1))<0,0,'Shooter Information'!$E$3-('Shooter Information'!$G$3-RANK(K53,K$4:K$78,1)))","v":0},0]
[51,{"$f":"'Shooter Information'!B56","v":0},{"$f":"'Shooter Information'!C56","v":0},null,null,null,null,null,null,null,0,{"$f":"IF('Shooter Information'!$E$3-('Shooter Information'!$G$3-RANK(K54,K$4:K$78,1))<0,0,'Shooter Information'!$E$3-('Shooter Information'!$G$3-RANK(K54,K$4:K$78,1)))","v":0},0]
[52,{"$f":"'Shooter Information'!B57","v":0},{"$f":"'Shooter Information'!C57","v":0},null,null,null,null,null,null,null,0,{"$f":"IF('Shooter Information'!$E$3-('Shooter Information'!$G$3-RANK(K55,K$4:K$78,1))<0,0,'Shooter Information'!$E$3-('Shooter Information'!$G$3-RANK(K55,K$4:K$78,1)))","v":0},0]
[53,{"$f":"'Shooter Information'!B58","v":0},{"$f":"'Shooter Information'!C58","v":0},null,null,null,null,null,null,null,0,{"$f":"IF('Shooter Information'!$E$3-('Shooter Information'!$G$3-RANK(K56,K$4:K$78,1))<0,0,'Shooter Information'!$E$3-('Shooter Information'!$G$3-RANK(K56,K$4:K$78,1)))","v":0},0]
[54,{"$f":"'Shooter Information'!B59","v":0},{"$f":"'Shooter Information'!C59","v":0},null,null,null,null,null,null,null,0,{"$f":"IF('Shooter Information'!$E$3-('Shooter Information'!$G$3-RANK(K57,K$4:K$78,1))<0,0,'Shooter Information'!$E$3-('Shooter Information'!$G$3-RANK(K57,K$4:K$78,1)))","v":0},0]
[55,{"$f":"'Shooter Information'!B60","v":0},{"$f":"'Shooter Information'!C60","v":0},null,null,null,null,null,null,null,0,{"$f":"IF('Shooter Information'!$E$3-('Shooter Information'!$G$3-RANK(K58,K$4:K$78,1))<0,0,'Shooter Information'!$E$3-('Shooter Information'!$G$3-RANK(K58,K$4:K$78,1)))","v":0},0]
[56,{"$f":"'Shooter Information'!B61","v":0},{"$f":"'Shooter Information'!C61","v":0},null,null,null,null,null,null,null,0,{"$f":"IF('Shooter Information'!$E$3-('Shooter Information'!$G$3-RANK(K59,K$4:K$78,1))<0,0,'Shooter Information'!$E$3-('Shooter Information'!$G$3-RANK(K59,K$4:K$78,1)))","v":0},0]
[57,{"$f":"'Shooter Information'!B62","v":0},{"$f":"'Shooter Information'!C62","v":0},null,null,null,null,null,null,null,0,{"$f":"IF('Shooter Information'!$E$3-('Shooter Information'!$G$3-RANK(K60,K$4:K$78,1))<0,0,'Shooter Information'!$E$3-('Shooter Information'!$G$3-RANK(K60,K$4:K$78,1)))","v":0},0]
[58,{"$f":"'Shooter Information'!B63","v":0},{"$f":"'Shooter Information'!C63","v":0},null,null,null,null,null,null,null,0,{"$f":"IF('Shooter Information'!$E$3-('Shooter Information'!$G$3-RANK(K61,K$4:K$78,1))<0,0,'Shooter Information'!$E$3-('Shooter Information'!$G$3-RANK(K61,K$4:K$78,1)))","v":0},0]
[59,{"$f":"'Shooter Information'!B64","v":0},{"$f":"'Shooter Information'!C64","v":0},null,null,null,null,null,null,null,0,{"$f":"IF('Shooter Information'!$E$3-('Shooter Information'!$G$3-RANK(K62,K$4:K$78,1))<0,0,'Shooter Information'!$E$3-('Shooter Information'!$G$3-RANK(K62,K$4:K$78,1)))","v":0},0]
[60,{"$f":"'Shooter Information'!B65","v":0},{"$f":"'Shooter Information'!C65","v":0},null,null,null,null,null,null,null,0,{"$f":"IF('Shooter Information'!$E$3-('Shooter Information'!$G$3-RANK(K63,K$4:K$78,1))<0,0,'Shooter Information'!$E$3-('Shooter Information'!$G$3-RANK(K63,K$4:K$78,1)))","v":0},0]
[61,{"$f":"'Shooter Information'!B66","v":0},{"$f":"'Shooter Information'!C66","v":0},null,null,null,null,null,null,null,{"$f":"(D64*5)+E64-F64+(G64*10)+(H64*30)+(I64*999)+(J64*999.99)","v":0},{"$f":"IF('Shooter Information'!$E$3-('Shooter Information'!$G$3-RANK(K64,K$4:K$78,1))<0,0,'Shooter Information'!$E$3-('Shooter Information'!$G$3-RANK(K64,K$4:K$78,1)))","v":0},{"$f":"(SUM(D64+G64+H64+I64+J64))","v":0}]
[62,{"$f":"'Shooter Information'!B67","v":0},{"$f":"'Shooter Information'!C67","v":0},null,null,null,null,null,null,null,0,{"$f":"IF('Shooter Information'!$E$3-('Shooter Information'!$G$3-RANK(K65,K$4:K$78,1))<0,0,'Shooter Information'!$E$3-('Shooter Information'!$G$3-RANK(K65,K$4:K$78,1)))","v":0},0]
[63,{"$f":"'Shooter Information'!B68","v":0},{"$f":"'Shooter Information'!C68","v":0},null,null,null,null,null,null,null,0,{"$f":"IF('Shooter Information'!$E$3-('Shooter Information'!$G$3-RANK(K66,K$4:K$78,1))<0,0,'Shooter Information'!$E$3-('Shooter Information'!$G$3-RANK(K66,K$4:K$78,1)))","v":0},0]
[64,{"$f":"'Shooter Information'!B69","v":0},{"$f":"'Shooter Information'!C69","v":0},null,null,null,null,null,null,null,0,{"$f":"IF('Shooter Information'!$E$3-('Shooter Information'!$G$3-RANK(K67,K$4:K$78,1))<0,0,'Shooter Information'!$E$3-('Shooter Information'!$G$3-RANK(K67,K$4:K$78,1)))","v":0},0]
[65,{"$f":"'Shooter Information'!B70","v":0},{"$f":"'Shooter Information'!C70","v":0},null,null,null,null,null,null,null,0,{"$f":"IF('Shooter Information'!$E$3-('Shooter Information'!$G$3-RANK(K68,K$4:K$78,1))<0,0,'Shooter Information'!$E$3-('Shooter Information'!$G$3-RANK(K68,K$4:K$78,1)))","v":0},0]
[66,{"$f":"'Shooter Information'!B71","v":0},{"$f":"'Shooter Information'!C71","v":0},null,null,null,null,null,null,null,0,{"$f":"IF('Shooter Information'!$E$3-('Shooter Information'!$G$3-RANK(K69,K$4:K$78,1))<0,0,'Shooter Information'!$E$3-('Shooter Information'!$G$3-RANK(K69,K$4:K$78,1)))","v":0},0]
[67,{"$f":"'Shooter Information'!B72","v":0},{"$f":"'Shooter Information'!C72","v":0},null,null,null,null,null,null,null,0,{"$f":"IF('Shooter Information'!$E$3-('Shooter Information'!$G$3-RANK(K70,K$4:K$78,1))<0,0,'Shooter Information'!$E$3-('Shooter Information'!$G$3-RANK(K70,K$4:K$78,1)))","v":0},0]
[68,{"$f":"'Shooter Information'!B73","v":0},{"$f":"'Shooter Information'!C73","v":0},null,null,null,null,null,null,null,0,{"$f":"IF('Shooter Information'!$E$3-('Shooter Information'!$G$3-RANK(K71,K$4:K$78,1))<0,0,'Shooter Information'!$E$3-('Shooter Information'!$G$3-RANK(K71,K$4:K$78,1)))","v":0},0]
[69,{"$f":"'Shooter Information'!B74","v":0},{"$f":"'Shooter Information'!C74","v":0},null,null,null,null,null,null,null,0,{"$f":"IF('Shooter Information'!$E$3-('Shooter Information'!$G$3-RANK(K72,K$4:K$78,1))<0,0,'Shooter Information'!$E$3-('Shooter Information'!$G$3-RANK(K72,K$4:K$78,1)))","v":0},0]
[70,{"$f":"'Shooter Information'!B75","v":0},{"$f":"'Shooter Information'!C75","v":0},null,null,null,null,null,null,null,0,{"$f":"IF('Shooter Information'!$E$3-('Shooter Information'!$G$3-RANK(K73,K$4:K$78,1))<0,0,'Shooter Information'!$E$3-('Shooter Information'!$G$3-RANK(K73,K$4:K$78,1)))","v":0},0]
[71,{"$f":"'Shooter Information'!B76","v":0},{"$f":"'Shooter Information'!C76","v":0},null,null,null,null,null,null,null,0,{"$f":"IF('Shooter Information'!$E$3-('Shooter Information'!$G$3-RANK(K74,K$4:K$78,1))<0,0,'Shooter Information'!$E$3-('Shooter Information'!$G$3-RANK(K74,K$4:K$78,1)))","v":0},0]
[72,{"$f":"'Shooter Information'!B77","v":0},{"$f":"'Shooter Information'!C77","v":0},null,null,null,null,null,null,null,0,{"$f":"IF('Shooter Information'!$E$3-('Shooter Information'!$G$3-RANK(K75,K$4:K$78,1))<0,0,'Shooter Information'!$E$3-('Shooter Information'!$G$3-RANK(K75,K$4:K$78,1)))","v":0},0]
[73,{"$f":"'Shooter Information'!B78","v":0},{"$f":"'Shooter Information'!C78","v":0},null,null,null,null,null,null,null,0,{"$f":"IF('Shooter Information'!$E$3-('Shooter Information'!$G$3-RANK(K76,K$4:K$78,1))<0,0,'Shooter Information'!$E$3-('Shooter Information'!$G$3-RANK(K76,K$4:K$78,1)))","v":0},0]
[74,{"$f":"'Shooter Information'!B79","v":0},{"$f":"'Shooter Information'!C79","v":0},null,null,null,null,null,null,null,0,{"$f":"IF('Shooter Information'!$E$3-('Shooter Information'!$G$3-RANK(K77,K$4:K$78,1))<0,0,'Shooter Information'!$E$3-('Shooter Information'!$G$3-RANK(K77,K$4:K$78,1)))","v":0},0]
[75,{"$f":"'Shooter Information'!B80","v":0},{"$f":"'Shooter Information'!C80","v":0},null,null,null,null,null,null,null,0,{"$f":"IF('Shooter Information'!$E$3-('Shooter Information'!$G$3-RANK(K78,K$4:K$78,1))<0,0,'Shooter Information'!$E$3-('Shooter Information'!$G$3-RANK(K78,K$4:K$78,1)))","v":0},0]

{"sheet":"Stage 3","index":3,"n_rows":78,"n_cols":13,"rows_kept":78,"cut":false,"hidden":false,"merged":[]}
[null,"CAS SCORE SHEET",null,"Date:",{"$f":"'Shooter Information'!$E$2","v":"Wednesday April 9th, 2014"}]
[null,"Stage 3"]
["Roster #","Shooter","Class","Misses","Raw Time","Bonus","10 Sec","30 Sec","DNF","DQ","Total","Rank","Penalties"]
[{"$f":"ROW()-3","v":1},{"$f":"'Shooter Information'!B6","v":"Striker"},{"$f":"'Shooter Information'!C6","v":0},null,null,null,null,null,1,null,{"$f":"(D4*5)+E4-F4+(G4*10)+(H4*30)+(I4*999)+(J4*999.99)","v":999},{"$f":"IF('Shooter Information'!$E$3-('Shooter Information'!$G$3-RANK(K4,K$4:K$78,1))<0,0,'Shooter Information'!$E$3-('Shooter Information'!$G$3-RANK(K4,K$4:K$78,1)))","v":4},{"$f":"(SUM(D4+G4+H4+I4+J4))","v":1}]
[{"$f":"ROW()-3","v":2},{"$f":"'Shooter Information'!B7","v":"Doc Deadwood"},{"$f":"'Shooter Information'!C7","v":0},null,44.43,null,null,null,null,null,{"$f":"(D5*5)+E5-F5+(G5*10)+(H5*30)+(I5*999)+(J5*999.99)","v":44.43},{"$f":"IF('Shooter Information'!$E$3-('Shooter Information'!$G$3-RANK(K5,K$4:K$78,1))<0,0,'Shooter Information'!$E$3-('Shooter Information'!$G$3-RANK(K5,K$4:K$78,1)))","v":3},{"$f":"(SUM(D5+G5+H5+I5+J5))","v":0}]
[3,{"$f":"'Shooter Information'!B8","v":"Cold Blue Mike"},{"$f":"'Shooter Information'!C8","v":0},null,36.17,null,null,null,null,null,36.17,{"$f":"IF('Shooter Information'!$E$3-('Shooter Information'!$G$3-RANK(K6,K$4:K$78,1))<0,0,'Shooter Information'!$E$3-('Shooter Information'!$G$3-RANK(K6,K$4:K$78,1)))","v":2},0]
[4,{"$f":"'Shooter Information'!B9","v":"B.S. Walker"},{"$f":"'Shooter Information'!C9","v":0},null,29.59,null,null,null,null,null,29.59,{"$f":"IF('Shooter Information'!$E$3-('Shooter Information'!$G$3-RANK(K7,K$4:K$78,1))<0,0,'Shooter Information'!$E$3-('Shooter Information'!$G$3-RANK(K7,K$4:K$78,1)))","v":1},0]
[5,{"$f":"'Shooter Information'!B10","v":0},{"$f":"'Shooter Information'!C10","v":0},null,null,null,null,null,null,null,0,{"$f":"IF('Shooter Information'!$E$3-('Shooter Information'!$G$3-RANK(K8,K$4:K$78,1))<0,0,'Shooter Information'!$E$3-('Shooter Information'!$G$3-RANK(K8,K$4:K$78,1)))","v":0},0]
[6,{"$f":"'Shooter Information'!B11","v":0},{"$f":"'Shooter Information'!C11","v":0},null,null,null,null,null,null,null,0,{"$f":"IF('Shooter Information'!$E$3-('Shooter Information'!$G$3-RANK(K9,K$4:K$78,1))<0,0,'Shooter Information'!$E$3-('Shooter Information'!$G$3-RANK(K9,K$4:K$78,1)))","v":0},0]
[7,{"$f":"'Shooter Information'!B12","v":0},{"$f":"'Shooter Information'!C12","v":0},null,null,null,null,null,null,null,0,{"$f":"IF('Shooter Information'!$E$3-('Shooter Information'!$G$3-RANK(K10,K$4:K$78,1))<0,0,'Shooter Information'!$E$3-('Shooter Information'!$G$3-RANK(K10,K$4:K$78,1)))","v":0},0]
[8,{"$f":"'Shooter Information'!B13","v":0},{"$f":"'Shooter Information'!C13","v":0},null,null,null,null,null,null,null,0,{"$f":"IF('Shooter Information'!$E$3-('Shooter Information'!$G$3-RANK(K11,K$4:K$78,1))<0,0,'Shooter Information'!$E$3-('Shooter Information'!$G$3-RANK(K11,K$4:K$78,1)))","v":0},0]
[9,{"$f":"'Shooter Information'!B14","v":0},{"$f":"'Shooter Information'!C14","v":0},null,null,null,null,null,null,null,0,{"$f":"IF('Shooter Information'!$E$3-('Shooter Information'!$G$3-RANK(K12,K$4:K$78,1))<0,0,'Shooter Information'!$E$3-('Shooter Information'!$G$3-RANK(K12,K$4:K$78,1)))","v":0},0]
[10,{"$f":"'Shooter Information'!B15","v":0},{"$f":"'Shooter Information'!C15","v":0},null,null,null,null,null,null,null,0,{"$f":"IF('Shooter Information'!$E$3-('Shooter Information'!$G$3-RANK(K13,K$4:K$78,1))<0,0,'Shooter Information'!$E$3-('Shooter Information'!$G$3-RANK(K13,K$4:K$78,1)))","v":0},0]
[11,{"$f":"'Shooter Information'!B16","v":0},{"$f":"'Shooter Information'!C16","v":0},null,null,null,null,null,null,null,0,{"$f":"IF('Shooter Information'!$E$3-('Shooter Information'!$G$3-RANK(K14,K$4:K$78,1))<0,0,'Shooter Information'!$E$3-('Shooter Information'!$G$3-RANK(K14,K$4:K$78,1)))","v":0},0]
[12,{"$f":"'Shooter Information'!B17","v":0},{"$f":"'Shooter Information'!C17","v":0},null,null,null,null,null,null,null,0,{"$f":"IF('Shooter Information'!$E$3-('Shooter Information'!$G$3-RANK(K15,K$4:K$78,1))<0,0,'Shooter Information'!$E$3-('Shooter Information'!$G$3-RANK(K15,K$4:K$78,1)))","v":0},0]
[13,{"$f":"'Shooter Information'!B18","v":0},{"$f":"'Shooter Information'!C18","v":0},null,null,null,null,null,null,null,0,{"$f":"IF('Shooter Information'!$E$3-('Shooter Information'!$G$3-RANK(K16,K$4:K$78,1))<0,0,'Shooter Information'!$E$3-('Shooter Information'!$G$3-RANK(K16,K$4:K$78,1)))","v":0},0]
[14,{"$f":"'Shooter Information'!B19","v":0},{"$f":"'Shooter Information'!C19","v":0},null,null,null,null,null,null,null,0,{"$f":"IF('Shooter Information'!$E$3-('Shooter Information'!$G$3-RANK(K17,K$4:K$78,1))<0,0,'Shooter Information'!$E$3-('Shooter Information'!$G$3-RANK(K17,K$4:K$78,1)))","v":0},0]
[15,{"$f":"'Shooter Information'!B20","v":0},{"$f":"'Shooter Information'!C20","v":0},null,null,null,null,null,null,null,0,{"$f":"IF('Shooter Information'!$E$3-('Shooter Information'!$G$3-RANK(K18,K$4:K$78,1))<0,0,'Shooter Information'!$E$3-('Shooter Information'!$G$3-RANK(K18,K$4:K$78,1)))","v":0},0]
[16,{"$f":"'Shooter Information'!B21","v":0},{"$f":"'Shooter Information'!C21","v":0},null,null,null,null,null,null,null,0,{"$f":"IF('Shooter Information'!$E$3-('Shooter Information'!$G$3-RANK(K19,K$4:K$78,1))<0,0,'Shooter Information'!$E$3-('Shooter Information'!$G$3-RANK(K19,K$4:K$78,1)))","v":0},0]
[17,{"$f":"'Shooter Information'!B22","v":0},{"$f":"'Shooter Information'!C22","v":0},null,null,null,null,null,null,null,0,{"$f":"IF('Shooter Information'!$E$3-('Shooter Information'!$G$3-RANK(K20,K$4:K$78,1))<0,0,'Shooter Information'!$E$3-('Shooter Information'!$G$3-RANK(K20,K$4:K$78,1)))","v":0},0]
[18,{"$f":"'Shooter Information'!B23","v":0},{"$f":"'Shooter Information'!C23","v":0},null,null,null,null,null,null,null,0,{"$f":"IF('Shooter Information'!$E$3-('Shooter Information'!$G$3-RANK(K21,K$4:K$78,1))<0,0,'Shooter Information'!$E$3-('Shooter Information'!$G$3-RANK(K21,K$4:K$78,1)))","v":0},0]
[19,{"$f":"'Shooter Information'!B24","v":0},{"$f":"'Shooter Information'!C24","v":0},null,null,null,null,null,null,null,0,{"$f":"IF('Shooter Information'!$E$3-('Shooter Information'!$G$3-RANK(K22,K$4:K$78,1))<0,0,'Shooter Information'!$E$3-('Shooter Information'!$G$3-RANK(K22,K$4:K$78,1)))","v":0},0]
[20,{"$f":"'Shooter Information'!B25","v":0},{"$f":"'Shooter Information'!C25","v":0},null,null,null,null,null,null,null,0,{"$f":"IF('Shooter Information'!$E$3-('Shooter Information'!$G$3-RANK(K23,K$4:K$78,1))<0,0,'Shooter Information'!$E$3-('Shooter Information'!$G$3-RANK(K23,K$4:K$78,1)))","v":0},0]
[21,{"$f":"'Shooter Information'!B26","v":0},{"$f":"'Shooter Information'!C26","v":0},null,null,null,null,null,null,null,0,{"$f":"IF('Shooter Information'!$E$3-('Shooter Information'!$G$3-RANK(K24,K$4:K$78,1))<0,0,'Shooter Information'!$E$3-('Shooter Information'!$G$3-RANK(K24,K$4:K$78,1)))","v":0},0]
[22,{"$f":"'Shooter Information'!B27","v":0},{"$f":"'Shooter Information'!C27","v":0},null,null,null,null,null,null,null,0,{"$f":"IF('Shooter Information'!$E$3-('Shooter Information'!$G$3-RANK(K25,K$4:K$78,1))<0,0,'Shooter Information'!$E$3-('Shooter Information'!$G$3-RANK(K25,K$4:K$78,1)))","v":0},0]
[23,{"$f":"'Shooter Information'!B28","v":0},{"$f":"'Shooter Information'!C28","v":0},null,null,null,null,null,null,null,0,{"$f":"IF('Shooter Information'!$E$3-('Shooter Information'!$G$3-RANK(K26,K$4:K$78,1))<0,0,'Shooter Information'!$E$3-('Shooter Information'!$G$3-RANK(K26,K$4:K$78,1)))","v":0},0]
[24,{"$f":"'Shooter Information'!B29","v":0},{"$f":"'Shooter Information'!C29","v":0},null,null,null,null,null,null,null,0,{"$f":"IF('Shooter Information'!$E$3-('Shooter Information'!$G$3-RANK(K27,K$4:K$78,1))<0,0,'Shooter Information'!$E$3-('Shooter Information'!$G$3-RANK(K27,K$4:K$78,1)))","v":0},0]
[25,{"$f":"'Shooter Information'!B30","v":0},{"$f":"'Shooter Information'!C30","v":0},null,null,null,null,null,null,null,0,{"$f":"IF('Shooter Information'!$E$3-('Shooter Information'!$G$3-RANK(K28,K$4:K$78,1))<0,0,'Shooter Information'!$E$3-('Shooter Information'!$G$3-RANK(K28,K$4:K$78,1)))","v":0},0]
[26,{"$f":"'Shooter Information'!B31","v":0},{"$f":"'Shooter Information'!C31","v":0},null,null,null,null,null,null,null,0,{"$f":"IF('Shooter Information'!$E$3-('Shooter Information'!$G$3-RANK(K29,K$4:K$78,1))<0,0,'Shooter Information'!$E$3-('Shooter Information'!$G$3-RANK(K29,K$4:K$78,1)))","v":0},0]
[27,{"$f":"'Shooter Information'!B32","v":0},{"$f":"'Shooter Information'!C32","v":0},null,null,null,null,null,null,null,0,{"$f":"IF('Shooter Information'!$E$3-('Shooter Information'!$G$3-RANK(K30,K$4:K$78,1))<0,0,'Shooter Information'!$E$3-('Shooter Information'!$G$3-RANK(K30,K$4:K$78,1)))","v":0},0]
[28,{"$f":"'Shooter Information'!B33","v":0},{"$f":"'Shooter Information'!C33","v":0},null,null,null,null,null,null,null,0,{"$f":"IF('Shooter Information'!$E$3-('Shooter Information'!$G$3-RANK(K31,K$4:K$78,1))<0,0,'Shooter Information'!$E$3-('Shooter Information'!$G$3-RANK(K31,K$4:K$78,1)))","v":0},0]
[29,{"$f":"'Shooter Information'!B34","v":0},{"$f":"'Shooter Information'!C34","v":0},null,null,null,null,null,null,null,0,{"$f":"IF('Shooter Information'!$E$3-('Shooter Information'!$G$3-RANK(K32,K$4:K$78,1))<0,0,'Shooter Information'!$E$3-('Shooter Information'!$G$3-RANK(K32,K$4:K$78,1)))","v":0},0]
[30,{"$f":"'Shooter Information'!B35","v":0},{"$f":"'Shooter Information'!C35","v":0},null,null,null,null,null,null,null,0,{"$f":"IF('Shooter Information'!$E$3-('Shooter Information'!$G$3-RANK(K33,K$4:K$78,1))<0,0,'Shooter Information'!$E$3-('Shooter Information'!$G$3-RANK(K33,K$4:K$78,1)))","v":0},0]
[31,{"$f":"'Shooter Information'!B36","v":0},{"$f":"'Shooter Information'!C36","v":0},null,null,null,null,null,null,null,0,{"$f":"IF('Shooter Information'!$E$3-('Shooter Information'!$G$3-RANK(K34,K$4:K$78,1))<0,0,'Shooter Information'!$E$3-('Shooter Information'!$G$3-RANK(K34,K$4:K$78,1)))","v":0},0]
[32,{"$f":"'Shooter Information'!B37","v":0},{"$f":"'Shooter Information'!C37","v":0},null,null,null,null,null,null,null,0,{"$f":"IF('Shooter Information'!$E$3-('Shooter Information'!$G$3-RANK(K35,K$4:K$78,1))<0,0,'Shooter Information'!$E$3-('Shooter Information'!$G$3-RANK(K35,K$4:K$78,1)))","v":0},0]
[33,{"$f":"'Shooter Information'!B38","v":0},{"$f":"'Shooter Information'!C38","v":0},null,null,null,null,null,null,null,0,{"$f":"IF('Shooter Information'!$E$3-('Shooter Information'!$G$3-RANK(K36,K$4:K$78,1))<0,0,'Shooter Information'!$E$3-('Shooter Information'!$G$3-RANK(K36,K$4:K$78,1)))","v":0},0]
[34,{"$f":"'Shooter Information'!B39","v":0},{"$f":"'Shooter Information'!C39","v":0},null,null,null,null,null,null,null,0,{"$f":"IF('Shooter Information'!$E$3-('Shooter Information'!$G$3-RANK(K37,K$4:K$78,1))<0,0,'Shooter Information'!$E$3-('Shooter Information'!$G$3-RANK(K37,K$4:K$78,1)))","v":0},0]
[35,{"$f":"'Shooter Information'!B40","v":0},{"$f":"'Shooter Information'!C40","v":0},null,null,null,null,null,null,null,0,{"$f":"IF('Shooter Information'!$E$3-('Shooter Information'!$G$3-RANK(K38,K$4:K$78,1))<0,0,'Shooter Information'!$E$3-('Shooter Information'!$G$3-RANK(K38,K$4:K$78,1)))","v":0},0]
[36,{"$f":"'Shooter Information'!B41","v":0},{"$f":"'Shooter Information'!C41","v":0},null,null,null,null,null,null,null,0,{"$f":"IF('Shooter Information'!$E$3-('Shooter Information'!$G$3-RANK(K39,K$4:K$78,1))<0,0,'Shooter Information'!$E$3-('Shooter Information'!$G$3-RANK(K39,K$4:K$78,1)))","v":0},0]
[37,{"$f":"'Shooter Information'!B42","v":0},{"$f":"'Shooter Information'!C42","v":0},null,null,null,null,null,null,null,0,{"$f":"IF('Shooter Information'!$E$3-('Shooter Information'!$G$3-RANK(K40,K$4:K$78,1))<0,0,'Shooter Information'!$E$3-('Shooter Information'!$G$3-RANK(K40,K$4:K$78,1)))","v":0},0]
[38,{"$f":"'Shooter Information'!B43","v":0},{"$f":"'Shooter Information'!C43","v":0},null,null,null,null,null,null,null,0,{"$f":"IF('Shooter Information'!$E$3-('Shooter Information'!$G$3-RANK(K41,K$4:K$78,1))<0,0,'Shooter Information'!$E$3-('Shooter Information'!$G$3-RANK(K41,K$4:K$78,1)))","v":0},0]
[39,{"$f":"'Shooter Information'!B44","v":0},{"$f":"'Shooter Information'!C44","v":0},null,null,null,null,null,null,null,0,{"$f":"IF('Shooter Information'!$E$3-('Shooter Information'!$G$3-RANK(K42,K$4:K$78,1))<0,0,'Shooter Information'!$E$3-('Shooter Information'!$G$3-RANK(K42,K$4:K$78,1)))","v":0},0]
[40,{"$f":"'Shooter Information'!B45","v":0},{"$f":"'Shooter Information'!C45","v":0},null,null,null,null,null,null,null,0,{"$f":"IF('Shooter Information'!$E$3-('Shooter Information'!$G$3-RANK(K43,K$4:K$78,1))<0,0,'Shooter Information'!$E$3-('Shooter Information'!$G$3-RANK(K43,K$4:K$78,1)))","v":0},0]
[41,{"$f":"'Shooter Information'!B46","v":0},{"$f":"'Shooter Information'!C46","v":0},null,null,null,null,null,null,null,0,{"$f":"IF('Shooter Information'!$E$3-('Shooter Information'!$G$3-RANK(K44,K$4:K$78,1))<0,0,'Shooter Information'!$E$3-('Shooter Information'!$G$3-RANK(K44,K$4:K$78,1)))","v":0},0]
[42,{"$f":"'Shooter Information'!B47","v":0},{"$f":"'Shooter Information'!C47","v":0},null,null,null,null,null,null,null,0,{"$f":"IF('Shooter Information'!$E$3-('Shooter Information'!$G$3-RANK(K45,K$4:K$78,1))<0,0,'Shooter Information'!$E$3-('Shooter Information'!$G$3-RANK(K45,K$4:K$78,1)))","v":0},0]
[43,{"$f":"'Shooter Information'!B48","v":0},{"$f":"'Shooter Information'!C48","v":0},null,null,null,null,null,null,null,0,{"$f":"IF('Shooter Information'!$E$3-('Shooter Information'!$G$3-RANK(K46,K$4:K$78,1))<0,0,'Shooter Information'!$E$3-('Shooter Information'!$G$3-RANK(K46,K$4:K$78,1)))","v":0},0]
[44,{"$f":"'Shooter Information'!B49","v":0},{"$f":"'Shooter Information'!C49","v":0},null,null,null,null,null,null,null,0,{"$f":"IF('Shooter Information'!$E$3-('Shooter Information'!$G$3-RANK(K47,K$4:K$78,1))<0,0,'Shooter Information'!$E$3-('Shooter Information'!$G$3-RANK(K47,K$4:K$78,1)))","v":0},0]
[45,{"$f":"'Shooter Information'!B50","v":0},{"$f":"'Shooter Information'!C50","v":0},null,null,null,null,null,null,null,0,{"$f":"IF('Shooter Information'!$E$3-('Shooter Information'!$G$3-RANK(K48,K$4:K$78,1))<0,0,'Shooter Information'!$E$3-('Shooter Information'!$G$3-RANK(K48,K$4:K$78,1)))","v":0},0]
[46,{"$f":"'Shooter Information'!B51","v":0},{"$f":"'Shooter Information'!C51","v":0},null,null,null,null,null,null,null,{"$f":"(D49*5)+E49-F49+(G49*10)+(H49*30)+(I49*999)+(J49*999.99)","v":0},{"$f":"IF('Shooter Information'!$E$3-('Shooter Information'!$G$3-RANK(K49,K$4:K$78,1))<0,0,'Shooter Information'!$E$3-('Shooter Information'!$G$3-RANK(K49,K$4:K$78,1)))","v":0},0]
[47,{"$f":"'Shooter Information'!B52","v":0},{"$f":"'Shooter Information'!C52","v":0},null,null,null,null,null,null,null,0,{"$f":"IF('Shooter Information'!$E$3-('Shooter Information'!$G$3-RANK(K50,K$4:K$78,1))<0,0,'Shooter Information'!$E$3-('Shooter Information'!$G$3-RANK(K50,K$4:K$78,1)))","v":0},0]
[48,{"$f":"'Shooter Information'!B53","v":0},{"$f":"'Shooter Information'!C53","v":0},null,null,null,null,null,null,null,0,{"$f":"IF('Shooter Information'!$E$3-('Shooter Information'!$G$3-RANK(K51,K$4:K$78,1))<0,0,'Shooter Information'!$E$3-('Shooter Information'!$G$3-RANK(K51,K$4:K$78,1)))","v":0},0]
[49,{"$f":"'Shooter Information'!B54","v":0},{"$f":"'Shooter Information'!C54","v":0},null,null,null,null,null,null,null,0,{"$f":"IF('Shooter Information'!$E$3-('Shooter Information'!$G$3-RANK(K52,K$4:K$78,1))<0,0,'Shooter Information'!$E$3-('Shooter Information'!$G$3-RANK(K52,K$4:K$78,1)))","v":0},0]
[50,{"$f":"'Shooter Information'!B55","v":0},{"$f":"'Shooter Information'!C55","v":0},null,null,null,null,null,null,null,0,{"$f":"IF('Shooter Information'!$E$3-('Shooter Information'!$G$3-RANK(K53,K$4:K$78,1))<0,0,'Shooter Information'!$E$3-('Shooter Information'!$G$3-RANK(K53,K$4:K$78,1)))","v":0},0]
[51,{"$f":"'Shooter Information'!B56","v":0},{"$f":"'Shooter Information'!C56","v":0},null,null,null,null,null,null,null,0,{"$f":"IF('Shooter Information'!$E$3-('Shooter Information'!$G$3-RANK(K54,K$4:K$78,1))<0,0,'Shooter Information'!$E$3-('Shooter Information'!$G$3-RANK(K54,K$4:K$78,1)))","v":0},0]
[52,{"$f":"'Shooter Information'!B57","v":0},{"$f":"'Shooter Information'!C57","v":0},null,null,null,null,null,null,null,0,{"$f":"IF('Shooter Information'!$E$3-('Shooter Information'!$G$3-RANK(K55,K$4:K$78,1))<0,0,'Shooter Information'!$E$3-('Shooter Information'!$G$3-RANK(K55,K$4:K$78,1)))","v":0},0]
[53,{"$f":"'Shooter Information'!B58","v":0},{"$f":"'Shooter Information'!C58","v":0},null,null,null,null,null,null,null,0,{"$f":"IF('Shooter Information'!$E$3-('Shooter Information'!$G$3-RANK(K56,K$4:K$78,1))<0,0,'Shooter Information'!$E$3-('Shooter Information'!$G$3-RANK(K56,K$4:K$78,1)))","v":0},0]
[54,{"$f":"'Shooter Information'!B59","v":0},{"$f":"'Shooter Information'!C59","v":0},null,null,null,null,null,null,null,0,{"$f":"IF('Shooter Information'!$E$3-('Shooter Information'!$G$3-RANK(K57,K$4:K$78,1))<0,0,'Shooter Information'!$E$3-('Shooter Information'!$G$3-RANK(K57,K$4:K$78,1)))","v":0},0]
[55,{"$f":"'Shooter Information'!B60","v":0},{"$f":"'Shooter Information'!C60","v":0},null,null,null,null,null,null,null,0,{"$f":"IF('Shooter Information'!$E$3-('Shooter Information'!$G$3-RANK(K58,K$4:K$78,1))<0,0,'Shooter Information'!$E$3-('Shooter Information'!$G$3-RANK(K58,K$4:K$78,1)))","v":0},0]
[56,{"$f":"'Shooter Information'!B61","v":0},{"$f":"'Shooter Information'!C61","v":0},null,null,null,null,null,null,null,0,{"$f":"IF('Shooter Information'!$E$3-('Shooter Information'!$G$3-RANK(K59,K$4:K$78,1))<0,0,'Shooter Information'!$E$3-('Shooter Information'!$G$3-RANK(K59,K$4:K$78,1)))","v":0},0]
[57,{"$f":"'Shooter Information'!B62","v":0},{"$f":"'Shooter Information'!C62","v":0},null,null,null,null,null,null,null,0,{"$f":"IF('Shooter Information'!$E$3-('Shooter Information'!$G$3-RANK(K60,K$4:K$78,1))<0,0,'Shooter Information'!$E$3-('Shooter Information'!$G$3-RANK(K60,K$4:K$78,1)))","v":0},0]
[58,{"$f":"'Shooter Information'!B63","v":0},{"$f":"'Shooter Information'!C63","v":0},null,null,null,null,null,null,null,0,{"$f":"IF('Shooter Information'!$E$3-('Shooter Information'!$G$3-RANK(K61,K$4:K$78,1))<0,0,'Shooter Information'!$E$3-('Shooter Information'!$G$3-RANK(K61,K$4:K$78,1)))","v":0},0]
[59,{"$f":"'Shooter Information'!B64","v":0},{"$f":"'Shooter Information'!C64","v":0},null,null,null,null,null,null,null,0,{"$f":"IF('Shooter Information'!$E$3-('Shooter Information'!$G$3-RANK(K62,K$4:K$78,1))<0,0,'Shooter Information'!$E$3-('Shooter Information'!$G$3-RANK(K62,K$4:K$78,1)))","v":0},0]
[60,{"$f":"'Shooter Information'!B65","v":0},{"$f":"'Shooter Information'!C65","v":0},null,null,null,null,null,null,null,0,{"$f":"IF('Shooter Information'!$E$3-('Shooter Information'!$G$3-RANK(K63,K$4:K$78,1))<0,0,'Shooter Information'!$E$3-('Shooter Information'!$G$3-RANK(K63,K$4:K$78,1)))","v":0},0]
[61,{"$f":"'Shooter Information'!B66","v":0},{"$f":"'Shooter Information'!C66","v":0},null,null,null,null,null,null,null,{"$f":"(D64*5)+E64-F64+(G64*10)+(H64*30)+(I64*999)+(J64*999.99)","v":0},{"$f":"IF('Shooter Information'!$E$3-('Shooter Information'!$G$3-RANK(K64,K$4:K$78,1))<0,0,'Shooter Information'!$E$3-('Shooter Information'!$G$3-RANK(K64,K$4:K$78,1)))","v":0},{"$f":"(SUM(D64+G64+H64+I64+J64))","v":0}]
[62,{"$f":"'Shooter Information'!B67","v":0},{"$f":"'Shooter Information'!C67","v":0},null,null,null,null,null,null,null,0,{"$f":"IF('Shooter Information'!$E$3-('Shooter Information'!$G$3-RANK(K65,K$4:K$78,1))<0,0,'Shooter Information'!$E$3-('Shooter Information'!$G$3-RANK(K65,K$4:K$78,1)))","v":0},0]
[63,{"$f":"'Shooter Information'!B68","v":0},{"$f":"'Shooter Information'!C68","v":0},null,null,null,null,null,null,null,0,{"$f":"IF('Shooter Information'!$E$3-('Shooter Information'!$G$3-RANK(K66,K$4:K$78,1))<0,0,'Shooter Information'!$E$3-('Shooter Information'!$G$3-RANK(K66,K$4:K$78,1)))","v":0},0]
[64,{"$f":"'Shooter Information'!B69","v":0},{"$f":"'Shooter Information'!C69","v":0},null,null,null,null,null,null,null,0,{"$f":"IF('Shooter Information'!$E$3-('Shooter Information'!$G$3-RANK(K67,K$4:K$78,1))<0,0,'Shooter Information'!$E$3-('Shooter Information'!$G$3-RANK(K67,K$4:K$78,1)))","v":0},0]
[65,{"$f":"'Shooter Information'!B70","v":0},{"$f":"'Shooter Information'!C70","v":0},null,null,null,null,null,null,null,0,{"$f":"IF('Shooter Information'!$E$3-('Shooter Information'!$G$3-RANK(K68,K$4:K$78,1))<0,0,'Shooter Information'!$E$3-('Shooter Information'!$G$3-RANK(K68,K$4:K$78,1)))","v":0},0]
[66,{"$f":"'Shooter Information'!B71","v":0},{"$f":"'Shooter Information'!C71","v":0},null,null,null,null,null,null,null,0,{"$f":"IF('Shooter Information'!$E$3-('Shooter Information'!$G$3-RANK(K69,K$4:K$78,1))<0,0,'Shooter Information'!$E$3-('Shooter Information'!$G$3-RANK(K69,K$4:K$78,1)))","v":0},0]
[67,{"$f":"'Shooter Information'!B72","v":0},{"$f":"'Shooter Information'!C72","v":0},null,null,null,null,null,null,null,0,{"$f":"IF('Shooter Information'!$E$3-('Shooter Information'!$G$3-RANK(K70,K$4:K$78,1))<0,0,'Shooter Information'!$E$3-('Shooter Information'!$G$3-RANK(K70,K$4:K$78,1)))","v":0},0]
[68,{"$f":"'Shooter Information'!B73","v":0},{"$f":"'Shooter Information'!C73","v":0},null,null,null,null,null,null,null,0,{"$f":"IF('Shooter Information'!$E$3-('Shooter Information'!$G$3-RANK(K71,K$4:K$78,1))<0,0,'Shooter Information'!$E$3-('Shooter Information'!$G$3-RANK(K71,K$4:K$78,1)))","v":0},0]
[69,{"$f":"'Shooter Information'!B74","v":0},{"$f":"'Shooter Information'!C74","v":0},null,null,null,null,null,null,null,0,{"$f":"IF('Shooter Information'!$E$3-('Shooter Information'!$G$3-RANK(K72,K$4:K$78,1))<0,0,'Shooter Information'!$E$3-('Shooter Information'!$G$3-RANK(K72,K$4:K$78,1)))","v":0},0]
[70,{"$f":"'Shooter Information'!B75","v":0},{"$f":"'Shooter Information'!C75","v":0},null,null,null,null,null,null,null,0,{"$f":"IF('Shooter Information'!$E$3-('Shooter Information'!$G$3-RANK(K73,K$4:K$78,1))<0,0,'Shooter Information'!$E$3-('Shooter Information'!$G$3-RANK(K73,K$4:K$78,1)))","v":0},0]
[71,{"$f":"'Shooter Information'!B76","v":0},{"$f":"'Shooter Information'!C76","v":0},null,null,null,null,null,null,null,0,{"$f":"IF('Shooter Information'!$E$3-('Shooter Information'!$G$3-RANK(K74,K$4:K$78,1))<0,0,'Shooter Information'!$E$3-('Shooter Information'!$G$3-RANK(K74,K$4:K$78,1)))","v":0},0]
[72,{"$f":"'Shooter Information'!B77","v":0},{"$f":"'Shooter Information'!C77","v":0},null,null,null,null,null,null,null,0,{"$f":"IF('Shooter Information'!$E$3-('Shooter Information'!$G$3-RANK(K75,K$4:K$78,1))<0,0,'Shooter Information'!$E$3-('Shooter Information'!$G$3-RANK(K75,K$4:K$78,1)))","v":0},0]
[73,{"$f":"'Shooter Information'!B78","v":0},{"$f":"'Shooter Information'!C78","v":0},null,null,null,null,null,null,null,0,{"$f":"IF('Shooter Information'!$E$3-('Shooter Information'!$G$3-RANK(K76,K$4:K$78,1))<0,0,'Shooter Information'!$E$3-('Shooter Information'!$G$3-RANK(K76,K$4:K$78,1)))","v":0},0]
[74,{"$f":"'Shooter Information'!B79","v":0},{"$f":"'Shooter Information'!C79","v":0},null,null,null,null,null,null,null,0,{"$f":"IF('Shooter Information'!$E$3-('Shooter Information'!$G$3-RANK(K77,K$4:K$78,1))<0,0,'Shooter Information'!$E$3-('Shooter Information'!$G$3-RANK(K77,K$4:K$78,1)))","v":0},0]
[75,{"$f":"'Shooter Information'!B80","v":0},{"$f":"'Shooter Information'!C80","v":0},null,null,null,null,null,null,null,0,{"$f":"IF('Shooter Information'!$E$3-('Shooter Information'!$G$3-RANK(K78,K$4:K$78,1))<0,0,'Shooter Information'!$E$3-('Shooter Information'!$G$3-RANK(K78,K$4:K$78,1)))","v":0},0]

{"sheet":"Stage 4","index":4,"n_rows":78,"n_cols":13,"rows_kept":78,"cut":false,"hidden":false,"merged":[]}
[null,"CAS SCORE SHEET",null,"Date:",{"$f":"'Shooter Information'!$E$2","v":"Wednesday April 9th, 2014"}]
[null,"Stage 4"]
["Roster #","Shooter","Class","Misses","Raw Time","Bonus","10 Sec","30 Sec","DNF","DQ","Total","Rank","Penalties"]
[{"$f":"ROW()-3","v":1},{"$f":"'Shooter Information'!B6","v":"Striker"},{"$f":"'Shooter Information'!C6","v":0},null,null,null,null,null,1,null,{"$f":"(D4*5)+E4-F4+(G4*10)+(H4*30)+(I4*999)+(J4*999.99)","v":999},{"$f":"IF('Shooter Information'!$E$3-('Shooter Information'!$G$3-RANK(K4,K$4:K$78,1))<0,0,'Shooter Information'!$E$3-('Shooter Information'!$G$3-RANK(K4,K$4:K$78,1)))","v":4},{"$f":"(SUM(D4+G4+H4+I4+J4))","v":1}]
[{"$f":"ROW()-3","v":2},{"$f":"'Shooter Information'!B7","v":"Doc Deadwood"},{"$f":"'Shooter Information'!C7","v":0},null,41.76,null,null,null,null,null,{"$f":"(D5*5)+E5-F5+(G5*10)+(H5*30)+(I5*999)+(J5*999.99)","v":41.76},{"$f":"IF('Shooter Information'!$E$3-('Shooter Information'!$G$3-RANK(K5,K$4:K$78,1))<0,0,'Shooter Information'!$E$3-('Shooter Information'!$G$3-RANK(K5,K$4:K$78,1)))","v":3},{"$f":"(SUM(D5+G5+H5+I5+J5))","v":0}]
[3,{"$f":"'Shooter Information'!B8","v":"Cold Blue Mike"},{"$f":"'Shooter Information'!C8","v":0},null,38.81,null,null,null,null,null,38.81,{"$f":"IF('Shooter Information'!$E$3-('Shooter Information'!$G$3-RANK(K6,K$4:K$78,1))<0,0,'Shooter Information'!$E$3-('Shooter Information'!$G$3-RANK(K6,K$4:K$78,1)))","v":2},0]
[4,{"$f":"'Shooter Information'!B9","v":"B.S. Walker"},{"$f":"'Shooter Information'!C9","v":0},null,32.700000000000003,null,null,null,null,null,32.700000000000003,{"$f":"IF('Shooter Information'!$E$3-('Shooter Information'!$G$3-RANK(K7,K$4:K$78,1))<0,0,'Shooter Information'!$E$3-('Shooter Information'!$G$3-RANK(K7,K$4:K$78,1)))","v":1},0]
[5,{"$f":"'Shooter Information'!B10","v":0},{"$f":"'Shooter Information'!C10","v":0},null,null,null,null,null,null,null,0,{"$f":"IF('Shooter Information'!$E$3-('Shooter Information'!$G$3-RANK(K8,K$4:K$78,1))<0,0,'Shooter Information'!$E$3-('Shooter Information'!$G$3-RANK(K8,K$4:K$78,1)))","v":0},0]
[6,{"$f":"'Shooter Information'!B11","v":0},{"$f":"'Shooter Information'!C11","v":0},null,null,null,null,null,null,null,0,{"$f":"IF('Shooter Information'!$E$3-('Shooter Information'!$G$3-RANK(K9,K$4:K$78,1))<0,0,'Shooter Information'!$E$3-('Shooter Information'!$G$3-RANK(K9,K$4:K$78,1)))","v":0},0]
[7,{"$f":"'Shooter Information'!B12","v":0},{"$f":"'Shooter Information'!C12","v":0},null,null,null,null,null,null,null,0,{"$f":"IF('Shooter Information'!$E$3-('Shooter Information'!$G$3-RANK(K10,K$4:K$78,1))<0,0,'Shooter Information'!$E$3-('Shooter Information'!$G$3-RANK(K10,K$4:K$78,1)))","v":0},0]
[8,{"$f":"'Shooter Information'!B13","v":0},{"$f":"'Shooter Information'!C13","v":0},null,null,null,null,null,null,null,0,{"$f":"IF('Shooter Information'!$E$3-('Shooter Information'!$G$3-RANK(K11,K$4:K$78,1))<0,0,'Shooter Information'!$E$3-('Shooter Information'!$G$3-RANK(K11,K$4:K$78,1)))","v":0},0]
[9,{"$f":"'Shooter Information'!B14","v":0},{"$f":"'Shooter Information'!C14","v":0},null,null,null,null,null,null,null,0,{"$f":"IF('Shooter Information'!$E$3-('Shooter Information'!$G$3-RANK(K12,K$4:K$78,1))<0,0,'Shooter Information'!$E$3-('Shooter Information'!$G$3-RANK(K12,K$4:K$78,1)))","v":0},0]
[10,{"$f":"'Shooter Information'!B15","v":0},{"$f":"'Shooter Information'!C15","v":0},null,null,null,null,null,null,null,0,{"$f":"IF('Shooter Information'!$E$3-('Shooter Information'!$G$3-RANK(K13,K$4:K$78,1))<0,0,'Shooter Information'!$E$3-('Shooter Information'!$G$3-RANK(K13,K$4:K$78,1)))","v":0},0]
[11,{"$f":"'Shooter Information'!B16","v":0},{"$f":"'Shooter Information'!C16","v":0},null,null,null,null,null,null,null,0,{"$f":"IF('Shooter Information'!$E$3-('Shooter Information'!$G$3-RANK(K14,K$4:K$78,1))<0,0,'Shooter Information'!$E$3-('Shooter Information'!$G$3-RANK(K14,K$4:K$78,1)))","v":0},0]
[12,{"$f":"'Shooter Information'!B17","v":0},{"$f":"'Shooter Information'!C17","v":0},null,null,null,null,null,null,null,0,{"$f":"IF('Shooter Information'!$E$3-('Shooter Information'!$G$3-RANK(K15,K$4:K$78,1))<0,0,'Shooter Information'!$E$3-('Shooter Information'!$G$3-RANK(K15,K$4:K$78,1)))","v":0},0]
[13,{"$f":"'Shooter Information'!B18","v":0},{"$f":"'Shooter Information'!C18","v":0},null,null,null,null,null,null,null,0,{"$f":"IF('Shooter Information'!$E$3-('Shooter Information'!$G$3-RANK(K16,K$4:K$78,1))<0,0,'Shooter Information'!$E$3-('Shooter Information'!$G$3-RANK(K16,K$4:K$78,1)))","v":0},0]
[14,{"$f":"'Shooter Information'!B19","v":0},{"$f":"'Shooter Information'!C19","v":0},null,null,null,null,null,null,null,0,{"$f":"IF('Shooter Information'!$E$3-('Shooter Information'!$G$3-RANK(K17,K$4:K$78,1))<0,0,'Shooter Information'!$E$3-('Shooter Information'!$G$3-RANK(K17,K$4:K$78,1)))","v":0},0]
[15,{"$f":"'Shooter Information'!B20","v":0},{"$f":"'Shooter Information'!C20","v":0},null,null,null,null,null,null,null,0,{"$f":"IF('Shooter Information'!$E$3-('Shooter Information'!$G$3-RANK(K18,K$4:K$78,1))<0,0,'Shooter Information'!$E$3-('Shooter Information'!$G$3-RANK(K18,K$4:K$78,1)))","v":0},0]
[16,{"$f":"'Shooter Information'!B21","v":0},{"$f":"'Shooter Information'!C21","v":0},null,null,null,null,null,null,null,0,{"$f":"IF('Shooter Information'!$E$3-('Shooter Information'!$G$3-RANK(K19,K$4:K$78,1))<0,0,'Shooter Information'!$E$3-('Shooter Information'!$G$3-RANK(K19,K$4:K$78,1)))","v":0},0]
[17,{"$f":"'Shooter Information'!B22","v":0},{"$f":"'Shooter Information'!C22","v":0},null,null,null,null,null,null,null,0,{"$f":"IF('Shooter Information'!$E$3-('Shooter Information'!$G$3-RANK(K20,K$4:K$78,1))<0,0,'Shooter Information'!$E$3-('Shooter Information'!$G$3-RANK(K20,K$4:K$78,1)))","v":0},0]
[18,{"$f":"'Shooter Information'!B23","v":0},{"$f":"'Shooter Information'!C23","v":0},null,null,null,null,null,null,null,0,{"$f":"IF('Shooter Information'!$E$3-('Shooter Information'!$G$3-RANK(K21,K$4:K$78,1))<0,0,'Shooter Information'!$E$3-('Shooter Information'!$G$3-RANK(K21,K$4:K$78,1)))","v":0},0]
[19,{"$f":"'Shooter Information'!B24","v":0},{"$f":"'Shooter Information'!C24","v":0},null,null,null,null,null,null,null,0,{"$f":"IF('Shooter Information'!$E$3-('Shooter Information'!$G$3-RANK(K22,K$4:K$78,1))<0,0,'Shooter Information'!$E$3-('Shooter Information'!$G$3-RANK(K22,K$4:K$78,1)))","v":0},0]
[20,{"$f":"'Shooter Information'!B25","v":0},{"$f":"'Shooter Information'!C25","v":0},null,null,null,null,null,null,null,0,{"$f":"IF('Shooter Information'!$E$3-('Shooter Information'!$G$3-RANK(K23,K$4:K$78,1))<0,0,'Shooter Information'!$E$3-('Shooter Information'!$G$3-RANK(K23,K$4:K$78,1)))","v":0},0]
[21,{"$f":"'Shooter Information'!B26","v":0},{"$f":"'Shooter Information'!C26","v":0},null,null,null,null,null,null,null,0,{"$f":"IF('Shooter Information'!$E$3-('Shooter Information'!$G$3-RANK(K24,K$4:K$78,1))<0,0,'Shooter Information'!$E$3-('Shooter Information'!$G$3-RANK(K24,K$4:K$78,1)))","v":0},0]
[22,{"$f":"'Shooter Information'!B27","v":0},{"$f":"'Shooter Information'!C27","v":0},null,null,null,null,null,null,null,0,{"$f":"IF('Shooter Information'!$E$3-('Shooter Information'!$G$3-RANK(K25,K$4:K$78,1))<0,0,'Shooter Information'!$E$3-('Shooter Information'!$G$3-RANK(K25,K$4:K$78,1)))","v":0},0]
[23,{"$f":"'Shooter Information'!B28","v":0},{"$f":"'Shooter Information'!C28","v":0},null,null,null,null,null,null,null,0,{"$f":"IF('Shooter Information'!$E$3-('Shooter Information'!$G$3-RANK(K26,K$4:K$78,1))<0,0,'Shooter Information'!$E$3-('Shooter Information'!$G$3-RANK(K26,K$4:K$78,1)))","v":0},0]
[24,{"$f":"'Shooter Information'!B29","v":0},{"$f":"'Shooter Information'!C29","v":0},null,null,null,null,null,null,null,0,{"$f":"IF('Shooter Information'!$E$3-('Shooter Information'!$G$3-RANK(K27,K$4:K$78,1))<0,0,'Shooter Information'!$E$3-('Shooter Information'!$G$3-RANK(K27,K$4:K$78,1)))","v":0},0]
[25,{"$f":"'Shooter Information'!B30","v":0},{"$f":"'Shooter Information'!C30","v":0},null,null,null,null,null,null,null,0,{"$f":"IF('Shooter Information'!$E$3-('Shooter Information'!$G$3-RANK(K28,K$4:K$78,1))<0,0,'Shooter Information'!$E$3-('Shooter Information'!$G$3-RANK(K28,K$4:K$78,1)))","v":0},0]
[26,{"$f":"'Shooter Information'!B31","v":0},{"$f":"'Shooter Information'!C31","v":0},null,null,null,null,null,null,null,0,{"$f":"IF('Shooter Information'!$E$3-('Shooter Information'!$G$3-RANK(K29,K$4:K$78,1))<0,0,'Shooter Information'!$E$3-('Shooter Information'!$G$3-RANK(K29,K$4:K$78,1)))","v":0},0]
[27,{"$f":"'Shooter Information'!B32","v":0},{"$f":"'Shooter Information'!C32","v":0},null,null,null,null,null,null,null,0,{"$f":"IF('Shooter Information'!$E$3-('Shooter Information'!$G$3-RANK(K30,K$4:K$78,1))<0,0,'Shooter Information'!$E$3-('Shooter Information'!$G$3-RANK(K30,K$4:K$78,1)))","v":0},0]
[28,{"$f":"'Shooter Information'!B33","v":0},{"$f":"'Shooter Information'!C33","v":0},null,null,null,null,null,null,null,0,{"$f":"IF('Shooter Information'!$E$3-('Shooter Information'!$G$3-RANK(K31,K$4:K$78,1))<0,0,'Shooter Information'!$E$3-('Shooter Information'!$G$3-RANK(K31,K$4:K$78,1)))","v":0},0]
[29,{"$f":"'Shooter Information'!B34","v":0},{"$f":"'Shooter Information'!C34","v":0},null,null,null,null,null,null,null,0,{"$f":"IF('Shooter Information'!$E$3-('Shooter Information'!$G$3-RANK(K32,K$4:K$78,1))<0,0,'Shooter Information'!$E$3-('Shooter Information'!$G$3-RANK(K32,K$4:K$78,1)))","v":0},0]
[30,{"$f":"'Shooter Information'!B35","v":0},{"$f":"'Shooter Information'!C35","v":0},null,null,null,null,null,null,null,0,{"$f":"IF('Shooter Information'!$E$3-('Shooter Information'!$G$3-RANK(K33,K$4:K$78,1))<0,0,'Shooter Information'!$E$3-('Shooter Information'!$G$3-RANK(K33,K$4:K$78,1)))","v":0},0]
[31,{"$f":"'Shooter Information'!B36","v":0},{"$f":"'Shooter Information'!C36","v":0},null,null,null,null,null,null,null,0,{"$f":"IF('Shooter Information'!$E$3-('Shooter Information'!$G$3-RANK(K34,K$4:K$78,1))<0,0,'Shooter Information'!$E$3-('Shooter Information'!$G$3-RANK(K34,K$4:K$78,1)))","v":0},0]
[32,{"$f":"'Shooter Information'!B37","v":0},{"$f":"'Shooter Information'!C37","v":0},null,null,null,null,null,null,null,0,{"$f":"IF('Shooter Information'!$E$3-('Shooter Information'!$G$3-RANK(K35,K$4:K$78,1))<0,0,'Shooter Information'!$E$3-('Shooter Information'!$G$3-RANK(K35,K$4:K$78,1)))","v":0},0]
[33,{"$f":"'Shooter Information'!B38","v":0},{"$f":"'Shooter Information'!C38","v":0},null,null,null,null,null,null,null,0,{"$f":"IF('Shooter Information'!$E$3-('Shooter Information'!$G$3-RANK(K36,K$4:K$78,1))<0,0,'Shooter Information'!$E$3-('Shooter Information'!$G$3-RANK(K36,K$4:K$78,1)))","v":0},0]
[34,{"$f":"'Shooter Information'!B39","v":0},{"$f":"'Shooter Information'!C39","v":0},null,null,null,null,null,null,null,0,{"$f":"IF('Shooter Information'!$E$3-('Shooter Information'!$G$3-RANK(K37,K$4:K$78,1))<0,0,'Shooter Information'!$E$3-('Shooter Information'!$G$3-RANK(K37,K$4:K$78,1)))","v":0},0]
[35,{"$f":"'Shooter Information'!B40","v":0},{"$f":"'Shooter Information'!C40","v":0},null,null,null,null,null,null,null,0,{"$f":"IF('Shooter Information'!$E$3-('Shooter Information'!$G$3-RANK(K38,K$4:K$78,1))<0,0,'Shooter Information'!$E$3-('Shooter Information'!$G$3-RANK(K38,K$4:K$78,1)))","v":0},0]
[36,{"$f":"'Shooter Information'!B41","v":0},{"$f":"'Shooter Information'!C41","v":0},null,null,null,null,null,null,null,0,{"$f":"IF('Shooter Information'!$E$3-('Shooter Information'!$G$3-RANK(K39,K$4:K$78,1))<0,0,'Shooter Information'!$E$3-('Shooter Information'!$G$3-RANK(K39,K$4:K$78,1)))","v":0},0]
[37,{"$f":"'Shooter Information'!B42","v":0},{"$f":"'Shooter Information'!C42","v":0},null,null,null,null,null,null,null,0,{"$f":"IF('Shooter Information'!$E$3-('Shooter Information'!$G$3-RANK(K40,K$4:K$78,1))<0,0,'Shooter Information'!$E$3-('Shooter Information'!$G$3-RANK(K40,K$4:K$78,1)))","v":0},0]
[38,{"$f":"'Shooter Information'!B43","v":0},{"$f":"'Shooter Information'!C43","v":0},null,null,null,null,null,null,null,0,{"$f":"IF('Shooter Information'!$E$3-('Shooter Information'!$G$3-RANK(K41,K$4:K$78,1))<0,0,'Shooter Information'!$E$3-('Shooter Information'!$G$3-RANK(K41,K$4:K$78,1)))","v":0},0]
[39,{"$f":"'Shooter Information'!B44","v":0},{"$f":"'Shooter Information'!C44","v":0},null,null,null,null,null,null,null,0,{"$f":"IF('Shooter Information'!$E$3-('Shooter Information'!$G$3-RANK(K42,K$4:K$78,1))<0,0,'Shooter Information'!$E$3-('Shooter Information'!$G$3-RANK(K42,K$4:K$78,1)))","v":0},0]
[40,{"$f":"'Shooter Information'!B45","v":0},{"$f":"'Shooter Information'!C45","v":0},null,null,null,null,null,null,null,0,{"$f":"IF('Shooter Information'!$E$3-('Shooter Information'!$G$3-RANK(K43,K$4:K$78,1))<0,0,'Shooter Information'!$E$3-('Shooter Information'!$G$3-RANK(K43,K$4:K$78,1)))","v":0},0]
[41,{"$f":"'Shooter Information'!B46","v":0},{"$f":"'Shooter Information'!C46","v":0},null,null,null,null,null,null,null,0,{"$f":"IF('Shooter Information'!$E$3-('Shooter Information'!$G$3-RANK(K44,K$4:K$78,1))<0,0,'Shooter Information'!$E$3-('Shooter Information'!$G$3-RANK(K44,K$4:K$78,1)))","v":0},0]
[42,{"$f":"'Shooter Information'!B47","v":0},{"$f":"'Shooter Information'!C47","v":0},null,null,null,null,null,null,null,0,{"$f":"IF('Shooter Information'!$E$3-('Shooter Information'!$G$3-RANK(K45,K$4:K$78,1))<0,0,'Shooter Information'!$E$3-('Shooter Information'!$G$3-RANK(K45,K$4:K$78,1)))","v":0},0]
[43,{"$f":"'Shooter Information'!B48","v":0},{"$f":"'Shooter Information'!C48","v":0},null,null,null,null,null,null,null,0,{"$f":"IF('Shooter Information'!$E$3-('Shooter Information'!$G$3-RANK(K46,K$4:K$78,1))<0,0,'Shooter Information'!$E$3-('Shooter Information'!$G$3-RANK(K46,K$4:K$78,1)))","v":0},0]
[44,{"$f":"'Shooter Information'!B49","v":0},{"$f":"'Shooter Information'!C49","v":0},null,null,null,null,null,null,null,0,{"$f":"IF('Shooter Information'!$E$3-('Shooter Information'!$G$3-RANK(K47,K$4:K$78,1))<0,0,'Shooter Information'!$E$3-('Shooter Information'!$G$3-RANK(K47,K$4:K$78,1)))","v":0},0]
[45,{"$f":"'Shooter Information'!B50","v":0},{"$f":"'Shooter Information'!C50","v":0},null,null,null,null,null,null,null,0,{"$f":"IF('Shooter Information'!$E$3-('Shooter Information'!$G$3-RANK(K48,K$4:K$78,1))<0,0,'Shooter Information'!$E$3-('Shooter Information'!$G$3-RANK(K48,K$4:K$78,1)))","v":0},0]
[46,{"$f":"'Shooter Information'!B51","v":0},{"$f":"'Shooter Information'!C51","v":0},null,null,null,null,null,null,null,{"$f":"(D49*5)+E49-F49+(G49*10)+(H49*30)+(I49*999)+(J49*999.99)","v":0},{"$f":"IF('Shooter Information'!$E$3-('Shooter Information'!$G$3-RANK(K49,K$4:K$78,1))<0,0,'Shooter Information'!$E$3-('Shooter Information'!$G$3-RANK(K49,K$4:K$78,1)))","v":0},0]
[47,{"$f":"'Shooter Information'!B52","v":0},{"$f":"'Shooter Information'!C52","v":0},null,null,null,null,null,null,null,0,{"$f":"IF('Shooter Information'!$E$3-('Shooter Information'!$G$3-RANK(K50,K$4:K$78,1))<0,0,'Shooter Information'!$E$3-('Shooter Information'!$G$3-RANK(K50,K$4:K$78,1)))","v":0},0]
[48,{"$f":"'Shooter Information'!B53","v":0},{"$f":"'Shooter Information'!C53","v":0},null,null,null,null,null,null,null,0,{"$f":"IF('Shooter Information'!$E$3-('Shooter Information'!$G$3-RANK(K51,K$4:K$78,1))<0,0,'Shooter Information'!$E$3-('Shooter Information'!$G$3-RANK(K51,K$4:K$78,1)))","v":0},0]
[49,{"$f":"'Shooter Information'!B54","v":0},{"$f":"'Shooter Information'!C54","v":0},null,null,null,null,null,null,null,0,{"$f":"IF('Shooter Information'!$E$3-('Shooter Information'!$G$3-RANK(K52,K$4:K$78,1))<0,0,'Shooter Information'!$E$3-('Shooter Information'!$G$3-RANK(K52,K$4:K$78,1)))","v":0},0]
[50,{"$f":"'Shooter Information'!B55","v":0},{"$f":"'Shooter Information'!C55","v":0},null,null,null,null,null,null,null,0,{"$f":"IF('Shooter Information'!$E$3-('Shooter Information'!$G$3-RANK(K53,K$4:K$78,1))<0,0,'Shooter Information'!$E$3-('Shooter Information'!$G$3-RANK(K53,K$4:K$78,1)))","v":0},0]
[51,{"$f":"'Shooter Information'!B56","v":0},{"$f":"'Shooter Information'!C56","v":0},null,null,null,null,null,null,null,0,{"$f":"IF('Shooter Information'!$E$3-('Shooter Information'!$G$3-RANK(K54,K$4:K$78,1))<0,0,'Shooter Information'!$E$3-('Shooter Information'!$G$3-RANK(K54,K$4:K$78,1)))","v":0},0]
[52,{"$f":"'Shooter Information'!B57","v":0},{"$f":"'Shooter Information'!C57","v":0},null,null,null,null,null,null,null,0,{"$f":"IF('Shooter Information'!$E$3-('Shooter Information'!$G$3-RANK(K55,K$4:K$78,1))<0,0,'Shooter Information'!$E$3-('Shooter Information'!$G$3-RANK(K55,K$4:K$78,1)))","v":0},0]
[53,{"$f":"'Shooter Information'!B58","v":0},{"$f":"'Shooter Information'!C58","v":0},null,null,null,null,null,null,null,0,{"$f":"IF('Shooter Information'!$E$3-('Shooter Information'!$G$3-RANK(K56,K$4:K$78,1))<0,0,'Shooter Information'!$E$3-('Shooter Information'!$G$3-RANK(K56,K$4:K$78,1)))","v":0},0]
[54,{"$f":"'Shooter Information'!B59","v":0},{"$f":"'Shooter Information'!C59","v":0},null,null,null,null,null,null,null,0,{"$f":"IF('Shooter Information'!$E$3-('Shooter Information'!$G$3-RANK(K57,K$4:K$78,1))<0,0,'Shooter Information'!$E$3-('Shooter Information'!$G$3-RANK(K57,K$4:K$78,1)))","v":0},0]
[55,{"$f":"'Shooter Information'!B60","v":0},{"$f":"'Shooter Information'!C60","v":0},null,null,null,null,null,null,null,0,{"$f":"IF('Shooter Information'!$E$3-('Shooter Information'!$G$3-RANK(K58,K$4:K$78,1))<0,0,'Shooter Information'!$E$3-('Shooter Information'!$G$3-RANK(K58,K$4:K$78,1)))","v":0},0]
[56,{"$f":"'Shooter Information'!B61","v":0},{"$f":"'Shooter Information'!C61","v":0},null,null,null,null,null,null,null,0,{"$f":"IF('Shooter Information'!$E$3-('Shooter Information'!$G$3-RANK(K59,K$4:K$78,1))<0,0,'Shooter Information'!$E$3-('Shooter Information'!$G$3-RANK(K59,K$4:K$78,1)))","v":0},0]
[57,{"$f":"'Shooter Information'!B62","v":0},{"$f":"'Shooter Information'!C62","v":0},null,null,null,null,null,null,null,0,{"$f":"IF('Shooter Information'!$E$3-('Shooter Information'!$G$3-RANK(K60,K$4:K$78,1))<0,0,'Shooter Information'!$E$3-('Shooter Information'!$G$3-RANK(K60,K$4:K$78,1)))","v":0},0]
[58,{"$f":"'Shooter Information'!B63","v":0},{"$f":"'Shooter Information'!C63","v":0},null,null,null,null,null,null,null,0,{"$f":"IF('Shooter Information'!$E$3-('Shooter Information'!$G$3-RANK(K61,K$4:K$78,1))<0,0,'Shooter Information'!$E$3-('Shooter Information'!$G$3-RANK(K61,K$4:K$78,1)))","v":0},0]
[59,{"$f":"'Shooter Information'!B64","v":0},{"$f":"'Shooter Information'!C64","v":0},null,null,null,null,null,null,null,0,{"$f":"IF('Shooter Information'!$E$3-('Shooter Information'!$G$3-RANK(K62,K$4:K$78,1))<0,0,'Shooter Information'!$E$3-('Shooter Information'!$G$3-RANK(K62,K$4:K$78,1)))","v":0},0]
[60,{"$f":"'Shooter Information'!B65","v":0},{"$f":"'Shooter Information'!C65","v":0},null,null,null,null,null,null,null,0,{"$f":"IF('Shooter Information'!$E$3-('Shooter Information'!$G$3-RANK(K63,K$4:K$78,1))<0,0,'Shooter Information'!$E$3-('Shooter Information'!$G$3-RANK(K63,K$4:K$78,1)))","v":0},0]
[61,{"$f":"'Shooter Information'!B66","v":0},{"$f":"'Shooter Information'!C66","v":0},null,null,null,null,null,null,null,{"$f":"(D64*5)+E64-F64+(G64*10)+(H64*30)+(I64*999)+(J64*999.99)","v":0},{"$f":"IF('Shooter Information'!$E$3-('Shooter Information'!$G$3-RANK(K64,K$4:K$78,1))<0,0,'Shooter Information'!$E$3-('Shooter Information'!$G$3-RANK(K64,K$4:K$78,1)))","v":0},{"$f":"(SUM(D64+G64+H64+I64+J64))","v":0}]
[62,{"$f":"'Shooter Information'!B67","v":0},{"$f":"'Shooter Information'!C67","v":0},null,null,null,null,null,null,null,0,{"$f":"IF('Shooter Information'!$E$3-('Shooter Information'!$G$3-RANK(K65,K$4:K$78,1))<0,0,'Shooter Information'!$E$3-('Shooter Information'!$G$3-RANK(K65,K$4:K$78,1)))","v":0},0]
[63,{"$f":"'Shooter Information'!B68","v":0},{"$f":"'Shooter Information'!C68","v":0},null,null,null,null,null,null,null,0,{"$f":"IF('Shooter Information'!$E$3-('Shooter Information'!$G$3-RANK(K66,K$4:K$78,1))<0,0,'Shooter Information'!$E$3-('Shooter Information'!$G$3-RANK(K66,K$4:K$78,1)))","v":0},0]
[64,{"$f":"'Shooter Information'!B69","v":0},{"$f":"'Shooter Information'!C69","v":0},null,null,null,null,null,null,null,0,{"$f":"IF('Shooter Information'!$E$3-('Shooter Information'!$G$3-RANK(K67,K$4:K$78,1))<0,0,'Shooter Information'!$E$3-('Shooter Information'!$G$3-RANK(K67,K$4:K$78,1)))","v":0},0]
[65,{"$f":"'Shooter Information'!B70","v":0},{"$f":"'Shooter Information'!C70","v":0},null,null,null,null,null,null,null,0,{"$f":"IF('Shooter Information'!$E$3-('Shooter Information'!$G$3-RANK(K68,K$4:K$78,1))<0,0,'Shooter Information'!$E$3-('Shooter Information'!$G$3-RANK(K68,K$4:K$78,1)))","v":0},0]
[66,{"$f":"'Shooter Information'!B71","v":0},{"$f":"'Shooter Information'!C71","v":0},null,null,null,null,null,null,null,0,{"$f":"IF('Shooter Information'!$E$3-('Shooter Information'!$G$3-RANK(K69,K$4:K$78,1))<0,0,'Shooter Information'!$E$3-('Shooter Information'!$G$3-RANK(K69,K$4:K$78,1)))","v":0},0]
[67,{"$f":"'Shooter Information'!B72","v":0},{"$f":"'Shooter Information'!C72","v":0},null,null,null,null,null,null,null,0,{"$f":"IF('Shooter Information'!$E$3-('Shooter Information'!$G$3-RANK(K70,K$4:K$78,1))<0,0,'Shooter Information'!$E$3-('Shooter Information'!$G$3-RANK(K70,K$4:K$78,1)))","v":0},0]
[68,{"$f":"'Shooter Information'!B73","v":0},{"$f":"'Shooter Information'!C73","v":0},null,null,null,null,null,null,null,0,{"$f":"IF('Shooter Information'!$E$3-('Shooter Information'!$G$3-RANK(K71,K$4:K$78,1))<0,0,'Shooter Information'!$E$3-('Shooter Information'!$G$3-RANK(K71,K$4:K$78,1)))","v":0},0]
[69,{"$f":"'Shooter Information'!B74","v":0},{"$f":"'Shooter Information'!C74","v":0},null,null,null,null,null,null,null,0,{"$f":"IF('Shooter Information'!$E$3-('Shooter Information'!$G$3-RANK(K72,K$4:K$78,1))<0,0,'Shooter Information'!$E$3-('Shooter Information'!$G$3-RANK(K72,K$4:K$78,1)))","v":0},0]
[70,{"$f":"'Shooter Information'!B75","v":0},{"$f":"'Shooter Information'!C75","v":0},null,null,null,null,null,null,null,0,{"$f":"IF('Shooter Information'!$E$3-('Shooter Information'!$G$3-RANK(K73,K$4:K$78,1))<0,0,'Shooter Information'!$E$3-('Shooter Information'!$G$3-RANK(K73,K$4:K$78,1)))","v":0},0]
[71,{"$f":"'Shooter Information'!B76","v":0},{"$f":"'Shooter Information'!C76","v":0},null,null,null,null,null,null,null,0,{"$f":"IF('Shooter Information'!$E$3-('Shooter Information'!$G$3-RANK(K74,K$4:K$78,1))<0,0,'Shooter Information'!$E$3-('Shooter Information'!$G$3-RANK(K74,K$4:K$78,1)))","v":0},0]
[72,{"$f":"'Shooter Information'!B77","v":0},{"$f":"'Shooter Information'!C77","v":0},null,null,null,null,null,null,null,0,{"$f":"IF('Shooter Information'!$E$3-('Shooter Information'!$G$3-RANK(K75,K$4:K$78,1))<0,0,'Shooter Information'!$E$3-('Shooter Information'!$G$3-RANK(K75,K$4:K$78,1)))","v":0},0]
[73,{"$f":"'Shooter Information'!B78","v":0},{"$f":"'Shooter Information'!C78","v":0},null,null,null,null,null,null,null,0,{"$f":"IF('Shooter Information'!$E$3-('Shooter Information'!$G$3-RANK(K76,K$4:K$78,1))<0,0,'Shooter Information'!$E$3-('Shooter Information'!$G$3-RANK(K76,K$4:K$78,1)))","v":0},0]
[74,{"$f":"'Shooter Information'!B79","v":0},{"$f":"'Shooter Information'!C79","v":0},null,null,null,null,null,null,null,0,{"$f":"IF('Shooter Information'!$E$3-('Shooter Information'!$G$3-RANK(K77,K$4:K$78,1))<0,0,'Shooter Information'!$E$3-('Shooter Information'!$G$3-RANK(K77,K$4:K$78,1)))","v":0},0]
[75,{"$f":"'Shooter Information'!B80","v":0},{"$f":"'Shooter Information'!C80","v":0},null,null,null,null,null,null,null,0,{"$f":"IF('Shooter Information'!$E$3-('Shooter Information'!$G$3-RANK(K78,K$4:K$78,1))<0,0,'Shooter Information'!$E$3-('Shooter Information'!$G$3-RANK(K78,K$4:K$78,1)))","v":0},0]

{"sheet":"Stage 5","index":5,"n_rows":78,"n_cols":13,"rows_kept":78,"cut":false,"hidden":false,"merged":[]}
[null,"CAS SCORE SHEET",null,"Date:",{"$f":"'Shooter Information'!$E$2","v":"Wednesday April 9th, 2014"}]
[null,"Stage 5"]
["Roster #","Shooter","Class","Misses","Raw Time","Bonus","10 Sec","30 Sec","DNF","DQ","Total","Rank","Penalties"]
[{"$f":"ROW()-3","v":1},{"$f":"'Shooter Information'!B6","v":"Striker"},{"$f":"'Shooter Information'!C6","v":0},null,null,null,null,null,1,null,{"$f":"(D4*5)+E4-F4+(G4*10)+(H4*30)+(I4*999)+(J4*999.99)","v":999},{"$f":"IF('Shooter Information'!$E$3-('Shooter Information'!$G$3-RANK(K4,K$4:K$78,1))<0,0,'Shooter Information'!$E$3-('Shooter Information'!$G$3-RANK(K4,K$4:K$78,1)))","v":4},{"$f":"(SUM(D4+G4+H4+I4+J4))","v":1}]
[{"$f":"ROW()-3","v":2},{"$f":"'Shooter Information'!B7","v":"Doc Deadwood"},{"$f":"'Shooter Information'!C7","v":0},1,55.11,null,null,null,null,null,{"$f":"(D5*5)+E5-F5+(G5*10)+(H5*30)+(I5*999)+(J5*999.99)","v":60.11},{"$f":"IF('Shooter Information'!$E$3-('Shooter Information'!$G$3-RANK(K5,K$4:K$78,1))<0,0,'Shooter Information'!$E$3-('Shooter Information'!$G$3-RANK(K5,K$4:K$78,1)))","v":3},{"$f":"(SUM(D5+G5+H5+I5+J5))","v":1}]
[3,{"$f":"'Shooter Information'!B8","v":"Cold Blue Mike"},{"$f":"'Shooter Information'!C8","v":0},1,30.9,null,null,null,null,null,35.9,{"$f":"IF('Shooter Information'!$E$3-('Shooter Information'!$G$3-RANK(K6,K$4:K$78,1))<0,0,'Shooter Information'!$E$3-('Shooter Information'!$G$3-RANK(K6,K$4:K$78,1)))","v":1},1]
[4,{"$f":"'Shooter Information'!B9","v":"B.S. Walker"},{"$f":"'Shooter Information'!C9","v":0},1,33.89,null,null,null,null,null,38.89,{"$f":"IF('Shooter Information'!$E$3-('Shooter Information'!$G$3-RANK(K7,K$4:K$78,1))<0,0,'Shooter Information'!$E$3-('Shooter Information'!$G$3-RANK(K7,K$4:K$78,1)))","v":2},1]
[5,{"$f":"'Shooter Information'!B10","v":0},{"$f":"'Shooter Information'!C10","v":0},null,null,null,null,null,null,null,0,{"$f":"IF('Shooter Information'!$E$3-('Shooter Information'!$G$3-RANK(K8,K$4:K$78,1))<0,0,'Shooter Information'!$E$3-('Shooter Information'!$G$3-RANK(K8,K$4:K$78,1)))","v":0},0]
[6,{"$f":"'Shooter Information'!B11","v":0},{"$f":"'Shooter Information'!C11","v":0},null,null,null,null,null,null,null,0,{"$f":"IF('Shooter Information'!$E$3-('Shooter Information'!$G$3-RANK(K9,K$4:K$78,1))<0,0,'Shooter Information'!$E$3-('Shooter Information'!$G$3-RANK(K9,K$4:K$78,1)))","v":0},0]
[7,{"$f":"'Shooter Information'!B12","v":0},{"$f":"'Shooter Information'!C12","v":0},null,null,null,null,null,null,null,0,{"$f":"IF('Shooter Information'!$E$3-('Shooter Information'!$G$3-RANK(K10,K$4:K$78,1))<0,0,'Shooter Information'!$E$3-('Shooter Information'!$G$3-RANK(K10,K$4:K$78,1)))","v":0},0]
[8,{"$f":"'Shooter Information'!B13","v":0},{"$f":"'Shooter Information'!C13","v":0},null,null,null,null,null,null,null,0,{"$f":"IF('Shooter Information'!$E$3-('Shooter Information'!$G$3-RANK(K11,K$4:K$78,1))<0,0,'Shooter Information'!$E$3-('Shooter Information'!$G$3-RANK(K11,K$4:K$78,1)))","v":0},0]
[9,{"$f":"'Shooter Information'!B14","v":0},{"$f":"'Shooter Information'!C14","v":0},null,null,null,null,null,null,null,0,{"$f":"IF('Shooter Information'!$E$3-('Shooter Information'!$G$3-RANK(K12,K$4:K$78,1))<0,0,'Shooter Information'!$E$3-('Shooter Information'!$G$3-RANK(K12,K$4:K$78,1)))","v":0},0]
[10,{"$f":"'Shooter Information'!B15","v":0},{"$f":"'Shooter Information'!C15","v":0},null,null,null,null,null,null,null,0,{"$f":"IF('Shooter Information'!$E$3-('Shooter Information'!$G$3-RANK(K13,K$4:K$78,1))<0,0,'Shooter Information'!$E$3-('Shooter Information'!$G$3-RANK(K13,K$4:K$78,1)))","v":0},0]
[11,{"$f":"'Shooter Information'!B16","v":0},{"$f":"'Shooter Information'!C16","v":0},null,null,null,null,null,null,null,0,{"$f":"IF('Shooter Information'!$E$3-('Shooter Information'!$G$3-RANK(K14,K$4:K$78,1))<0,0,'Shooter Information'!$E$3-('Shooter Information'!$G$3-RANK(K14,K$4:K$78,1)))","v":0},0]
[12,{"$f":"'Shooter Information'!B17","v":0},{"$f":"'Shooter Information'!C17","v":0},null,null,null,null,null,null,null,0,{"$f":"IF('Shooter Information'!$E$3-('Shooter Information'!$G$3-RANK(K15,K$4:K$78,1))<0,0,'Shooter Information'!$E$3-('Shooter Information'!$G$3-RANK(K15,K$4:K$78,1)))","v":0},0]
[13,{"$f":"'Shooter Information'!B18","v":0},{"$f":"'Shooter Information'!C18","v":0},null,null,null,null,null,null,null,0,{"$f":"IF('Shooter Information'!$E$3-('Shooter Information'!$G$3-RANK(K16,K$4:K$78,1))<0,0,'Shooter Information'!$E$3-('Shooter Information'!$G$3-RANK(K16,K$4:K$78,1)))","v":0},0]
[14,{"$f":"'Shooter Information'!B19","v":0},{"$f":"'Shooter Information'!C19","v":0},null,null,null,null,null,null,null,0,{"$f":"IF('Shooter Information'!$E$3-('Shooter Information'!$G$3-RANK(K17,K$4:K$78,1))<0,0,'Shooter Information'!$E$3-('Shooter Information'!$G$3-RANK(K17,K$4:K$78,1)))","v":0},0]
[15,{"$f":"'Shooter Information'!B20","v":0},{"$f":"'Shooter Information'!C20","v":0},null,null,null,null,null,null,null,0,{"$f":"IF('Shooter Information'!$E$3-('Shooter Information'!$G$3-RANK(K18,K$4:K$78,1))<0,0,'Shooter Information'!$E$3-('Shooter Information'!$G$3-RANK(K18,K$4:K$78,1)))","v":0},0]
[16,{"$f":"'Shooter Information'!B21","v":0},{"$f":"'Shooter Information'!C21","v":0},null,null,null,null,null,null,null,0,{"$f":"IF('Shooter Information'!$E$3-('Shooter Information'!$G$3-RANK(K19,K$4:K$78,1))<0,0,'Shooter Information'!$E$3-('Shooter Information'!$G$3-RANK(K19,K$4:K$78,1)))","v":0},0]
[17,{"$f":"'Shooter Information'!B22","v":0},{"$f":"'Shooter Information'!C22","v":0},null,null,null,null,null,null,null,0,{"$f":"IF('Shooter Information'!$E$3-('Shooter Information'!$G$3-RANK(K20,K$4:K$78,1))<0,0,'Shooter Information'!$E$3-('Shooter Information'!$G$3-RANK(K20,K$4:K$78,1)))","v":0},0]
[18,{"$f":"'Shooter Information'!B23","v":0},{"$f":"'Shooter Information'!C23","v":0},null,null,null,null,null,null,null,0,{"$f":"IF('Shooter Information'!$E$3-('Shooter Information'!$G$3-RANK(K21,K$4:K$78,1))<0,0,'Shooter Information'!$E$3-('Shooter Information'!$G$3-RANK(K21,K$4:K$78,1)))","v":0},0]
[19,{"$f":"'Shooter Information'!B24","v":0},{"$f":"'Shooter Information'!C24","v":0},null,null,null,null,null,null,null,0,{"$f":"IF('Shooter Information'!$E$3-('Shooter Information'!$G$3-RANK(K22,K$4:K$78,1))<0,0,'Shooter Information'!$E$3-('Shooter Information'!$G$3-RANK(K22,K$4:K$78,1)))","v":0},0]
[20,{"$f":"'Shooter Information'!B25","v":0},{"$f":"'Shooter Information'!C25","v":0},null,null,null,null,null,null,null,0,{"$f":"IF('Shooter Information'!$E$3-('Shooter Information'!$G$3-RANK(K23,K$4:K$78,1))<0,0,'Shooter Information'!$E$3-('Shooter Information'!$G$3-RANK(K23,K$4:K$78,1)))","v":0},0]
[21,{"$f":"'Shooter Information'!B26","v":0},{"$f":"'Shooter Information'!C26","v":0},null,null,null,null,null,null,null,0,{"$f":"IF('Shooter Information'!$E$3-('Shooter Information'!$G$3-RANK(K24,K$4:K$78,1))<0,0,'Shooter Information'!$E$3-('Shooter Information'!$G$3-RANK(K24,K$4:K$78,1)))","v":0},0]
[22,{"$f":"'Shooter Information'!B27","v":0},{"$f":"'Shooter Information'!C27","v":0},null,null,null,null,null,null,null,0,{"$f":"IF('Shooter Information'!$E$3-('Shooter Information'!$G$3-RANK(K25,K$4:K$78,1))<0,0,'Shooter Information'!$E$3-('Shooter Information'!$G$3-RANK(K25,K$4:K$78,1)))","v":0},0]
[23,{"$f":"'Shooter Information'!B28","v":0},{"$f":"'Shooter Information'!C28","v":0},null,null,null,null,null,null,null,0,{"$f":"IF('Shooter Information'!$E$3-('Shooter Information'!$G$3-RANK(K26,K$4:K$78,1))<0,0,'Shooter Information'!$E$3-('Shooter Information'!$G$3-RANK(K26,K$4:K$78,1)))","v":0},0]
[24,{"$f":"'Shooter Information'!B29","v":0},{"$f":"'Shooter Information'!C29","v":0},null,null,null,null,null,null,null,0,{"$f":"IF('Shooter Information'!$E$3-('Shooter Information'!$G$3-RANK(K27,K$4:K$78,1))<0,0,'Shooter Information'!$E$3-('Shooter Information'!$G$3-RANK(K27,K$4:K$78,1)))","v":0},0]
[25,{"$f":"'Shooter Information'!B30","v":0},{"$f":"'Shooter Information'!C30","v":0},null,null,null,null,null,null,null,0,{"$f":"IF('Shooter Information'!$E$3-('Shooter Information'!$G$3-RANK(K28,K$4:K$78,1))<0,0,'Shooter Information'!$E$3-('Shooter Information'!$G$3-RANK(K28,K$4:K$78,1)))","v":0},0]
[26,{"$f":"'Shooter Information'!B31","v":0},{"$f":"'Shooter Information'!C31","v":0},null,null,null,null,null,null,null,0,{"$f":"IF('Shooter Information'!$E$3-('Shooter Information'!$G$3-RANK(K29,K$4:K$78,1))<0,0,'Shooter Information'!$E$3-('Shooter Information'!$G$3-RANK(K29,K$4:K$78,1)))","v":0},0]
[27,{"$f":"'Shooter Information'!B32","v":0},{"$f":"'Shooter Information'!C32","v":0},null,null,null,null,null,null,null,0,{"$f":"IF('Shooter Information'!$E$3-('Shooter Information'!$G$3-RANK(K30,K$4:K$78,1))<0,0,'Shooter Information'!$E$3-('Shooter Information'!$G$3-RANK(K30,K$4:K$78,1)))","v":0},0]
[28,{"$f":"'Shooter Information'!B33","v":0},{"$f":"'Shooter Information'!C33","v":0},null,null,null,null,null,null,null,0,{"$f":"IF('Shooter Information'!$E$3-('Shooter Information'!$G$3-RANK(K31,K$4:K$78,1))<0,0,'Shooter Information'!$E$3-('Shooter Information'!$G$3-RANK(K31,K$4:K$78,1)))","v":0},0]
[29,{"$f":"'Shooter Information'!B34","v":0},{"$f":"'Shooter Information'!C34","v":0},null,null,null,null,null,null,null,0,{"$f":"IF('Shooter Information'!$E$3-('Shooter Information'!$G$3-RANK(K32,K$4:K$78,1))<0,0,'Shooter Information'!$E$3-('Shooter Information'!$G$3-RANK(K32,K$4:K$78,1)))","v":0},0]
[30,{"$f":"'Shooter Information'!B35","v":0},{"$f":"'Shooter Information'!C35","v":0},null,null,null,null,null,null,null,0,{"$f":"IF('Shooter Information'!$E$3-('Shooter Information'!$G$3-RANK(K33,K$4:K$78,1))<0,0,'Shooter Information'!$E$3-('Shooter Information'!$G$3-RANK(K33,K$4:K$78,1)))","v":0},0]
[31,{"$f":"'Shooter Information'!B36","v":0},{"$f":"'Shooter Information'!C36","v":0},null,null,null,null,null,null,null,0,{"$f":"IF('Shooter Information'!$E$3-('Shooter Information'!$G$3-RANK(K34,K$4:K$78,1))<0,0,'Shooter Information'!$E$3-('Shooter Information'!$G$3-RANK(K34,K$4:K$78,1)))","v":0},0]
[32,{"$f":"'Shooter Information'!B37","v":0},{"$f":"'Shooter Information'!C37","v":0},null,null,null,null,null,null,null,0,{"$f":"IF('Shooter Information'!$E$3-('Shooter Information'!$G$3-RANK(K35,K$4:K$78,1))<0,0,'Shooter Information'!$E$3-('Shooter Information'!$G$3-RANK(K35,K$4:K$78,1)))","v":0},0]
[33,{"$f":"'Shooter Information'!B38","v":0},{"$f":"'Shooter Information'!C38","v":0},null,null,null,null,null,null,null,0,{"$f":"IF('Shooter Information'!$E$3-('Shooter Information'!$G$3-RANK(K36,K$4:K$78,1))<0,0,'Shooter Information'!$E$3-('Shooter Information'!$G$3-RANK(K36,K$4:K$78,1)))","v":0},0]
[34,{"$f":"'Shooter Information'!B39","v":0},{"$f":"'Shooter Information'!C39","v":0},null,null,null,null,null,null,null,0,{"$f":"IF('Shooter Information'!$E$3-('Shooter Information'!$G$3-RANK(K37,K$4:K$78,1))<0,0,'Shooter Information'!$E$3-('Shooter Information'!$G$3-RANK(K37,K$4:K$78,1)))","v":0},0]
[35,{"$f":"'Shooter Information'!B40","v":0},{"$f":"'Shooter Information'!C40","v":0},null,null,null,null,null,null,null,0,{"$f":"IF('Shooter Information'!$E$3-('Shooter Information'!$G$3-RANK(K38,K$4:K$78,1))<0,0,'Shooter Information'!$E$3-('Shooter Information'!$G$3-RANK(K38,K$4:K$78,1)))","v":0},0]
[36,{"$f":"'Shooter Information'!B41","v":0},{"$f":"'Shooter Information'!C41","v":0},null,null,null,null,null,null,null,0,{"$f":"IF('Shooter Information'!$E$3-('Shooter Information'!$G$3-RANK(K39,K$4:K$78,1))<0,0,'Shooter Information'!$E$3-('Shooter Information'!$G$3-RANK(K39,K$4:K$78,1)))","v":0},0]
[37,{"$f":"'Shooter Information'!B42","v":0},{"$f":"'Shooter Information'!C42","v":0},null,null,null,null,null,null,null,0,{"$f":"IF('Shooter Information'!$E$3-('Shooter Information'!$G$3-RANK(K40,K$4:K$78,1))<0,0,'Shooter Information'!$E$3-('Shooter Information'!$G$3-RANK(K40,K$4:K$78,1)))","v":0},0]
[38,{"$f":"'Shooter Information'!B43","v":0},{"$f":"'Shooter Information'!C43","v":0},null,null,null,null,null,null,null,0,{"$f":"IF('Shooter Information'!$E$3-('Shooter Information'!$G$3-RANK(K41,K$4:K$78,1))<0,0,'Shooter Information'!$E$3-('Shooter Information'!$G$3-RANK(K41,K$4:K$78,1)))","v":0},0]
[39,{"$f":"'Shooter Information'!B44","v":0},{"$f":"'Shooter Information'!C44","v":0},null,null,null,null,null,null,null,0,{"$f":"IF('Shooter Information'!$E$3-('Shooter Information'!$G$3-RANK(K42,K$4:K$78,1))<0,0,'Shooter Information'!$E$3-('Shooter Information'!$G$3-RANK(K42,K$4:K$78,1)))","v":0},0]
[40,{"$f":"'Shooter Information'!B45","v":0},{"$f":"'Shooter Information'!C45","v":0},null,null,null,null,null,null,null,0,{"$f":"IF('Shooter Information'!$E$3-('Shooter Information'!$G$3-RANK(K43,K$4:K$78,1))<0,0,'Shooter Information'!$E$3-('Shooter Information'!$G$3-RANK(K43,K$4:K$78,1)))","v":0},0]
[41,{"$f":"'Shooter Information'!B46","v":0},{"$f":"'Shooter Information'!C46","v":0},null,null,null,null,null,null,null,0,{"$f":"IF('Shooter Information'!$E$3-('Shooter Information'!$G$3-RANK(K44,K$4:K$78,1))<0,0,'Shooter Information'!$E$3-('Shooter Information'!$G$3-RANK(K44,K$4:K$78,1)))","v":0},0]
[42,{"$f":"'Shooter Information'!B47","v":0},{"$f":"'Shooter Information'!C47","v":0},null,null,null,null,null,null,null,0,{"$f":"IF('Shooter Information'!$E$3-('Shooter Information'!$G$3-RANK(K45,K$4:K$78,1))<0,0,'Shooter Information'!$E$3-('Shooter Information'!$G$3-RANK(K45,K$4:K$78,1)))","v":0},0]
[43,{"$f":"'Shooter Information'!B48","v":0},{"$f":"'Shooter Information'!C48","v":0},null,null,null,null,null,null,null,0,{"$f":"IF('Shooter Information'!$E$3-('Shooter Information'!$G$3-RANK(K46,K$4:K$78,1))<0,0,'Shooter Information'!$E$3-('Shooter Information'!$G$3-RANK(K46,K$4:K$78,1)))","v":0},0]
[44,{"$f":"'Shooter Information'!B49","v":0},{"$f":"'Shooter Information'!C49","v":0},null,null,null,null,null,null,null,0,{"$f":"IF('Shooter Information'!$E$3-('Shooter Information'!$G$3-RANK(K47,K$4:K$78,1))<0,0,'Shooter Information'!$E$3-('Shooter Information'!$G$3-RANK(K47,K$4:K$78,1)))","v":0},0]
[45,{"$f":"'Shooter Information'!B50","v":0},{"$f":"'Shooter Information'!C50","v":0},null,null,null,null,null,null,null,0,{"$f":"IF('Shooter Information'!$E$3-('Shooter Information'!$G$3-RANK(K48,K$4:K$78,1))<0,0,'Shooter Information'!$E$3-('Shooter Information'!$G$3-RANK(K48,K$4:K$78,1)))","v":0},0]
[46,{"$f":"'Shooter Information'!B51","v":0},{"$f":"'Shooter Information'!C51","v":0},null,null,null,null,null,null,null,{"$f":"(D49*5)+E49-F49+(G49*10)+(H49*30)+(I49*999)+(J49*999.99)","v":0},{"$f":"IF('Shooter Information'!$E$3-('Shooter Information'!$G$3-RANK(K49,K$4:K$78,1))<0,0,'Shooter Information'!$E$3-('Shooter Information'!$G$3-RANK(K49,K$4:K$78,1)))","v":0},0]
[47,{"$f":"'Shooter Information'!B52","v":0},{"$f":"'Shooter Information'!C52","v":0},null,null,null,null,null,null,null,0,{"$f":"IF('Shooter Information'!$E$3-('Shooter Information'!$G$3-RANK(K50,K$4:K$78,1))<0,0,'Shooter Information'!$E$3-('Shooter Information'!$G$3-RANK(K50,K$4:K$78,1)))","v":0},0]
[48,{"$f":"'Shooter Information'!B53","v":0},{"$f":"'Shooter Information'!C53","v":0},null,null,null,null,null,null,null,0,{"$f":"IF('Shooter Information'!$E$3-('Shooter Information'!$G$3-RANK(K51,K$4:K$78,1))<0,0,'Shooter Information'!$E$3-('Shooter Information'!$G$3-RANK(K51,K$4:K$78,1)))","v":0},0]
[49,{"$f":"'Shooter Information'!B54","v":0},{"$f":"'Shooter Information'!C54","v":0},null,null,null,null,null,null,null,0,{"$f":"IF('Shooter Information'!$E$3-('Shooter Information'!$G$3-RANK(K52,K$4:K$78,1))<0,0,'Shooter Information'!$E$3-('Shooter Information'!$G$3-RANK(K52,K$4:K$78,1)))","v":0},0]
[50,{"$f":"'Shooter Information'!B55","v":0},{"$f":"'Shooter Information'!C55","v":0},null,null,null,null,null,null,null,0,{"$f":"IF('Shooter Information'!$E$3-('Shooter Information'!$G$3-RANK(K53,K$4:K$78,1))<0,0,'Shooter Information'!$E$3-('Shooter Information'!$G$3-RANK(K53,K$4:K$78,1)))","v":0},0]
[51,{"$f":"'Shooter Information'!B56","v":0},{"$f":"'Shooter Information'!C56","v":0},null,null,null,null,null,null,null,0,{"$f":"IF('Shooter Information'!$E$3-('Shooter Information'!$G$3-RANK(K54,K$4:K$78,1))<0,0,'Shooter Information'!$E$3-('Shooter Information'!$G$3-RANK(K54,K$4:K$78,1)))","v":0},0]
[52,{"$f":"'Shooter Information'!B57","v":0},{"$f":"'Shooter Information'!C57","v":0},null,null,null,null,null,null,null,0,{"$f":"IF('Shooter Information'!$E$3-('Shooter Information'!$G$3-RANK(K55,K$4:K$78,1))<0,0,'Shooter Information'!$E$3-('Shooter Information'!$G$3-RANK(K55,K$4:K$78,1)))","v":0},0]
[53,{"$f":"'Shooter Information'!B58","v":0},{"$f":"'Shooter Information'!C58","v":0},null,null,null,null,null,null,null,0,{"$f":"IF('Shooter Information'!$E$3-('Shooter Information'!$G$3-RANK(K56,K$4:K$78,1))<0,0,'Shooter Information'!$E$3-('Shooter Information'!$G$3-RANK(K56,K$4:K$78,1)))","v":0},0]
[54,{"$f":"'Shooter Information'!B59","v":0},{"$f":"'Shooter Information'!C59","v":0},null,null,null,null,null,null,null,0,{"$f":"IF('Shooter Information'!$E$3-('Shooter Information'!$G$3-RANK(K57,K$4:K$78,1))<0,0,'Shooter Information'!$E$3-('Shooter Information'!$G$3-RANK(K57,K$4:K$78,1)))","v":0},0]
[55,{"$f":"'Shooter Information'!B60","v":0},{"$f":"'Shooter Information'!C60","v":0},null,null,null,null,null,null,null,0,{"$f":"IF('Shooter Information'!$E$3-('Shooter Information'!$G$3-RANK(K58,K$4:K$78,1))<0,0,'Shooter Information'!$E$3-('Shooter Information'!$G$3-RANK(K58,K$4:K$78,1)))","v":0},0]
[56,{"$f":"'Shooter Information'!B61","v":0},{"$f":"'Shooter Information'!C61","v":0},null,null,null,null,null,null,null,0,{"$f":"IF('Shooter Information'!$E$3-('Shooter Information'!$G$3-RANK(K59,K$4:K$78,1))<0,0,'Shooter Information'!$E$3-('Shooter Information'!$G$3-RANK(K59,K$4:K$78,1)))","v":0},0]
[57,{"$f":"'Shooter Information'!B62","v":0},{"$f":"'Shooter Information'!C62","v":0},null,null,null,null,null,null,null,0,{"$f":"IF('Shooter Information'!$E$3-('Shooter Information'!$G$3-RANK(K60,K$4:K$78,1))<0,0,'Shooter Information'!$E$3-('Shooter Information'!$G$3-RANK(K60,K$4:K$78,1)))","v":0},0]
[58,{"$f":"'Shooter Information'!B63","v":0},{"$f":"'Shooter Information'!C63","v":0},null,null,null,null,null,null,null,0,{"$f":"IF('Shooter Information'!$E$3-('Shooter Information'!$G$3-RANK(K61,K$4:K$78,1))<0,0,'Shooter Information'!$E$3-('Shooter Information'!$G$3-RANK(K61,K$4:K$78,1)))","v":0},0]
[59,{"$f":"'Shooter Information'!B64","v":0},{"$f":"'Shooter Information'!C64","v":0},null,null,null,null,null,null,null,0,{"$f":"IF('Shooter Information'!$E$3-('Shooter Information'!$G$3-RANK(K62,K$4:K$78,1))<0,0,'Shooter Information'!$E$3-('Shooter Information'!$G$3-RANK(K62,K$4:K$78,1)))","v":0},0]
[60,{"$f":"'Shooter Information'!B65","v":0},{"$f":"'Shooter Information'!C65","v":0},null,null,null,null,null,null,null,0,{"$f":"IF('Shooter Information'!$E$3-('Shooter Information'!$G$3-RANK(K63,K$4:K$78,1))<0,0,'Shooter Information'!$E$3-('Shooter Information'!$G$3-RANK(K63,K$4:K$78,1)))","v":0},0]
[61,{"$f":"'Shooter Information'!B66","v":0},{"$f":"'Shooter Information'!C66","v":0},null,null,null,null,null,null,null,{"$f":"(D64*5)+E64-F64+(G64*10)+(H64*30)+(I64*999)+(J64*999.99)","v":0},{"$f":"IF('Shooter Information'!$E$3-('Shooter Information'!$G$3-RANK(K64,K$4:K$78,1))<0,0,'Shooter Information'!$E$3-('Shooter Information'!$G$3-RANK(K64,K$4:K$78,1)))","v":0},{"$f":"(SUM(D64+G64+H64+I64+J64))","v":0}]
[62,{"$f":"'Shooter Information'!B67","v":0},{"$f":"'Shooter Information'!C67","v":0},null,null,null,null,null,null,null,0,{"$f":"IF('Shooter Information'!$E$3-('Shooter Information'!$G$3-RANK(K65,K$4:K$78,1))<0,0,'Shooter Information'!$E$3-('Shooter Information'!$G$3-RANK(K65,K$4:K$78,1)))","v":0},0]
[63,{"$f":"'Shooter Information'!B68","v":0},{"$f":"'Shooter Information'!C68","v":0},null,null,null,null,null,null,null,0,{"$f":"IF('Shooter Information'!$E$3-('Shooter Information'!$G$3-RANK(K66,K$4:K$78,1))<0,0,'Shooter Information'!$E$3-('Shooter Information'!$G$3-RANK(K66,K$4:K$78,1)))","v":0},0]
[64,{"$f":"'Shooter Information'!B69","v":0},{"$f":"'Shooter Information'!C69","v":0},null,null,null,null,null,null,null,0,{"$f":"IF('Shooter Information'!$E$3-('Shooter Information'!$G$3-RANK(K67,K$4:K$78,1))<0,0,'Shooter Information'!$E$3-('Shooter Information'!$G$3-RANK(K67,K$4:K$78,1)))","v":0},0]
[65,{"$f":"'Shooter Information'!B70","v":0},{"$f":"'Shooter Information'!C70","v":0},null,null,null,null,null,null,null,0,{"$f":"IF('Shooter Information'!$E$3-('Shooter Information'!$G$3-RANK(K68,K$4:K$78,1))<0,0,'Shooter Information'!$E$3-('Shooter Information'!$G$3-RANK(K68,K$4:K$78,1)))","v":0},0]
[66,{"$f":"'Shooter Information'!B71","v":0},{"$f":"'Shooter Information'!C71","v":0},null,null,null,null,null,null,null,0,{"$f":"IF('Shooter Information'!$E$3-('Shooter Information'!$G$3-RANK(K69,K$4:K$78,1))<0,0,'Shooter Information'!$E$3-('Shooter Information'!$G$3-RANK(K69,K$4:K$78,1)))","v":0},0]
[67,{"$f":"'Shooter Information'!B72","v":0},{"$f":"'Shooter Information'!C72","v":0},null,null,null,null,null,null,null,0,{"$f":"IF('Shooter Information'!$E$3-('Shooter Information'!$G$3-RANK(K70,K$4:K$78,1))<0,0,'Shooter Information'!$E$3-('Shooter Information'!$G$3-RANK(K70,K$4:K$78,1)))","v":0},0]
[68,{"$f":"'Shooter Information'!B73","v":0},{"$f":"'Shooter Information'!C73","v":0},null,null,null,null,null,null,null,0,{"$f":"IF('Shooter Information'!$E$3-('Shooter Information'!$G$3-RANK(K71,K$4:K$78,1))<0,0,'Shooter Information'!$E$3-('Shooter Information'!$G$3-RANK(K71,K$4:K$78,1)))","v":0},0]
[69,{"$f":"'Shooter Information'!B74","v":0},{"$f":"'Shooter Information'!C74","v":0},null,null,null,null,null,null,null,0,{"$f":"IF('Shooter Information'!$E$3-('Shooter Information'!$G$3-RANK(K72,K$4:K$78,1))<0,0,'Shooter Information'!$E$3-('Shooter Information'!$G$3-RANK(K72,K$4:K$78,1)))","v":0},0]
[70,{"$f":"'Shooter Information'!B75","v":0},{"$f":"'Shooter Information'!C75","v":0},null,null,null,null,null,null,null,0,{"$f":"IF('Shooter Information'!$E$3-('Shooter Information'!$G$3-RANK(K73,K$4:K$78,1))<0,0,'Shooter Information'!$E$3-('Shooter Information'!$G$3-RANK(K73,K$4:K$78,1)))","v":0},0]
[71,{"$f":"'Shooter Information'!B76","v":0},{"$f":"'Shooter Information'!C76","v":0},null,null,null,null,null,null,null,0,{"$f":"IF('Shooter Information'!$E$3-('Shooter Information'!$G$3-RANK(K74,K$4:K$78,1))<0,0,'Shooter Information'!$E$3-('Shooter Information'!$G$3-RANK(K74,K$4:K$78,1)))","v":0},0]
[72,{"$f":"'Shooter Information'!B77","v":0},{"$f":"'Shooter Information'!C77","v":0},null,null,null,null,null,null,null,0,{"$f":"IF('Shooter Information'!$E$3-('Shooter Information'!$G$3-RANK(K75,K$4:K$78,1))<0,0,'Shooter Information'!$E$3-('Shooter Information'!$G$3-RANK(K75,K$4:K$78,1)))","v":0},0]
[73,{"$f":"'Shooter Information'!B78","v":0},{"$f":"'Shooter Information'!C78","v":0},null,null,null,null,null,null,null,0,{"$f":"IF('Shooter Information'!$E$3-('Shooter Information'!$G$3-RANK(K76,K$4:K$78,1))<0,0,'Shooter Information'!$E$3-('Shooter Information'!$G$3-RANK(K76,K$4:K$78,1)))","v":0},0]
[74,{"$f":"'Shooter Information'!B79","v":0},{"$f":"'Shooter Information'!C79","v":0},null,null,null,null,null,null,null,0,{"$f":"IF('Shooter Information'!$E$3-('Shooter Information'!$G$3-RANK(K77,K$4:K$78,1))<0,0,'Shooter Information'!$E$3-('Shooter Information'!$G$3-RANK(K77,K$4:K$78,1)))","v":0},0]
[75,{"$f":"'Shooter Information'!B80","v":0},{"$f":"'Shooter Information'!C80","v":0},null,null,null,null,null,null,null,0,{"$f":"IF('Shooter Information'!$E$3-('Shooter Information'!$G$3-RANK(K78,K$4:K$78,1))<0,0,'Shooter Information'!$E$3-('Shooter Information'!$G$3-RANK(K78,K$4:K$78,1)))","v":0},0]

{"sheet":"Stage 6","index":6,"n_rows":78,"n_cols":13,"rows_kept":78,"cut":false,"hidden":false,"merged":[]}
[null,"CAS SCORE SHEET",null,"Date:",{"$f":"'Shooter Information'!$E$2","v":"Wednesday April 9th, 2014"}]
[null,"Stage 6"]
["Roster #","Shooter","Class","Misses","Raw Time","Bonus","10 Sec","30 Sec","DNF","DQ","Total","Rank","Penalties"]
[{"$f":"ROW()-3","v":1},{"$f":"'Shooter Information'!B6","v":"Striker"},{"$f":"'Shooter Information'!C6","v":0},null,null,null,null,null,1,null,{"$f":"(D4*5)+E4-F4+(G4*10)+(H4*30)+(I4*999)+(J4*999.99)","v":999},{"$f":"IF('Shooter Information'!$E$3-('Shooter Information'!$G$3-RANK(K4,K$4:K$78,1))<0,0,'Shooter Information'!$E$3-('Shooter Information'!$G$3-RANK(K4,K$4:K$78,1)))","v":4},{"$f":"(SUM(D4+G4+H4+I4+J4))","v":1}]
[{"$f":"ROW()-3","v":2},{"$f":"'Shooter Information'!B7","v":"Doc Deadwood"},{"$f":"'Shooter Information'!C7","v":0},null,36.69,null,null,null,null,null,{"$f":"(D5*5)+E5-F5+(G5*10)+(H5*30)+(I5*999)+(J5*999.99)","v":36.69},{"$f":"IF('Shooter Information'!$E$3-('Shooter Information'!$G$3-RANK(K5,K$4:K$78,1))<0,0,'Shooter Information'!$E$3-('Shooter Information'!$G$3-RANK(K5,K$4:K$78,1)))","v":2},{"$f":"(SUM(D5+G5+H5+I5+J5))","v":0}]
[3,{"$f":"'Shooter Information'!B8","v":"Cold Blue Mike"},{"$f":"'Shooter Information'!C8","v":0},null,38.08,null,null,null,null,null,38.08,{"$f":"IF('Shooter Information'!$E$3-('Shooter Information'!$G$3-RANK(K6,K$4:K$78,1))<0,0,'Shooter Information'!$E$3-('Shooter Information'!$G$3-RANK(K6,K$4:K$78,1)))","v":3},0]
[4,{"$f":"'Shooter Information'!B9","v":"B.S. Walker"},{"$f":"'Shooter Information'!C9","v":0},1,28.18,null,null,null,null,null,33.18,{"$f":"IF('Shooter Information'!$E$3-('Shooter Information'!$G$3-RANK(K7,K$4:K$78,1))<0,0,'Shooter Information'!$E$3-('Shooter Information'!$G$3-RANK(K7,K$4:K$78,1)))","v":1},1]
[5,{"$f":"'Shooter Information'!B10","v":0},{"$f":"'Shooter Information'!C10","v":0},null,null,null,null,null,null,null,0,{"$f":"IF('Shooter Information'!$E$3-('Shooter Information'!$G$3-RANK(K8,K$4:K$78,1))<0,0,'Shooter Information'!$E$3-('Shooter Information'!$G$3-RANK(K8,K$4:K$78,1)))","v":0},0]
[6,{"$f":"'Shooter Information'!B11","v":0},{"$f":"'Shooter Information'!C11","v":0},null,null,null,null,null,null,null,0,{"$f":"IF('Shooter Information'!$E$3-('Shooter Information'!$G$3-RANK(K9,K$4:K$78,1))<0,0,'Shooter Information'!$E$3-('Shooter Information'!$G$3-RANK(K9,K$4:K$78,1)))","v":0},0]
[7,{"$f":"'Shooter Information'!B12","v":0},{"$f":"'Shooter Information'!C12","v":0},null,null,null,null,null,null,null,0,{"$f":"IF('Shooter Information'!$E$3-('Shooter Information'!$G$3-RANK(K10,K$4:K$78,1))<0,0,'Shooter Information'!$E$3-('Shooter Information'!$G$3-RANK(K10,K$4:K$78,1)))","v":0},0]
[8,{"$f":"'Shooter Information'!B13","v":0},{"$f":"'Shooter Information'!C13","v":0},null,null,null,null,null,null,null,0,{"$f":"IF('Shooter Information'!$E$3-('Shooter Information'!$G$3-RANK(K11,K$4:K$78,1))<0,0,'Shooter Information'!$E$3-('Shooter Information'!$G$3-RANK(K11,K$4:K$78,1)))","v":0},0]
[9,{"$f":"'Shooter Information'!B14","v":0},{"$f":"'Shooter Information'!C14","v":0},null,null,null,null,null,null,null,0,{"$f":"IF('Shooter Information'!$E$3-('Shooter Information'!$G$3-RANK(K12,K$4:K$78,1))<0,0,'Shooter Information'!$E$3-('Shooter Information'!$G$3-RANK(K12,K$4:K$78,1)))","v":0},0]
[10,{"$f":"'Shooter Information'!B15","v":0},{"$f":"'Shooter Information'!C15","v":0},null,null,null,null,null,null,null,0,{"$f":"IF('Shooter Information'!$E$3-('Shooter Information'!$G$3-RANK(K13,K$4:K$78,1))<0,0,'Shooter Information'!$E$3-('Shooter Information'!$G$3-RANK(K13,K$4:K$78,1)))","v":0},0]
[11,{"$f":"'Shooter Information'!B16","v":0},{"$f":"'Shooter Information'!C16","v":0},null,null,null,null,null,null,null,0,{"$f":"IF('Shooter Information'!$E$3-('Shooter Information'!$G$3-RANK(K14,K$4:K$78,1))<0,0,'Shooter Information'!$E$3-('Shooter Information'!$G$3-RANK(K14,K$4:K$78,1)))","v":0},0]
[12,{"$f":"'Shooter Information'!B17","v":0},{"$f":"'Shooter Information'!C17","v":0},null,null,null,null,null,null,null,0,{"$f":"IF('Shooter Information'!$E$3-('Shooter Information'!$G$3-RANK(K15,K$4:K$78,1))<0,0,'Shooter Information'!$E$3-('Shooter Information'!$G$3-RANK(K15,K$4:K$78,1)))","v":0},0]
[13,{"$f":"'Shooter Information'!B18","v":0},{"$f":"'Shooter Information'!C18","v":0},null,null,null,null,null,null,null,0,{"$f":"IF('Shooter Information'!$E$3-('Shooter Information'!$G$3-RANK(K16,K$4:K$78,1))<0,0,'Shooter Information'!$E$3-('Shooter Information'!$G$3-RANK(K16,K$4:K$78,1)))","v":0},0]
[14,{"$f":"'Shooter Information'!B19","v":0},{"$f":"'Shooter Information'!C19","v":0},null,null,null,null,null,null,null,0,{"$f":"IF('Shooter Information'!$E$3-('Shooter Information'!$G$3-RANK(K17,K$4:K$78,1))<0,0,'Shooter Information'!$E$3-('Shooter Information'!$G$3-RANK(K17,K$4:K$78,1)))","v":0},0]
[15,{"$f":"'Shooter Information'!B20","v":0},{"$f":"'Shooter Information'!C20","v":0},null,null,null,null,null,null,null,0,{"$f":"IF('Shooter Information'!$E$3-('Shooter Information'!$G$3-RANK(K18,K$4:K$78,1))<0,0,'Shooter Information'!$E$3-('Shooter Information'!$G$3-RANK(K18,K$4:K$78,1)))","v":0},0]
[16,{"$f":"'Shooter Information'!B21","v":0},{"$f":"'Shooter Information'!C21","v":0},null,null,null,null,null,null,null,0,{"$f":"IF('Shooter Information'!$E$3-('Shooter Information'!$G$3-RANK(K19,K$4:K$78,1))<0,0,'Shooter Information'!$E$3-('Shooter Information'!$G$3-RANK(K19,K$4:K$78,1)))","v":0},0]
[17,{"$f":"'Shooter Information'!B22","v":0},{"$f":"'Shooter Information'!C22","v":0},null,null,null,null,null,null,null,0,{"$f":"IF('Shooter Information'!$E$3-('Shooter Information'!$G$3-RANK(K20,K$4:K$78,1))<0,0,'Shooter Information'!$E$3-('Shooter Information'!$G$3-RANK(K20,K$4:K$78,1)))","v":0},0]
[18,{"$f":"'Shooter Information'!B23","v":0},{"$f":"'Shooter Information'!C23","v":0},null,null,null,null,null,null,null,0,{"$f":"IF('Shooter Information'!$E$3-('Shooter Information'!$G$3-RANK(K21,K$4:K$78,1))<0,0,'Shooter Information'!$E$3-('Shooter Information'!$G$3-RANK(K21,K$4:K$78,1)))","v":0},0]
[19,{"$f":"'Shooter Information'!B24","v":0},{"$f":"'Shooter Information'!C24","v":0},null,null,null,null,null,null,null,0,{"$f":"IF('Shooter Information'!$E$3-('Shooter Information'!$G$3-RANK(K22,K$4:K$78,1))<0,0,'Shooter Information'!$E$3-('Shooter Information'!$G$3-RANK(K22,K$4:K$78,1)))","v":0},0]
[20,{"$f":"'Shooter Information'!B25","v":0},{"$f":"'Shooter Information'!C25","v":0},null,null,null,null,null,null,null,0,{"$f":"IF('Shooter Information'!$E$3-('Shooter Information'!$G$3-RANK(K23,K$4:K$78,1))<0,0,'Shooter Information'!$E$3-('Shooter Information'!$G$3-RANK(K23,K$4:K$78,1)))","v":0},0]
[21,{"$f":"'Shooter Information'!B26","v":0},{"$f":"'Shooter Information'!C26","v":0},null,null,null,null,null,null,null,0,{"$f":"IF('Shooter Information'!$E$3-('Shooter Information'!$G$3-RANK(K24,K$4:K$78,1))<0,0,'Shooter Information'!$E$3-('Shooter Information'!$G$3-RANK(K24,K$4:K$78,1)))","v":0},0]
[22,{"$f":"'Shooter Information'!B27","v":0},{"$f":"'Shooter Information'!C27","v":0},null,null,null,null,null,null,null,0,{"$f":"IF('Shooter Information'!$E$3-('Shooter Information'!$G$3-RANK(K25,K$4:K$78,1))<0,0,'Shooter Information'!$E$3-('Shooter Information'!$G$3-RANK(K25,K$4:K$78,1)))","v":0},0]
[23,{"$f":"'Shooter Information'!B28","v":0},{"$f":"'Shooter Information'!C28","v":0},null,null,null,null,null,null,null,0,{"$f":"IF('Shooter Information'!$E$3-('Shooter Information'!$G$3-RANK(K26,K$4:K$78,1))<0,0,'Shooter Information'!$E$3-('Shooter Information'!$G$3-RANK(K26,K$4:K$78,1)))","v":0},0]
[24,{"$f":"'Shooter Information'!B29","v":0},{"$f":"'Shooter Information'!C29","v":0},null,null,null,null,null,null,null,0,{"$f":"IF('Shooter Information'!$E$3-('Shooter Information'!$G$3-RANK(K27,K$4:K$78,1))<0,0,'Shooter Information'!$E$3-('Shooter Information'!$G$3-RANK(K27,K$4:K$78,1)))","v":0},0]
[25,{"$f":"'Shooter Information'!B30","v":0},{"$f":"'Shooter Information'!C30","v":0},null,null,null,null,null,null,null,0,{"$f":"IF('Shooter Information'!$E$3-('Shooter Information'!$G$3-RANK(K28,K$4:K$78,1))<0,0,'Shooter Information'!$E$3-('Shooter Information'!$G$3-RANK(K28,K$4:K$78,1)))","v":0},0]
[26,{"$f":"'Shooter Information'!B31","v":0},{"$f":"'Shooter Information'!C31","v":0},null,null,null,null,null,null,null,0,{"$f":"IF('Shooter Information'!$E$3-('Shooter Information'!$G$3-RANK(K29,K$4:K$78,1))<0,0,'Shooter Information'!$E$3-('Shooter Information'!$G$3-RANK(K29,K$4:K$78,1)))","v":0},0]
[27,{"$f":"'Shooter Information'!B32","v":0},{"$f":"'Shooter Information'!C32","v":0},null,null,null,null,null,null,null,0,{"$f":"IF('Shooter Information'!$E$3-('Shooter Information'!$G$3-RANK(K30,K$4:K$78,1))<0,0,'Shooter Information'!$E$3-('Shooter Information'!$G$3-RANK(K30,K$4:K$78,1)))","v":0},0]
[28,{"$f":"'Shooter Information'!B33","v":0},{"$f":"'Shooter Information'!C33","v":0},null,null,null,null,null,null,null,0,{"$f":"IF('Shooter Information'!$E$3-('Shooter Information'!$G$3-RANK(K31,K$4:K$78,1))<0,0,'Shooter Information'!$E$3-('Shooter Information'!$G$3-RANK(K31,K$4:K$78,1)))","v":0},0]
[29,{"$f":"'Shooter Information'!B34","v":0},{"$f":"'Shooter Information'!C34","v":0},null,null,null,null,null,null,null,0,{"$f":"IF('Shooter Information'!$E$3-('Shooter Information'!$G$3-RANK(K32,K$4:K$78,1))<0,0,'Shooter Information'!$E$3-('Shooter Information'!$G$3-RANK(K32,K$4:K$78,1)))","v":0},0]
[30,{"$f":"'Shooter Information'!B35","v":0},{"$f":"'Shooter Information'!C35","v":0},null,null,null,null,null,null,null,0,{"$f":"IF('Shooter Information'!$E$3-('Shooter Information'!$G$3-RANK(K33,K$4:K$78,1))<0,0,'Shooter Information'!$E$3-('Shooter Information'!$G$3-RANK(K33,K$4:K$78,1)))","v":0},0]
[31,{"$f":"'Shooter Information'!B36","v":0},{"$f":"'Shooter Information'!C36","v":0},null,null,null,null,null,null,null,0,{"$f":"IF('Shooter Information'!$E$3-('Shooter Information'!$G$3-RANK(K34,K$4:K$78,1))<0,0,'Shooter Information'!$E$3-('Shooter Information'!$G$3-RANK(K34,K$4:K$78,1)))","v":0},0]
[32,{"$f":"'Shooter Information'!B37","v":0},{"$f":"'Shooter Information'!C37","v":0},null,null,null,null,null,null,null,0,{"$f":"IF('Shooter Information'!$E$3-('Shooter Information'!$G$3-RANK(K35,K$4:K$78,1))<0,0,'Shooter Information'!$E$3-('Shooter Information'!$G$3-RANK(K35,K$4:K$78,1)))","v":0},0]
[33,{"$f":"'Shooter Information'!B38","v":0},{"$f":"'Shooter Information'!C38","v":0},null,null,null,null,null,null,null,0,{"$f":"IF('Shooter Information'!$E$3-('Shooter Information'!$G$3-RANK(K36,K$4:K$78,1))<0,0,'Shooter Information'!$E$3-('Shooter Information'!$G$3-RANK(K36,K$4:K$78,1)))","v":0},0]
[34,{"$f":"'Shooter Information'!B39","v":0},{"$f":"'Shooter Information'!C39","v":0},null,null,null,null,null,null,null,0,{"$f":"IF('Shooter Information'!$E$3-('Shooter Information'!$G$3-RANK(K37,K$4:K$78,1))<0,0,'Shooter Information'!$E$3-('Shooter Information'!$G$3-RANK(K37,K$4:K$78,1)))","v":0},0]
[35,{"$f":"'Shooter Information'!B40","v":0},{"$f":"'Shooter Information'!C40","v":0},null,null,null,null,null,null,null,0,{"$f":"IF('Shooter Information'!$E$3-('Shooter Information'!$G$3-RANK(K38,K$4:K$78,1))<0,0,'Shooter Information'!$E$3-('Shooter Information'!$G$3-RANK(K38,K$4:K$78,1)))","v":0},0]
[36,{"$f":"'Shooter Information'!B41","v":0},{"$f":"'Shooter Information'!C41","v":0},null,null,null,null,null,null,null,0,{"$f":"IF('Shooter Information'!$E$3-('Shooter Information'!$G$3-RANK(K39,K$4:K$78,1))<0,0,'Shooter Information'!$E$3-('Shooter Information'!$G$3-RANK(K39,K$4:K$78,1)))","v":0},0]
[37,{"$f":"'Shooter Information'!B42","v":0},{"$f":"'Shooter Information'!C42","v":0},null,null,null,null,null,null,null,0,{"$f":"IF('Shooter Information'!$E$3-('Shooter Information'!$G$3-RANK(K40,K$4:K$78,1))<0,0,'Shooter Information'!$E$3-('Shooter Information'!$G$3-RANK(K40,K$4:K$78,1)))","v":0},0]
[38,{"$f":"'Shooter Information'!B43","v":0},{"$f":"'Shooter Information'!C43","v":0},null,null,null,null,null,null,null,0,{"$f":"IF('Shooter Information'!$E$3-('Shooter Information'!$G$3-RANK(K41,K$4:K$78,1))<0,0,'Shooter Information'!$E$3-('Shooter Information'!$G$3-RANK(K41,K$4:K$78,1)))","v":0},0]
[39,{"$f":"'Shooter Information'!B44","v":0},{"$f":"'Shooter Information'!C44","v":0},null,null,null,null,null,null,null,0,{"$f":"IF('Shooter Information'!$E$3-('Shooter Information'!$G$3-RANK(K42,K$4:K$78,1))<0,0,'Shooter Information'!$E$3-('Shooter Information'!$G$3-RANK(K42,K$4:K$78,1)))","v":0},0]
[40,{"$f":"'Shooter Information'!B45","v":0},{"$f":"'Shooter Information'!C45","v":0},null,null,null,null,null,null,null,0,{"$f":"IF('Shooter Information'!$E$3-('Shooter Information'!$G$3-RANK(K43,K$4:K$78,1))<0,0,'Shooter Information'!$E$3-('Shooter Information'!$G$3-RANK(K43,K$4:K$78,1)))","v":0},0]
[41,{"$f":"'Shooter Information'!B46","v":0},{"$f":"'Shooter Information'!C46","v":0},null,null,null,null,null,null,null,0,{"$f":"IF('Shooter Information'!$E$3-('Shooter Information'!$G$3-RANK(K44,K$4:K$78,1))<0,0,'Shooter Information'!$E$3-('Shooter Information'!$G$3-RANK(K44,K$4:K$78,1)))","v":0},0]
[42,{"$f":"'Shooter Information'!B47","v":0},{"$f":"'Shooter Information'!C47","v":0},null,null,null,null,null,null,null,0,{"$f":"IF('Shooter Information'!$E$3-('Shooter Information'!$G$3-RANK(K45,K$4:K$78,1))<0,0,'Shooter Information'!$E$3-('Shooter Information'!$G$3-RANK(K45,K$4:K$78,1)))","v":0},0]
[43,{"$f":"'Shooter Information'!B48","v":0},{"$f":"'Shooter Information'!C48","v":0},null,null,null,null,null,null,null,0,{"$f":"IF('Shooter Information'!$E$3-('Shooter Information'!$G$3-RANK(K46,K$4:K$78,1))<0,0,'Shooter Information'!$E$3-('Shooter Information'!$G$3-RANK(K46,K$4:K$78,1)))","v":0},0]
[44,{"$f":"'Shooter Information'!B49","v":0},{"$f":"'Shooter Information'!C49","v":0},null,null,null,null,null,null,null,0,{"$f":"IF('Shooter Information'!$E$3-('Shooter Information'!$G$3-RANK(K47,K$4:K$78,1))<0,0,'Shooter Information'!$E$3-('Shooter Information'!$G$3-RANK(K47,K$4:K$78,1)))","v":0},0]
[45,{"$f":"'Shooter Information'!B50","v":0},{"$f":"'Shooter Information'!C50","v":0},null,null,null,null,null,null,null,0,{"$f":"IF('Shooter Information'!$E$3-('Shooter Information'!$G$3-RANK(K48,K$4:K$78,1))<0,0,'Shooter Information'!$E$3-('Shooter Information'!$G$3-RANK(K48,K$4:K$78,1)))","v":0},0]
[46,{"$f":"'Shooter Information'!B51","v":0},{"$f":"'Shooter Information'!C51","v":0},null,null,null,null,null,null,null,{"$f":"(D49*5)+E49-F49+(G49*10)+(H49*30)+(I49*999)+(J49*999.99)","v":0},{"$f":"IF('Shooter Information'!$E$3-('Shooter Information'!$G$3-RANK(K49,K$4:K$78,1))<0,0,'Shooter Information'!$E$3-('Shooter Information'!$G$3-RANK(K49,K$4:K$78,1)))","v":0},0]
[47,{"$f":"'Shooter Information'!B52","v":0},{"$f":"'Shooter Information'!C52","v":0},null,null,null,null,null,null,null,0,{"$f":"IF('Shooter Information'!$E$3-('Shooter Information'!$G$3-RANK(K50,K$4:K$78,1))<0,0,'Shooter Information'!$E$3-('Shooter Information'!$G$3-RANK(K50,K$4:K$78,1)))","v":0},0]
[48,{"$f":"'Shooter Information'!B53","v":0},{"$f":"'Shooter Information'!C53","v":0},null,null,null,null,null,null,null,0,{"$f":"IF('Shooter Information'!$E$3-('Shooter Information'!$G$3-RANK(K51,K$4:K$78,1))<0,0,'Shooter Information'!$E$3-('Shooter Information'!$G$3-RANK(K51,K$4:K$78,1)))","v":0},0]
[49,{"$f":"'Shooter Information'!B54","v":0},{"$f":"'Shooter Information'!C54","v":0},null,null,null,null,null,null,null,0,{"$f":"IF('Shooter Information'!$E$3-('Shooter Information'!$G$3-RANK(K52,K$4:K$78,1))<0,0,'Shooter Information'!$E$3-('Shooter Information'!$G$3-RANK(K52,K$4:K$78,1)))","v":0},0]
[50,{"$f":"'Shooter Information'!B55","v":0},{"$f":"'Shooter Information'!C55","v":0},null,null,null,null,null,null,null,0,{"$f":"IF('Shooter Information'!$E$3-('Shooter Information'!$G$3-RANK(K53,K$4:K$78,1))<0,0,'Shooter Information'!$E$3-('Shooter Information'!$G$3-RANK(K53,K$4:K$78,1)))","v":0},0]
[51,{"$f":"'Shooter Information'!B56","v":0},{"$f":"'Shooter Information'!C56","v":0},null,null,null,null,null,null,null,0,{"$f":"IF('Shooter Information'!$E$3-('Shooter Information'!$G$3-RANK(K54,K$4:K$78,1))<0,0,'Shooter Information'!$E$3-('Shooter Information'!$G$3-RANK(K54,K$4:K$78,1)))","v":0},0]
[52,{"$f":"'Shooter Information'!B57","v":0},{"$f":"'Shooter Information'!C57","v":0},null,null,null,null,null,null,null,0,{"$f":"IF('Shooter Information'!$E$3-('Shooter Information'!$G$3-RANK(K55,K$4:K$78,1))<0,0,'Shooter Information'!$E$3-('Shooter Information'!$G$3-RANK(K55,K$4:K$78,1)))","v":0},0]
[53,{"$f":"'Shooter Information'!B58","v":0},{"$f":"'Shooter Information'!C58","v":0},null,null,null,null,null,null,null,0,{"$f":"IF('Shooter Information'!$E$3-('Shooter Information'!$G$3-RANK(K56,K$4:K$78,1))<0,0,'Shooter Information'!$E$3-('Shooter Information'!$G$3-RANK(K56,K$4:K$78,1)))","v":0},0]
[54,{"$f":"'Shooter Information'!B59","v":0},{"$f":"'Shooter Information'!C59","v":0},null,null,null,null,null,null,null,0,{"$f":"IF('Shooter Information'!$E$3-('Shooter Information'!$G$3-RANK(K57,K$4:K$78,1))<0,0,'Shooter Information'!$E$3-('Shooter Information'!$G$3-RANK(K57,K$4:K$78,1)))","v":0},0]
[55,{"$f":"'Shooter Information'!B60","v":0},{"$f":"'Shooter Information'!C60","v":0},null,null,null,null,null,null,null,0,{"$f":"IF('Shooter Information'!$E$3-('Shooter Information'!$G$3-RANK(K58,K$4:K$78,1))<0,0,'Shooter Information'!$E$3-('Shooter Information'!$G$3-RANK(K58,K$4:K$78,1)))","v":0},0]
[56,{"$f":"'Shooter Information'!B61","v":0},{"$f":"'Shooter Information'!C61","v":0},null,null,null,null,null,null,null,0,{"$f":"IF('Shooter Information'!$E$3-('Shooter Information'!$G$3-RANK(K59,K$4:K$78,1))<0,0,'Shooter Information'!$E$3-('Shooter Information'!$G$3-RANK(K59,K$4:K$78,1)))","v":0},0]
[57,{"$f":"'Shooter Information'!B62","v":0},{"$f":"'Shooter Information'!C62","v":0},null,null,null,null,null,null,null,0,{"$f":"IF('Shooter Information'!$E$3-('Shooter Information'!$G$3-RANK(K60,K$4:K$78,1))<0,0,'Shooter Information'!$E$3-('Shooter Information'!$G$3-RANK(K60,K$4:K$78,1)))","v":0},0]
[58,{"$f":"'Shooter Information'!B63","v":0},{"$f":"'Shooter Information'!C63","v":0},null,null,null,null,null,null,null,0,{"$f":"IF('Shooter Information'!$E$3-('Shooter Information'!$G$3-RANK(K61,K$4:K$78,1))<0,0,'Shooter Information'!$E$3-('Shooter Information'!$G$3-RANK(K61,K$4:K$78,1)))","v":0},0]
[59,{"$f":"'Shooter Information'!B64","v":0},{"$f":"'Shooter Information'!C64","v":0},null,null,null,null,null,null,null,0,{"$f":"IF('Shooter Information'!$E$3-('Shooter Information'!$G$3-RANK(K62,K$4:K$78,1))<0,0,'Shooter Information'!$E$3-('Shooter Information'!$G$3-RANK(K62,K$4:K$78,1)))","v":0},0]
[60,{"$f":"'Shooter Information'!B65","v":0},{"$f":"'Shooter Information'!C65","v":0},null,null,null,null,null,null,null,0,{"$f":"IF('Shooter Information'!$E$3-('Shooter Information'!$G$3-RANK(K63,K$4:K$78,1))<0,0,'Shooter Information'!$E$3-('Shooter Information'!$G$3-RANK(K63,K$4:K$78,1)))","v":0},0]
[61,{"$f":"'Shooter Information'!B66","v":0},{"$f":"'Shooter Information'!C66","v":0},null,null,null,null,null,null,null,{"$f":"(D64*5)+E64-F64+(G64*10)+(H64*30)+(I64*999)+(J64*999.99)","v":0},{"$f":"IF('Shooter Information'!$E$3-('Shooter Information'!$G$3-RANK(K64,K$4:K$78,1))<0,0,'Shooter Information'!$E$3-('Shooter Information'!$G$3-RANK(K64,K$4:K$78,1)))","v":0},{"$f":"(SUM(D64+G64+H64+I64+J64))","v":0}]
[62,{"$f":"'Shooter Information'!B67","v":0},{"$f":"'Shooter Information'!C67","v":0},null,null,null,null,null,null,null,0,{"$f":"IF('Shooter Information'!$E$3-('Shooter Information'!$G$3-RANK(K65,K$4:K$78,1))<0,0,'Shooter Information'!$E$3-('Shooter Information'!$G$3-RANK(K65,K$4:K$78,1)))","v":0},0]
[63,{"$f":"'Shooter Information'!B68","v":0},{"$f":"'Shooter Information'!C68","v":0},null,null,null,null,null,null,null,0,{"$f":"IF('Shooter Information'!$E$3-('Shooter Information'!$G$3-RANK(K66,K$4:K$78,1))<0,0,'Shooter Information'!$E$3-('Shooter Information'!$G$3-RANK(K66,K$4:K$78,1)))","v":0},0]
[64,{"$f":"'Shooter Information'!B69","v":0},{"$f":"'Shooter Information'!C69","v":0},null,null,null,null,null,null,null,0,{"$f":"IF('Shooter Information'!$E$3-('Shooter Information'!$G$3-RANK(K67,K$4:K$78,1))<0,0,'Shooter Information'!$E$3-('Shooter Information'!$G$3-RANK(K67,K$4:K$78,1)))","v":0},0]
[65,{"$f":"'Shooter Information'!B70","v":0},{"$f":"'Shooter Information'!C70","v":0},null,null,null,null,null,null,null,0,{"$f":"IF('Shooter Information'!$E$3-('Shooter Information'!$G$3-RANK(K68,K$4:K$78,1))<0,0,'Shooter Information'!$E$3-('Shooter Information'!$G$3-RANK(K68,K$4:K$78,1)))","v":0},0]
[66,{"$f":"'Shooter Information'!B71","v":0},{"$f":"'Shooter Information'!C71","v":0},null,null,null,null,null,null,null,0,{"$f":"IF('Shooter Information'!$E$3-('Shooter Information'!$G$3-RANK(K69,K$4:K$78,1))<0,0,'Shooter Information'!$E$3-('Shooter Information'!$G$3-RANK(K69,K$4:K$78,1)))","v":0},0]
[67,{"$f":"'Shooter Information'!B72","v":0},{"$f":"'Shooter Information'!C72","v":0},null,null,null,null,null,null,null,0,{"$f":"IF('Shooter Information'!$E$3-('Shooter Information'!$G$3-RANK(K70,K$4:K$78,1))<0,0,'Shooter Information'!$E$3-('Shooter Information'!$G$3-RANK(K70,K$4:K$78,1)))","v":0},0]
[68,{"$f":"'Shooter Information'!B73","v":0},{"$f":"'Shooter Information'!C73","v":0},null,null,null,null,null,null,null,0,{"$f":"IF('Shooter Information'!$E$3-('Shooter Information'!$G$3-RANK(K71,K$4:K$78,1))<0,0,'Shooter Information'!$E$3-('Shooter Information'!$G$3-RANK(K71,K$4:K$78,1)))","v":0},0]
[69,{"$f":"'Shooter Information'!B74","v":0},{"$f":"'Shooter Information'!C74","v":0},null,null,null,null,null,null,null,0,{"$f":"IF('Shooter Information'!$E$3-('Shooter Information'!$G$3-RANK(K72,K$4:K$78,1))<0,0,'Shooter Information'!$E$3-('Shooter Information'!$G$3-RANK(K72,K$4:K$78,1)))","v":0},0]
[70,{"$f":"'Shooter Information'!B75","v":0},{"$f":"'Shooter Information'!C75","v":0},null,null,null,null,null,null,null,0,{"$f":"IF('Shooter Information'!$E$3-('Shooter Information'!$G$3-RANK(K73,K$4:K$78,1))<0,0,'Shooter Information'!$E$3-('Shooter Information'!$G$3-RANK(K73,K$4:K$78,1)))","v":0},0]
[71,{"$f":"'Shooter Information'!B76","v":0},{"$f":"'Shooter Information'!C76","v":0},null,null,null,null,null,null,null,0,{"$f":"IF('Shooter Information'!$E$3-('Shooter Information'!$G$3-RANK(K74,K$4:K$78,1))<0,0,'Shooter Information'!$E$3-('Shooter Information'!$G$3-RANK(K74,K$4:K$78,1)))","v":0},0]
[72,{"$f":"'Shooter Information'!B77","v":0},{"$f":"'Shooter Information'!C77","v":0},null,null,null,null,null,null,null,0,{"$f":"IF('Shooter Information'!$E$3-('Shooter Information'!$G$3-RANK(K75,K$4:K$78,1))<0,0,'Shooter Information'!$E$3-('Shooter Information'!$G$3-RANK(K75,K$4:K$78,1)))","v":0},0]
[73,{"$f":"'Shooter Information'!B78","v":0},{"$f":"'Shooter Information'!C78","v":0},null,null,null,null,null,null,null,0,{"$f":"IF('Shooter Information'!$E$3-('Shooter Information'!$G$3-RANK(K76,K$4:K$78,1))<0,0,'Shooter Information'!$E$3-('Shooter Information'!$G$3-RANK(K76,K$4:K$78,1)))","v":0},0]
[74,{"$f":"'Shooter Information'!B79","v":0},{"$f":"'Shooter Information'!C79","v":0},null,null,null,null,null,null,null,0,{"$f":"IF('Shooter Information'!$E$3-('Shooter Information'!$G$3-RANK(K77,K$4:K$78,1))<0,0,'Shooter Information'!$E$3-('Shooter Information'!$G$3-RANK(K77,K$4:K$78,1)))","v":0},0]
[75,{"$f":"'Shooter Information'!B80","v":0},{"$f":"'Shooter Information'!C80","v":0},null,null,null,null,null,null,null,0,{"$f":"IF('Shooter Information'!$E$3-('Shooter Information'!$G$3-RANK(K78,K$4:K$78,1))<0,0,'Shooter Information'!$E$3-('Shooter Information'!$G$3-RANK(K78,K$4:K$78,1)))","v":0},0]

{"sheet":"Score Summary","index":7,"n_rows":79,"n_cols":23,"rows_kept":79,"cut":false,"hidden":false,"merged":[]}
[{"$f":"'Shooter Information'!$E$1","v":"Cavalier Cowboys"}]
["SCORE SUMMARY SHEET"]
[{"$f":"'Shooter Information'!$E$2","v":"Wednesday April 9th, 2014"}]
["Finish","Shooter","Class","Stage 1","Rank 1","Stage 2","Rank 2","Stage 3","Rank 3","Stage 4","Rank 4","Stage 5","Rank 5","Stage 6","Rank 6","Grand Total","Rank Total","CAD",null,"Time Sort","Rank Sort","Class Sort","Orig Sort"]
[{"$f":"IF(ISBLANK('Shooter Information'!B9),,ROW()-4)","v":1},{"$f":"'Shooter Information'!B9","v":"B.S. Walker"},{"$f":"'Shooter Information'!C9","v":0},{"$f":"+'Stage 1'!K7","v":23.61},{"$f":"+'Stage 1'!L7","v":2},{"$f":"+'Stage 2'!K7","v":30.24},{"$f":"+'Stage 2'!L7","v":2},{"$f":"+'Stage 3'!K7","v":29.59},{"$f":"+'Stage 3'!L7","v":1},{"$f":"+'Stage 4'!K7","v":32.700000000000003},{"$f":"+'Stage 4'!L7","v":1},{"$f":"+'Stage 5'!K7","v":38.89},{"$f":"+'Stage 5'!L7","v":2},{"$f":"+'Stage 6'!K7","v":33.18},{"$f":"+'Stage 6'!L7","v":1},{"$f":"+D5+F5+H5+J5+L5+N5","v":188.21},{"$f":"+E5+G5+I5+K5+M5+O5","v":9},{"$f":"IF(ISBLANK('Shooter Information'!B9),,IF(SUM('Stage 1'!M7,'Stage 2'!M7,'Stage 3'!M7,'Stage 4'!M7,'Stage 5'!M7,'Stage 6'!M7)=0,\"Yes\",\"No\"))","v":"No"},null,{"$f":"IF(P5=0,99999,P5)","v":188.21},{"$f":"IF(Q5=0,99999,Q5)","v":9},{"$f":"IF(ISBLANK('Shooter Information'!C9),\"ZZZZZZZZZZ\",C5)","v":"ZZZZZZZZZZ"},{"$f":"CELL(\"row\",'Shooter Information'!B9)","v":9}]
[{"$f":"IF(ISBLANK('Shooter Information'!B8),,ROW()-4)","v":2},{"$f":"'Shooter Information'!B8","v":"Cold Blue Mike"},{"$f":"'Shooter Information'!C8","v":0},{"$f":"+'Stage 1'!K6","v":24.07},{"$f":"+'Stage 1'!L6","v":3},{"$f":"+'Stage 2'!K6","v":31.3},{"$f":"+'Stage 2'!L6","v":3},{"$f":"+'Stage 3'!K6","v":36.17},{"$f":"+'Stage 3'!L6","v":2},{"$f":"+'Stage 4'!K6","v":38.81},{"$f":"+'Stage 4'!L6","v":2},{"$f":"+'Stage 5'!K6","v":35.9},{"$f":"+'Stage 5'!L6","v":1},{"$f":"+'Stage 6'!K6","v":38.08},{"$f":"+'Stage 6'!L6","v":3},{"$f":"+D6+F6+H6+J6+L6+N6","v":204.33000000000004},{"$f":"+E6+G6+I6+K6+M6+O6","v":14},{"$f":"IF(ISBLANK('Shooter Information'!B8),,IF(SUM('Stage 1'!M6,'Stage 2'!M6,'Stage 3'!M6,'Stage 4'!M6,'Stage 5'!M6,'Stage 6'!M6)=0,\"Yes\",\"No\"))","v":"No"},null,{"$f":"IF(P6=0,99999,P6)","v":204.33000000000004},{"$f":"IF(Q6=0,99999,Q6)","v":14},{"$f":"IF(ISBLANK('Shooter Information'!C8),\"ZZZZZZZZZZ\",C6)","v":"ZZZZZZZZZZ"},{"$f":"CELL(\"row\",'Shooter Information'!B8)","v":8}]
[{"$f":"IF(ISBLANK('Shooter Information'!B6),,ROW()-4)","v":3},{"$f":"'Shooter Information'!B6","v":"Striker"},{"$f":"'Shooter Information'!C6","v":0},{"$f":"+'Stage 1'!K4","v":22.75},{"$f":"+'Stage 1'!L4","v":1},{"$f":"+'Stage 2'!K4","v":27.22},{"$f":"+'Stage 2'!L4","v":1},{"$f":"+'Stage 3'!K4","v":999},{"$f":"+'Stage 3'!L4","v":4},{"$f":"+'Stage 4'!K4","v":999},{"$f":"+'Stage 4'!L4","v":4},{"$f":"+'Stage 5'!K4","v":999},{"$f":"+'Stage 5'!L4","v":4},{"$f":"+'Stage 6'!K4","v":999},{"$f":"+'Stage 6'!L4","v":4},{"$f":"+D7+F7+H7+J7+L7+N7","v":4045.9700000000003},{"$f":"+E7+G7+I7+K7+M7+O7","v":18},{"$f":"IF(ISBLANK('Shooter Information'!B6),,IF(SUM('Stage 1'!M4,'Stage 2'!M4,'Stage 3'!M4,'Stage 4'!M4,'Stage 5'!M4,'Stage 6'!M4)=0,\"Yes\",\"No\"))","v":"No"},null,{"$f":"IF(P7=0,99999,P7)","v":4045.9700000000003},{"$f":"IF(Q7=0,99999,Q7)","v":18},{"$f":"IF(ISBLANK('Shooter Information'!C6),\"ZZZZZZZZZZ\",C7)","v":"ZZZZZZZZZZ"},{"$f":"CELL(\"row\",'Shooter Information'!B6)","v":6}]
[{"$f":"IF(ISBLANK('Shooter Information'!B7),,ROW()-4)","v":4},{"$f":"'Shooter Information'!B7","v":"Doc Deadwood"},{"$f":"'Shooter Information'!C7","v":0},{"$f":"+'Stage 1'!K5","v":31.73},{"$f":"+'Stage 1'!L5","v":4},{"$f":"+'Stage 2'!K5","v":46.81},{"$f":"+'Stage 2'!L5","v":4},{"$f":"+'Stage 3'!K5","v":44.43},{"$f":"+'Stage 3'!L5","v":3},{"$f":"+'Stage 4'!K5","v":41.76},{"$f":"+'Stage 4'!L5","v":3},{"$f":"+'Stage 5'!K5","v":60.11},{"$f":"+'Stage 5'!L5","v":3},{"$f":"+'Stage 6'!K5","v":36.69},{"$f":"+'Stage 6'!L5","v":2},{"$f":"+D8+F8+H8+J8+L8+N8","v":261.52999999999997},{"$f":"+E8+G8+I8+K8+M8+O8","v":19},{"$f":"IF(ISBLANK('Shooter Information'!B7),,IF(SUM('Stage 1'!M5,'Stage 2'!M5,'Stage 3'!M5,'Stage 4'!M5,'Stage 5'!M5,'Stage 6'!M5)=0,\"Yes\",\"No\"))","v":"No"},null,{"$f":"IF(P8=0,99999,P8)","v":261.52999999999997},{"$f":"IF(Q8=0,99999,Q8)","v":19},{"$f":"IF(ISBLANK('Shooter Information'!C7),\"ZZZZZZZZZZ\",C8)","v":"ZZZZZZZZZZ"},{"$f":"CELL(\"row\",'Shooter Information'!B7)","v":7}]
[{"$f":"IF(ISBLANK('Shooter Information'!B10),,ROW()-4)","v":0},{"$f":"'Shooter Information'!B10","v":0},{"$f":"'Shooter Information'!C10","v":0},{"$f":"+'Stage 1'!K8","v":0},{"$f":"+'Stage 1'!L8","v":0},{"$f":"+'Stage 2'!K8","v":0},{"$f":"+'Stage 2'!L8","v":0},{"$f":"+'Stage 3'!K8","v":0},{"$f":"+'Stage 3'!L8","v":0},{"$f":"+'Stage 4'!K8","v":0},{"$f":"+'Stage 4'!L8","v":0},{"$f":"+'Stage 5'!K8","v":0},{"$f":"+'Stage 5'!L8","v":0},{"$f":"+'Stage 6'!K8","v":0},{"$f":"+'Stage 6'!L8","v":0},{"$f":"+D9+F9+H9+J9+L9+N9","v":0},{"$f":"+E9+G9+I9+K9+M9+O9","v":0},{"$f":"IF(ISBLANK('Shooter Information'!B10),,IF(SUM('Stage 1'!M8,'Stage 2'!M8,'Stage 3'!M8,'Stage 4'!M8,'Stage 5'!M8,'Stage 6'!M8)=0,\"Yes\",\"No\"))","v":0},null,{"$f":"IF(P9=0,99999,P9)","v":99999},{"$f":"IF(Q9=0,99999,Q9)","v":99999},{"$f":"IF(ISBLANK('Shooter Information'!C10),\"ZZZZZZZZZZ\",C9)","v":"ZZZZZZZZZZ"},{"$f":"CELL(\"row\",'Shooter Information'!B10)","v":10}]
[{"$f":"IF(ISBLANK('Shooter Information'!B11),,ROW()-4)","v":0},{"$f":"'Shooter Information'!B11","v":0},{"$f":"'Shooter Information'!C11","v":0},{"$f":"+'Stage 1'!K9","v":0},{"$f":"+'Stage 1'!L9","v":0},{"$f":"+'Stage 2'!K9","v":0},{"$f":"+'Stage 2'!L9","v":0},{"$f":"+'Stage 3'!K9","v":0},{"$f":"+'Stage 3'!L9","v":0},{"$f":"+'Stage 4'!K9","v":0},{"$f":"+'Stage 4'!L9","v":0},{"$f":"+'Stage 5'!K9","v":0},{"$f":"+'Stage 5'!L9","v":0},{"$f":"+'Stage 6'!K9","v":0},{"$f":"+'Stage 6'!L9","v":0},{"$f":"+D10+F10+H10+J10+L10+N10","v":0},{"$f":"+E10+G10+I10+K10+M10+O10","v":0},{"$f":"IF(ISBLANK('Shooter Information'!B11),,IF(SUM('Stage 1'!M9,'Stage 2'!M9,'Stage 3'!M9,'Stage 4'!M9,'Stage 5'!M9,'Stage 6'!M9)=0,\"Yes\",\"No\"))","v":0},null,{"$f":"IF(P10=0,99999,P10)","v":99999},{"$f":"IF(Q10=0,99999,Q10)","v":99999},{"$f":"IF(ISBLANK('Shooter Information'!C11),\"ZZZZZZZZZZ\",C10)","v":"ZZZZZZZZZZ"},{"$f":"CELL(\"row\",'Shooter Information'!B11)","v":11}]
[{"$f":"IF(ISBLANK('Shooter Information'!B12),,ROW()-4)","v":0},{"$f":"'Shooter Information'!B12","v":0},{"$f":"'Shooter Information'!C12","v":0},{"$f":"+'Stage 1'!K10","v":0},{"$f":"+'Stage 1'!L10","v":0},{"$f":"+'Stage 2'!K10","v":0},{"$f":"+'Stage 2'!L10","v":0},{"$f":"+'Stage 3'!K10","v":0},{"$f":"+'Stage 3'!L10","v":0},{"$f":"+'Stage 4'!K10","v":0},{"$f":"+'Stage 4'!L10","v":0},{"$f":"+'Stage 5'!K10","v":0},{"$f":"+'Stage 5'!L10","v":0},{"$f":"+'Stage 6'!K10","v":0},{"$f":"+'Stage 6'!L10","v":0},{"$f":"+D11+F11+H11+J11+L11+N11","v":0},{"$f":"+E11+G11+I11+K11+M11+O11","v":0},{"$f":"IF(ISBLANK('Shooter Information'!B12),,IF(SUM('Stage 1'!M10,'Stage 2'!M10,'Stage 3'!M10,'Stage 4'!M10,'Stage 5'!M10,'Stage 6'!M10)=0,\"Yes\",\"No\"))","v":0},null,{"$f":"IF(P11=0,99999,P11)","v":99999},{"$f":"IF(Q11=0,99999,Q11)","v":99999},{"$f":"IF(ISBLANK('Shooter Information'!C12),\"ZZZZZZZZZZ\",C11)","v":"ZZZZZZZZZZ"},{"$f":"CELL(\"row\",'Shooter Information'!B12)","v":12}]
[{"$f":"IF(ISBLANK('Shooter Information'!B13),,ROW()-4)","v":0},{"$f":"'Shooter Information'!B13","v":0},{"$f":"'Shooter Information'!C13","v":0},{"$f":"+'Stage 1'!K11","v":0},{"$f":"+'Stage 1'!L11","v":0},{"$f":"+'Stage 2'!K11","v":0},{"$f":"+'Stage 2'!L11","v":0},{"$f":"+'Stage 3'!K11","v":0},{"$f":"+'Stage 3'!L11","v":0},{"$f":"+'Stage 4'!K11","v":0},{"$f":"+'Stage 4'!L11","v":0},{"$f":"+'Stage 5'!K11","v":0},{"$f":"+'Stage 5'!L11","v":0},{"$f":"+'Stage 6'!K11","v":0},{"$f":"+'Stage 6'!L11","v":0},{"$f":"+D12+F12+H12+J12+L12+N12","v":0},{"$f":"+E12+G12+I12+K12+M12+O12","v":0},{"$f":"IF(ISBLANK('Shooter Information'!B13),,IF(SUM('Stage 1'!M11,'Stage 2'!M11,'Stage 3'!M11,'Stage 4'!M11,'Stage 5'!M11,'Stage 6'!M11)=0,\"Yes\",\"No\"))","v":0},null,{"$f":"IF(P12=0,99999,P12)","v":99999},{"$f":"IF(Q12=0,99999,Q12)","v":99999},{"$f":"IF(ISBLANK('Shooter Information'!C13),\"ZZZZZZZZZZ\",C12)","v":"ZZZZZZZZZZ"},{"$f":"CELL(\"row\",'Shooter Information'!B13)","v":13}]
[{"$f":"IF(ISBLANK('Shooter Information'!B14),,ROW()-4)","v":0},{"$f":"'Shooter Information'!B14","v":0},{"$f":"'Shooter Information'!C14","v":0},{"$f":"+'Stage 1'!K12","v":0},{"$f":"+'Stage 1'!L12","v":0},{"$f":"+'Stage 2'!K12","v":0},{"$f":"+'Stage 2'!L12","v":0},{"$f":"+'Stage 3'!K12","v":0},{"$f":"+'Stage 3'!L12","v":0},{"$f":"+'Stage 4'!K12","v":0},{"$f":"+'Stage 4'!L12","v":0},{"$f":"+'Stage 5'!K12","v":0},{"$f":"+'Stage 5'!L12","v":0},{"$f":"+'Stage 6'!K12","v":0},{"$f":"+'Stage 6'!L12","v":0},{"$f":"+D13+F13+H13+J13+L13+N13","v":0},{"$f":"+E13+G13+I13+K13+M13+O13","v":0},{"$f":"IF(ISBLANK('Shooter Information'!B14),,IF(SUM('Stage 1'!M12,'Stage 2'!M12,'Stage 3'!M12,'Stage 4'!M12,'Stage 5'!M12,'Stage 6'!M12)=0,\"Yes\",\"No\"))","v":0},null,{"$f":"IF(P13=0,99999,P13)","v":99999},{"$f":"IF(Q13=0,99999,Q13)","v":99999},{"$f":"IF(ISBLANK('Shooter Information'!C14),\"ZZZZZZZZZZ\",C13)","v":"ZZZZZZZZZZ"},{"$f":"CELL(\"row\",'Shooter Information'!B14)","v":14}]
[{"$f":"IF(ISBLANK('Shooter Information'!B15),,ROW()-4)","v":0},{"$f":"'Shooter Information'!B15","v":0},{"$f":"'Shooter Information'!C15","v":0},{"$f":"+'Stage 1'!K13","v":0},{"$f":"+'Stage 1'!L13","v":0},{"$f":"+'Stage 2'!K13","v":0},{"$f":"+'Stage 2'!L13","v":0},{"$f":"+'Stage 3'!K13","v":0},{"$f":"+'Stage 3'!L13","v":0},{"$f":"+'Stage 4'!K13","v":0},{"$f":"+'Stage 4'!L13","v":0},{"$f":"+'Stage 5'!K13","v":0},{"$f":"+'Stage 5'!L13","v":0},{"$f":"+'Stage 6'!K13","v":0},{"$f":"+'Stage 6'!L13","v":0},{"$f":"+D14+F14+H14+J14+L14+N14","v":0},{"$f":"+E14+G14+I14+K14+M14+O14","v":0},{"$f":"IF(ISBLANK('Shooter Information'!B15),,IF(SUM('Stage 1'!M13,'Stage 2'!M13,'Stage 3'!M13,'Stage 4'!M13,'Stage 5'!M13,'Stage 6'!M13)=0,\"Yes\",\"No\"))","v":0},null,{"$f":"IF(P14=0,99999,P14)","v":99999},{"$f":"IF(Q14=0,99999,Q14)","v":99999},{"$f":"IF(ISBLANK('Shooter Information'!C15),\"ZZZZZZZZZZ\",C14)","v":"ZZZZZZZZZZ"},{"$f":"CELL(\"row\",'Shooter Information'!B15)","v":15}]
[{"$f":"IF(ISBLANK('Shooter Information'!B16),,ROW()-4)","v":0},{"$f":"'Shooter Information'!B16","v":0},{"$f":"'Shooter Information'!C16","v":0},{"$f":"+'Stage 1'!K14","v":0},{"$f":"+'Stage 1'!L14","v":0},{"$f":"+'Stage 2'!K14","v":0},{"$f":"+'Stage 2'!L14","v":0},{"$f":"+'Stage 3'!K14","v":0},{"$f":"+'Stage 3'!L14","v":0},{"$f":"+'Stage 4'!K14","v":0},{"$f":"+'Stage 4'!L14","v":0},{"$f":"+'Stage 5'!K14","v":0},{"$f":"+'Stage 5'!L14","v":0},{"$f":"+'Stage 6'!K14","v":0},{"$f":"+'Stage 6'!L14","v":0},{"$f":"+D15+F15+H15+J15+L15+N15","v":0},{"$f":"+E15+G15+I15+K15+M15+O15","v":0},{"$f":"IF(ISBLANK('Shooter Information'!B16),,IF(SUM('Stage 1'!M14,'Stage 2'!M14,'Stage 3'!M14,'Stage 4'!M14,'Stage 5'!M14,'Stage 6'!M14)=0,\"Yes\",\"No\"))","v":0},null,{"$f":"IF(P15=0,99999,P15)","v":99999},{"$f":"IF(Q15=0,99999,Q15)","v":99999},{"$f":"IF(ISBLANK('Shooter Information'!C16),\"ZZZZZZZZZZ\",C15)","v":"ZZZZZZZZZZ"},{"$f":"CELL(\"row\",'Shooter Information'!B16)","v":16}]
[{"$f":"IF(ISBLANK('Shooter Information'!B17),,ROW()-4)","v":0},{"$f":"'Shooter Information'!B17","v":0},{"$f":"'Shooter Information'!C17","v":0},{"$f":"+'Stage 1'!K15","v":0},{"$f":"+'Stage 1'!L15","v":0},{"$f":"+'Stage 2'!K15","v":0},{"$f":"+'Stage 2'!L15","v":0},{"$f":"+'Stage 3'!K15","v":0},{"$f":"+'Stage 3'!L15","v":0},{"$f":"+'Stage 4'!K15","v":0},{"$f":"+'Stage 4'!L15","v":0},{"$f":"+'Stage 5'!K15","v":0},{"$f":"+'Stage 5'!L15","v":0},{"$f":"+'Stage 6'!K15","v":0},{"$f":"+'Stage 6'!L15","v":0},{"$f":"+D16+F16+H16+J16+L16+N16","v":0},{"$f":"+E16+G16+I16+K16+M16+O16","v":0},{"$f":"IF(ISBLANK('Shooter Information'!B17),,IF(SUM('Stage 1'!M15,'Stage 2'!M15,'Stage 3'!M15,'Stage 4'!M15,'Stage 5'!M15,'Stage 6'!M15)=0,\"Yes\",\"No\"))","v":0},null,{"$f":"IF(P16=0,99999,P16)","v":99999},{"$f":"IF(Q16=0,99999,Q16)","v":99999},{"$f":"IF(ISBLANK('Shooter Information'!C17),\"ZZZZZZZZZZ\",C16)","v":"ZZZZZZZZZZ"},{"$f":"CELL(\"row\",'Shooter Information'!B17)","v":17}]
[{"$f":"IF(ISBLANK('Shooter Information'!B18),,ROW()-4)","v":0},{"$f":"'Shooter Information'!B18","v":0},{"$f":"'Shooter Information'!C18","v":0},{"$f":"+'Stage 1'!K16","v":0},{"$f":"+'Stage 1'!L16","v":0},{"$f":"+'Stage 2'!K16","v":0},{"$f":"+'Stage 2'!L16","v":0},{"$f":"+'Stage 3'!K16","v":0},{"$f":"+'Stage 3'!L16","v":0},{"$f":"+'Stage 4'!K16","v":0},{"$f":"+'Stage 4'!L16","v":0},{"$f":"+'Stage 5'!K16","v":0},{"$f":"+'Stage 5'!L16","v":0},{"$f":"+'Stage 6'!K16","v":0},{"$f":"+'Stage 6'!L16","v":0},{"$f":"+D17+F17+H17+J17+L17+N17","v":0},{"$f":"+E17+G17+I17+K17+M17+O17","v":0},{"$f":"IF(ISBLANK('Shooter Information'!B18),,IF(SUM('Stage 1'!M16,'Stage 2'!M16,'Stage 3'!M16,'Stage 4'!M16,'Stage 5'!M16,'Stage 6'!M16)=0,\"Yes\",\"No\"))","v":0},null,{"$f":"IF(P17=0,99999,P17)","v":99999},{"$f":"IF(Q17=0,99999,Q17)","v":99999},{"$f":"IF(ISBLANK('Shooter Information'!C18),\"ZZZZZZZZZZ\",C17)","v":"ZZZZZZZZZZ"},{"$f":"CELL(\"row\",'Shooter Information'!B18)","v":18}]
[{"$f":"IF(ISBLANK('Shooter Information'!B19),,ROW()-4)","v":0},{"$f":"'Shooter Information'!B19","v":0},{"$f":"'Shooter Information'!C19","v":0},{"$f":"+'Stage 1'!K17","v":0},{"$f":"+'Stage 1'!L17","v":0},{"$f":"+'Stage 2'!K17","v":0},{"$f":"+'Stage 2'!L17","v":0},{"$f":"+'Stage 3'!K17","v":0},{"$f":"+'Stage 3'!L17","v":0},{"$f":"+'Stage 4'!K17","v":0},{"$f":"+'Stage 4'!L17","v":0},{"$f":"+'Stage 5'!K17","v":0},{"$f":"+'Stage 5'!L17","v":0},{"$f":"+'Stage 6'!K17","v":0},{"$f":"+'Stage 6'!L17","v":0},{"$f":"+D18+F18+H18+J18+L18+N18","v":0},{"$f":"+E18+G18+I18+K18+M18+O18","v":0},{"$f":"IF(ISBLANK('Shooter Information'!B19),,IF(SUM('Stage 1'!M17,'Stage 2'!M17,'Stage 3'!M17,'Stage 4'!M17,'Stage 5'!M17,'Stage 6'!M17)=0,\"Yes\",\"No\"))","v":0},null,{"$f":"IF(P18=0,99999,P18)","v":99999},{"$f":"IF(Q18=0,99999,Q18)","v":99999},{"$f":"IF(ISBLANK('Shooter Information'!C19),\"ZZZZZZZZZZ\",C18)","v":"ZZZZZZZZZZ"},{"$f":"CELL(\"row\",'Shooter Information'!B19)","v":19}]
[{"$f":"IF(ISBLANK('Shooter Information'!B20),,ROW()-4)","v":0},{"$f":"'Shooter Information'!B20","v":0},{"$f":"'Shooter Information'!C20","v":0},{"$f":"+'Stage 1'!K18","v":0},{"$f":"+'Stage 1'!L18","v":0},{"$f":"+'Stage 2'!K18","v":0},{"$f":"+'Stage 2'!L18","v":0},{"$f":"+'Stage 3'!K18","v":0},{"$f":"+'Stage 3'!L18","v":0},{"$f":"+'Stage 4'!K18","v":0},{"$f":"+'Stage 4'!L18","v":0},{"$f":"+'Stage 5'!K18","v":0},{"$f":"+'Stage 5'!L18","v":0},{"$f":"+'Stage 6'!K18","v":0},{"$f":"+'Stage 6'!L18","v":0},{"$f":"+D19+F19+H19+J19+L19+N19","v":0},{"$f":"+E19+G19+I19+K19+M19+O19","v":0},{"$f":"IF(ISBLANK('Shooter Information'!B20),,IF(SUM('Stage 1'!M18,'Stage 2'!M18,'Stage 3'!M18,'Stage 4'!M18,'Stage 5'!M18,'Stage 6'!M18)=0,\"Yes\",\"No\"))","v":0},null,{"$f":"IF(P19=0,99999,P19)","v":99999},{"$f":"IF(Q19=0,99999,Q19)","v":99999},{"$f":"IF(ISBLANK('Shooter Information'!C20),\"ZZZZZZZZZZ\",C19)","v":"ZZZZZZZZZZ"},{"$f":"CELL(\"row\",'Shooter Information'!B20)","v":20}]
[{"$f":"IF(ISBLANK('Shooter Information'!B21),,ROW()-4)","v":0},{"$f":"'Shooter Information'!B21","v":0},{"$f":"'Shooter Information'!C21","v":0},{"$f":"+'Stage 1'!K19","v":0},{"$f":"+'Stage 1'!L19","v":0},{"$f":"+'Stage 2'!K19","v":0},{"$f":"+'Stage 2'!L19","v":0},{"$f":"+'Stage 3'!K19","v":0},{"$f":"+'Stage 3'!L19","v":0},{"$f":"+'Stage 4'!K19","v":0},{"$f":"+'Stage 4'!L19","v":0},{"$f":"+'Stage 5'!K19","v":0},{"$f":"+'Stage 5'!L19","v":0},{"$f":"+'Stage 6'!K19","v":0},{"$f":"+'Stage 6'!L19","v":0},{"$f":"+D20+F20+H20+J20+L20+N20","v":0},{"$f":"+E20+G20+I20+K20+M20+O20","v":0},{"$f":"IF(ISBLANK('Shooter Information'!B21),,IF(SUM('Stage 1'!M19,'Stage 2'!M19,'Stage 3'!M19,'Stage 4'!M19,'Stage 5'!M19,'Stage 6'!M19)=0,\"Yes\",\"No\"))","v":0},null,{"$f":"IF(P20=0,99999,P20)","v":99999},{"$f":"IF(Q20=0,99999,Q20)","v":99999},{"$f":"IF(ISBLANK('Shooter Information'!C21),\"ZZZZZZZZZZ\",C20)","v":"ZZZZZZZZZZ"},{"$f":"CELL(\"row\",'Shooter Information'!B21)","v":21}]
[{"$f":"IF(ISBLANK('Shooter Information'!B22),,ROW()-4)","v":0},{"$f":"'Shooter Information'!B22","v":0},{"$f":"'Shooter Information'!C22","v":0},{"$f":"+'Stage 1'!K20","v":0},{"$f":"+'Stage 1'!L20","v":0},{"$f":"+'Stage 2'!K20","v":0},{"$f":"+'Stage 2'!L20","v":0},{"$f":"+'Stage 3'!K20","v":0},{"$f":"+'Stage 3'!L20","v":0},{"$f":"+'Stage 4'!K20","v":0},{"$f":"+'Stage 4'!L20","v":0},{"$f":"+'Stage 5'!K20","v":0},{"$f":"+'Stage 5'!L20","v":0},{"$f":"+'Stage 6'!K20","v":0},{"$f":"+'Stage 6'!L20","v":0},{"$f":"+D21+F21+H21+J21+L21+N21","v":0},{"$f":"+E21+G21+I21+K21+M21+O21","v":0},{"$f":"IF(ISBLANK('Shooter Information'!B22),,IF(SUM('Stage 1'!M20,'Stage 2'!M20,'Stage 3'!M20,'Stage 4'!M20,'Stage 5'!M20,'Stage 6'!M20)=0,\"Yes\",\"No\"))","v":0},null,{"$f":"IF(P21=0,99999,P21)","v":99999},{"$f":"IF(Q21=0,99999,Q21)","v":99999},{"$f":"IF(ISBLANK('Shooter Information'!C22),\"ZZZZZZZZZZ\",C21)","v":"ZZZZZZZZZZ"},{"$f":"CELL(\"row\",'Shooter Information'!B22)","v":22}]
[{"$f":"IF(ISBLANK('Shooter Information'!B23),,ROW()-4)","v":0},{"$f":"'Shooter Information'!B23","v":0},{"$f":"'Shooter Information'!C23","v":0},{"$f":"+'Stage 1'!K21","v":0},{"$f":"+'Stage 1'!L21","v":0},{"$f":"+'Stage 2'!K21","v":0},{"$f":"+'Stage 2'!L21","v":0},{"$f":"+'Stage 3'!K21","v":0},{"$f":"+'Stage 3'!L21","v":0},{"$f":"+'Stage 4'!K21","v":0},{"$f":"+'Stage 4'!L21","v":0},{"$f":"+'Stage 5'!K21","v":0},{"$f":"+'Stage 5'!L21","v":0},{"$f":"+'Stage 6'!K21","v":0},{"$f":"+'Stage 6'!L21","v":0},{"$f":"+D22+F22+H22+J22+L22+N22","v":0},{"$f":"+E22+G22+I22+K22+M22+O22","v":0},{"$f":"IF(ISBLANK('Shooter Information'!B23),,IF(SUM('Stage 1'!M21,'Stage 2'!M21,'Stage 3'!M21,'Stage 4'!M21,'Stage 5'!M21,'Stage 6'!M21)=0,\"Yes\",\"No\"))","v":0},null,{"$f":"IF(P22=0,99999,P22)","v":99999},{"$f":"IF(Q22=0,99999,Q22)","v":99999},{"$f":"IF(ISBLANK('Shooter Information'!C23),\"ZZZZZZZZZZ\",C22)","v":"ZZZZZZZZZZ"},{"$f":"CELL(\"row\",'Shooter Information'!B23)","v":23}]
[{"$f":"IF(ISBLANK('Shooter Information'!B24),,ROW()-4)","v":0},{"$f":"'Shooter Information'!B24","v":0},{"$f":"'Shooter Information'!C24","v":0},{"$f":"+'Stage 1'!K22","v":0},{"$f":"+'Stage 1'!L22","v":0},{"$f":"+'Stage 2'!K22","v":0},{"$f":"+'Stage 2'!L22","v":0},{"$f":"+'Stage 3'!K22","v":0},{"$f":"+'Stage 3'!L22","v":0},{"$f":"+'Stage 4'!K22","v":0},{"$f":"+'Stage 4'!L22","v":0},{"$f":"+'Stage 5'!K22","v":0},{"$f":"+'Stage 5'!L22","v":0},{"$f":"+'Stage 6'!K22","v":0},{"$f":"+'Stage 6'!L22","v":0},{"$f":"+D23+F23+H23+J23+L23+N23","v":0},{"$f":"+E23+G23+I23+K23+M23+O23","v":0},{"$f":"IF(ISBLANK('Shooter Information'!B24),,IF(SUM('Stage 1'!M22,'Stage 2'!M22,'Stage 3'!M22,'Stage 4'!M22,'Stage 5'!M22,'Stage 6'!M22)=0,\"Yes\",\"No\"))","v":0},null,{"$f":"IF(P23=0,99999,P23)","v":99999},{"$f":"IF(Q23=0,99999,Q23)","v":99999},{"$f":"IF(ISBLANK('Shooter Information'!C24),\"ZZZZZZZZZZ\",C23)","v":"ZZZZZZZZZZ"},{"$f":"CELL(\"row\",'Shooter Information'!B24)","v":24}]
[{"$f":"IF(ISBLANK('Shooter Information'!B25),,ROW()-4)","v":0},{"$f":"'Shooter Information'!B25","v":0},{"$f":"'Shooter Information'!C25","v":0},{"$f":"+'Stage 1'!K23","v":0},{"$f":"+'Stage 1'!L23","v":0},{"$f":"+'Stage 2'!K23","v":0},{"$f":"+'Stage 2'!L23","v":0},{"$f":"+'Stage 3'!K23","v":0},{"$f":"+'Stage 3'!L23","v":0},{"$f":"+'Stage 4'!K23","v":0},{"$f":"+'Stage 4'!L23","v":0},{"$f":"+'Stage 5'!K23","v":0},{"$f":"+'Stage 5'!L23","v":0},{"$f":"+'Stage 6'!K23","v":0},{"$f":"+'Stage 6'!L23","v":0},{"$f":"+D24+F24+H24+J24+L24+N24","v":0},{"$f":"+E24+G24+I24+K24+M24+O24","v":0},{"$f":"IF(ISBLANK('Shooter Information'!B25),,IF(SUM('Stage 1'!M23,'Stage 2'!M23,'Stage 3'!M23,'Stage 4'!M23,'Stage 5'!M23,'Stage 6'!M23)=0,\"Yes\",\"No\"))","v":0},null,{"$f":"IF(P24=0,99999,P24)","v":99999},{"$f":"IF(Q24=0,99999,Q24)","v":99999},{"$f":"IF(ISBLANK('Shooter Information'!C25),\"ZZZZZZZZZZ\",C24)","v":"ZZZZZZZZZZ"},{"$f":"CELL(\"row\",'Shooter Information'!B25)","v":25}]
[{"$f":"IF(ISBLANK('Shooter Information'!B26),,ROW()-4)","v":0},{"$f":"'Shooter Information'!B26","v":0},{"$f":"'Shooter Information'!C26","v":0},{"$f":"+'Stage 1'!K24","v":0},{"$f":"+'Stage 1'!L24","v":0},{"$f":"+'Stage 2'!K24","v":0},{"$f":"+'Stage 2'!L24","v":0},{"$f":"+'Stage 3'!K24","v":0},{"$f":"+'Stage 3'!L24","v":0},{"$f":"+'Stage 4'!K24","v":0},{"$f":"+'Stage 4'!L24","v":0},{"$f":"+'Stage 5'!K24","v":0},{"$f":"+'Stage 5'!L24","v":0},{"$f":"+'Stage 6'!K24","v":0},{"$f":"+'Stage 6'!L24","v":0},{"$f":"+D25+F25+H25+J25+L25+N25","v":0},{"$f":"+E25+G25+I25+K25+M25+O25","v":0},{"$f":"IF(ISBLANK('Shooter Information'!B26),,IF(SUM('Stage 1'!M24,'Stage 2'!M24,'Stage 3'!M24,'Stage 4'!M24,'Stage 5'!M24,'Stage 6'!M24)=0,\"Yes\",\"No\"))","v":0},null,{"$f":"IF(P25=0,99999,P25)","v":99999},{"$f":"IF(Q25=0,99999,Q25)","v":99999},{"$f":"IF(ISBLANK('Shooter Information'!C26),\"ZZZZZZZZZZ\",C25)","v":"ZZZZZZZZZZ"},{"$f":"CELL(\"row\",'Shooter Information'!B26)","v":26}]
[{"$f":"IF(ISBLANK('Shooter Information'!B27),,ROW()-4)","v":0},{"$f":"'Shooter Information'!B27","v":0},{"$f":"'Shooter Information'!C27","v":0},{"$f":"+'Stage 1'!K25","v":0},{"$f":"+'Stage 1'!L25","v":0},{"$f":"+'Stage 2'!K25","v":0},{"$f":"+'Stage 2'!L25","v":0},{"$f":"+'Stage 3'!K25","v":0},{"$f":"+'Stage 3'!L25","v":0},{"$f":"+'Stage 4'!K25","v":0},{"$f":"+'Stage 4'!L25","v":0},{"$f":"+'Stage 5'!K25","v":0},{"$f":"+'Stage 5'!L25","v":0},{"$f":"+'Stage 6'!K25","v":0},{"$f":"+'Stage 6'!L25","v":0},{"$f":"+D26+F26+H26+J26+L26+N26","v":0},{"$f":"+E26+G26+I26+K26+M26+O26","v":0},{"$f":"IF(ISBLANK('Shooter Information'!B27),,IF(SUM('Stage 1'!M25,'Stage 2'!M25,'Stage 3'!M25,'Stage 4'!M25,'Stage 5'!M25,'Stage 6'!M25)=0,\"Yes\",\"No\"))","v":0},null,{"$f":"IF(P26=0,99999,P26)","v":99999},{"$f":"IF(Q26=0,99999,Q26)","v":99999},{"$f":"IF(ISBLANK('Shooter Information'!C27),\"ZZZZZZZZZZ\",C26)","v":"ZZZZZZZZZZ"},{"$f":"CELL(\"row\",'Shooter Information'!B27)","v":27}]
[{"$f":"IF(ISBLANK('Shooter Information'!B28),,ROW()-4)","v":0},{"$f":"'Shooter Information'!B28","v":0},{"$f":"'Shooter Information'!C28","v":0},{"$f":"+'Stage 1'!K26","v":0},{"$f":"+'Stage 1'!L26","v":0},{"$f":"+'Stage 2'!K26","v":0},{"$f":"+'Stage 2'!L26","v":0},{"$f":"+'Stage 3'!K26","v":0},{"$f":"+'Stage 3'!L26","v":0},{"$f":"+'Stage 4'!K26","v":0},{"$f":"+'Stage 4'!L26","v":0},{"$f":"+'Stage 5'!K26","v":0},{"$f":"+'Stage 5'!L26","v":0},{"$f":"+'Stage 6'!K26","v":0},{"$f":"+'Stage 6'!L26","v":0},{"$f":"+D27+F27+H27+J27+L27+N27","v":0},{"$f":"+E27+G27+I27+K27+M27+O27","v":0},{"$f":"IF(ISBLANK('Shooter Information'!B28),,IF(SUM('Stage 1'!M26,'Stage 2'!M26,'Stage 3'!M26,'Stage 4'!M26,'Stage 5'!M26,'Stage 6'!M26)=0,\"Yes\",\"No\"))","v":0},null,{"$f":"IF(P27=0,99999,P27)","v":99999},{"$f":"IF(Q27=0,99999,Q27)","v":99999},{"$f":"IF(ISBLANK('Shooter Information'!C28),\"ZZZZZZZZZZ\",C27)","v":"ZZZZZZZZZZ"},{"$f":"CELL(\"row\",'Shooter Information'!B28)","v":28}]
[{"$f":"IF(ISBLANK('Shooter Information'!B29),,ROW()-4)","v":0},{"$f":"'Shooter Information'!B29","v":0},{"$f":"'Shooter Information'!C29","v":0},{"$f":"+'Stage 1'!K27","v":0},{"$f":"+'Stage 1'!L27","v":0},{"$f":"+'Stage 2'!K27","v":0},{"$f":"+'Stage 2'!L27","v":0},{"$f":"+'Stage 3'!K27","v":0},{"$f":"+'Stage 3'!L27","v":0},{"$f":"+'Stage 4'!K27","v":0},{"$f":"+'Stage 4'!L27","v":0},{"$f":"+'Stage 5'!K27","v":0},{"$f":"+'Stage 5'!L27","v":0},{"$f":"+'Stage 6'!K27","v":0},{"$f":"+'Stage 6'!L27","v":0},{"$f":"+D28+F28+H28+J28+L28+N28","v":0},{"$f":"+E28+G28+I28+K28+M28+O28","v":0},{"$f":"IF(ISBLANK('Shooter Information'!B29),,IF(SUM('Stage 1'!M27,'Stage 2'!M27,'Stage 3'!M27,'Stage 4'!M27,'Stage 5'!M27,'Stage 6'!M27)=0,\"Yes\",\"No\"))","v":0},null,{"$f":"IF(P28=0,99999,P28)","v":99999},{"$f":"IF(Q28=0,99999,Q28)","v":99999},{"$f":"IF(ISBLANK('Shooter Information'!C29),\"ZZZZZZZZZZ\",C28)","v":"ZZZZZZZZZZ"},{"$f":"CELL(\"row\",'Shooter Information'!B29)","v":29}]
[{"$f":"IF(ISBLANK('Shooter Information'!B30),,ROW()-4)","v":0},{"$f":"'Shooter Information'!B30","v":0},{"$f":"'Shooter Information'!C30","v":0},{"$f":"+'Stage 1'!K28","v":0},{"$f":"+'Stage 1'!L28","v":0},{"$f":"+'Stage 2'!K28","v":0},{"$f":"+'Stage 2'!L28","v":0},{"$f":"+'Stage 3'!K28","v":0},{"$f":"+'Stage 3'!L28","v":0},{"$f":"+'Stage 4'!K28","v":0},{"$f":"+'Stage 4'!L28","v":0},{"$f":"+'Stage 5'!K28","v":0},{"$f":"+'Stage 5'!L28","v":0},{"$f":"+'Stage 6'!K28","v":0},{"$f":"+'Stage 6'!L28","v":0},{"$f":"+D29+F29+H29+J29+L29+N29","v":0},{"$f":"+E29+G29+I29+K29+M29+O29","v":0},{"$f":"IF(ISBLANK('Shooter Information'!B30),,IF(SUM('Stage 1'!M28,'Stage 2'!M28,'Stage 3'!M28,'Stage 4'!M28,'Stage 5'!M28,'Stage 6'!M28)=0,\"Yes\",\"No\"))","v":0},null,{"$f":"IF(P29=0,99999,P29)","v":99999},{"$f":"IF(Q29=0,99999,Q29)","v":99999},{"$f":"IF(ISBLANK('Shooter Information'!C30),\"ZZZZZZZZZZ\",C29)","v":"ZZZZZZZZZZ"},{"$f":"CELL(\"row\",'Shooter Information'!B30)","v":30}]
[{"$f":"IF(ISBLANK('Shooter Information'!B31),,ROW()-4)","v":0},{"$f":"'Shooter Information'!B31","v":0},{"$f":"'Shooter Information'!C31","v":0},{"$f":"+'Stage 1'!K29","v":0},{"$f":"+'Stage 1'!L29","v":0},{"$f":"+'Stage 2'!K29","v":0},{"$f":"+'Stage 2'!L29","v":0},{"$f":"+'Stage 3'!K29","v":0},{"$f":"+'Stage 3'!L29","v":0},{"$f":"+'Stage 4'!K29","v":0},{"$f":"+'Stage 4'!L29","v":0},{"$f":"+'Stage 5'!K29","v":0},{"$f":"+'Stage 5'!L29","v":0},{"$f":"+'Stage 6'!K29","v":0},{"$f":"+'Stage 6'!L29","v":0},{"$f":"+D30+F30+H30+J30+L30+N30","v":0},{"$f":"+E30+G30+I30+K30+M30+O30","v":0},{"$f":"IF(ISBLANK('Shooter Information'!B31),,IF(SUM('Stage 1'!M29,'Stage 2'!M29,'Stage 3'!M29,'Stage 4'!M29,'Stage 5'!M29,'Stage 6'!M29)=0,\"Yes\",\"No\"))","v":0},null,{"$f":"IF(P30=0,99999,P30)","v":99999},{"$f":"IF(Q30=0,99999,Q30)","v":99999},{"$f":"IF(ISBLANK('Shooter Information'!C31),\"ZZZZZZZZZZ\",C30)","v":"ZZZZZZZZZZ"},{"$f":"CELL(\"row\",'Shooter Information'!B31)","v":31}]
[{"$f":"IF(ISBLANK('Shooter Information'!B32),,ROW()-4)","v":0},{"$f":"'Shooter Information'!B32","v":0},{"$f":"'Shooter Information'!C32","v":0},{"$f":"+'Stage 1'!K30","v":0},{"$f":"+'Stage 1'!L30","v":0},{"$f":"+'Stage 2'!K30","v":0},{"$f":"+'Stage 2'!L30","v":0},{"$f":"+'Stage 3'!K30","v":0},{"$f":"+'Stage 3'!L30","v":0},{"$f":"+'Stage 4'!K30","v":0},{"$f":"+'Stage 4'!L30","v":0},{"$f":"+'Stage 5'!K30","v":0},{"$f":"+'Stage 5'!L30","v":0},{"$f":"+'Stage 6'!K30","v":0},{"$f":"+'Stage 6'!L30","v":0},{"$f":"+D31+F31+H31+J31+L31+N31","v":0},{"$f":"+E31+G31+I31+K31+M31+O31","v":0},{"$f":"IF(ISBLANK('Shooter Information'!B32),,IF(SUM('Stage 1'!M30,'Stage 2'!M30,'Stage 3'!M30,'Stage 4'!M30,'Stage 5'!M30,'Stage 6'!M30)=0,\"Yes\",\"No\"))","v":0},null,{"$f":"IF(P31=0,99999,P31)","v":99999},{"$f":"IF(Q31=0,99999,Q31)","v":99999},{"$f":"IF(ISBLANK('Shooter Information'!C32),\"ZZZZZZZZZZ\",C31)","v":"ZZZZZZZZZZ"},{"$f":"CELL(\"row\",'Shooter Information'!B32)","v":32}]
[{"$f":"IF(ISBLANK('Shooter Information'!B33),,ROW()-4)","v":0},{"$f":"'Shooter Information'!B33","v":0},{"$f":"'Shooter Information'!C33","v":0},{"$f":"+'Stage 1'!K31","v":0},{"$f":"+'Stage 1'!L31","v":0},{"$f":"+'Stage 2'!K31","v":0},{"$f":"+'Stage 2'!L31","v":0},{"$f":"+'Stage 3'!K31","v":0},{"$f":"+'Stage 3'!L31","v":0},{"$f":"+'Stage 4'!K31","v":0},{"$f":"+'Stage 4'!L31","v":0},{"$f":"+'Stage 5'!K31","v":0},{"$f":"+'Stage 5'!L31","v":0},{"$f":"+'Stage 6'!K31","v":0},{"$f":"+'Stage 6'!L31","v":0},{"$f":"+D32+F32+H32+J32+L32+N32","v":0},{"$f":"+E32+G32+I32+K32+M32+O32","v":0},{"$f":"IF(ISBLANK('Shooter Information'!B33),,IF(SUM('Stage 1'!M31,'Stage 2'!M31,'Stage 3'!M31,'Stage 4'!M31,'Stage 5'!M31,'Stage 6'!M31)=0,\"Yes\",\"No\"))","v":0},null,{"$f":"IF(P32=0,99999,P32)","v":99999},{"$f":"IF(Q32=0,99999,Q32)","v":99999},{"$f":"IF(ISBLANK('Shooter Information'!C33),\"ZZZZZZZZZZ\",C32)","v":"ZZZZZZZZZZ"},{"$f":"CELL(\"row\",'Shooter Information'!B33)","v":33}]
[{"$f":"IF(ISBLANK('Shooter Information'!B34),,ROW()-4)","v":0},{"$f":"'Shooter Information'!B34","v":0},{"$f":"'Shooter Information'!C34","v":0},{"$f":"+'Stage 1'!K32","v":0},{"$f":"+'Stage 1'!L32","v":0},{"$f":"+'Stage 2'!K32","v":0},{"$f":"+'Stage 2'!L32","v":0},{"$f":"+'Stage 3'!K32","v":0},{"$f":"+'Stage 3'!L32","v":0},{"$f":"+'Stage 4'!K32","v":0},{"$f":"+'Stage 4'!L32","v":0},{"$f":"+'Stage 5'!K32","v":0},{"$f":"+'Stage 5'!L32","v":0},{"$f":"+'Stage 6'!K32","v":0},{"$f":"+'Stage 6'!L32","v":0},{"$f":"+D33+F33+H33+J33+L33+N33","v":0},{"$f":"+E33+G33+I33+K33+M33+O33","v":0},{"$f":"IF(ISBLANK('Shooter Information'!B34),,IF(SUM('Stage 1'!M32,'Stage 2'!M32,'Stage 3'!M32,'Stage 4'!M32,'Stage 5'!M32,'Stage 6'!M32)=0,\"Yes\",\"No\"))","v":0},null,{"$f":"IF(P33=0,99999,P33)","v":99999},{"$f":"IF(Q33=0,99999,Q33)","v":99999},{"$f":"IF(ISBLANK('Shooter Information'!C34),\"ZZZZZZZZZZ\",C33)","v":"ZZZZZZZZZZ"},{"$f":"CELL(\"row\",'Shooter Information'!B34)","v":34}]
[{"$f":"IF(ISBLANK('Shooter Information'!B35),,ROW()-4)","v":0},{"$f":"'Shooter Information'!B35","v":0},{"$f":"'Shooter Information'!C35","v":0},{"$f":"+'Stage 1'!K33","v":0},{"$f":"+'Stage 1'!L33","v":0},{"$f":"+'Stage 2'!K33","v":0},{"$f":"+'Stage 2'!L33","v":0},{"$f":"+'Stage 3'!K33","v":0},{"$f":"+'Stage 3'!L33","v":0},{"$f":"+'Stage 4'!K33","v":0},{"$f":"+'Stage 4'!L33","v":0},{"$f":"+'Stage 5'!K33","v":0},{"$f":"+'Stage 5'!L33","v":0},{"$f":"+'Stage 6'!K33","v":0},{"$f":"+'Stage 6'!L33","v":0},{"$f":"+D34+F34+H34+J34+L34+N34","v":0},{"$f":"+E34+G34+I34+K34+M34+O34","v":0},{"$f":"IF(ISBLANK('Shooter Information'!B35),,IF(SUM('Stage 1'!M33,'Stage 2'!M33,'Stage 3'!M33,'Stage 4'!M33,'Stage 5'!M33,'Stage 6'!M33)=0,\"Yes\",\"No\"))","v":0},null,{"$f":"IF(P34=0,99999,P34)","v":99999},{"$f":"IF(Q34=0,99999,Q34)","v":99999},{"$f":"IF(ISBLANK('Shooter Information'!C35),\"ZZZZZZZZZZ\",C34)","v":"ZZZZZZZZZZ"},{"$f":"CELL(\"row\",'Shooter Information'!B35)","v":35}]
[{"$f":"IF(ISBLANK('Shooter Information'!B36),,ROW()-4)","v":0},{"$f":"'Shooter Information'!B36","v":0},{"$f":"'Shooter Information'!C36","v":0},{"$f":"+'Stage 1'!K34","v":0},{"$f":"+'Stage 1'!L34","v":0},{"$f":"+'Stage 2'!K34","v":0},{"$f":"+'Stage 2'!L34","v":0},{"$f":"+'Stage 3'!K34","v":0},{"$f":"+'Stage 3'!L34","v":0},{"$f":"+'Stage 4'!K34","v":0},{"$f":"+'Stage 4'!L34","v":0},{"$f":"+'Stage 5'!K34","v":0},{"$f":"+'Stage 5'!L34","v":0},{"$f":"+'Stage 6'!K34","v":0},{"$f":"+'Stage 6'!L34","v":0},{"$f":"+D35+F35+H35+J35+L35+N35","v":0},{"$f":"+E35+G35+I35+K35+M35+O35","v":0},{"$f":"IF(ISBLANK('Shooter Information'!B36),,IF(SUM('Stage 1'!M34,'Stage 2'!M34,'Stage 3'!M34,'Stage 4'!M34,'Stage 5'!M34,'Stage 6'!M34)=0,\"Yes\",\"No\"))","v":0},null,{"$f":"IF(P35=0,99999,P35)","v":99999},{"$f":"IF(Q35=0,99999,Q35)","v":99999},{"$f":"IF(ISBLANK('Shooter Information'!C36),\"ZZZZZZZZZZ\",C35)","v":"ZZZZZZZZZZ"},{"$f":"CELL(\"row\",'Shooter Information'!B36)","v":36}]
[{"$f":"IF(ISBLANK('Shooter Information'!B37),,ROW()-4)","v":0},{"$f":"'Shooter Information'!B37","v":0},{"$f":"'Shooter Information'!C37","v":0},{"$f":"+'Stage 1'!K35","v":0},{"$f":"+'Stage 1'!L35","v":0},{"$f":"+'Stage 2'!K35","v":0},{"$f":"+'Stage 2'!L35","v":0},{"$f":"+'Stage 3'!K35","v":0},{"$f":"+'Stage 3'!L35","v":0},{"$f":"+'Stage 4'!K35","v":0},{"$f":"+'Stage 4'!L35","v":0},{"$f":"+'Stage 5'!K35","v":0},{"$f":"+'Stage 5'!L35","v":0},{"$f":"+'Stage 6'!K35","v":0},{"$f":"+'Stage 6'!L35","v":0},{"$f":"+D36+F36+H36+J36+L36+N36","v":0},{"$f":"+E36+G36+I36+K36+M36+O36","v":0},{"$f":"IF(ISBLANK('Shooter Information'!B37),,IF(SUM('Stage 1'!M35,'Stage 2'!M35,'Stage 3'!M35,'Stage 4'!M35,'Stage 5'!M35,'Stage 6'!M35)=0,\"Yes\",\"No\"))","v":0},null,{"$f":"IF(P36=0,99999,P36)","v":99999},{"$f":"IF(Q36=0,99999,Q36)","v":99999},{"$f":"IF(ISBLANK('Shooter Information'!C37),\"ZZZZZZZZZZ\",C36)","v":"ZZZZZZZZZZ"},{"$f":"CELL(\"row\",'Shooter Information'!B37)","v":37}]
[{"$f":"IF(ISBLANK('Shooter Information'!B38),,ROW()-4)","v":0},{"$f":"'Shooter Information'!B38","v":0},{"$f":"'Shooter Information'!C38","v":0},{"$f":"+'Stage 1'!K36","v":0},{"$f":"+'Stage 1'!L36","v":0},{"$f":"+'Stage 2'!K36","v":0},{"$f":"+'Stage 2'!L36","v":0},{"$f":"+'Stage 3'!K36","v":0},{"$f":"+'Stage 3'!L36","v":0},{"$f":"+'Stage 4'!K36","v":0},{"$f":"+'Stage 4'!L36","v":0},{"$f":"+'Stage 5'!K36","v":0},{"$f":"+'Stage 5'!L36","v":0},{"$f":"+'Stage 6'!K36","v":0},{"$f":"+'Stage 6'!L36","v":0},{"$f":"+D37+F37+H37+J37+L37+N37","v":0},{"$f":"+E37+G37+I37+K37+M37+O37","v":0},{"$f":"IF(ISBLANK('Shooter Information'!B38),,IF(SUM('Stage 1'!M36,'Stage 2'!M36,'Stage 3'!M36,'Stage 4'!M36,'Stage 5'!M36,'Stage 6'!M36)=0,\"Yes\",\"No\"))","v":0},null,{"$f":"IF(P37=0,99999,P37)","v":99999},{"$f":"IF(Q37=0,99999,Q37)","v":99999},{"$f":"IF(ISBLANK('Shooter Information'!C38),\"ZZZZZZZZZZ\",C37)","v":"ZZZZZZZZZZ"},{"$f":"CELL(\"row\",'Shooter Information'!B38)","v":38}]
[{"$f":"IF(ISBLANK('Shooter Information'!B39),,ROW()-4)","v":0},{"$f":"'Shooter Information'!B39","v":0},{"$f":"'Shooter Information'!C39","v":0},{"$f":"+'Stage 1'!K37","v":0},{"$f":"+'Stage 1'!L37","v":0},{"$f":"+'Stage 2'!K37","v":0},{"$f":"+'Stage 2'!L37","v":0},{"$f":"+'Stage 3'!K37","v":0},{"$f":"+'Stage 3'!L37","v":0},{"$f":"+'Stage 4'!K37","v":0},{"$f":"+'Stage 4'!L37","v":0},{"$f":"+'Stage 5'!K37","v":0},{"$f":"+'Stage 5'!L37","v":0},{"$f":"+'Stage 6'!K37","v":0},{"$f":"+'Stage 6'!L37","v":0},{"$f":"+D38+F38+H38+J38+L38+N38","v":0},{"$f":"+E38+G38+I38+K38+M38+O38","v":0},{"$f":"IF(ISBLANK('Shooter Information'!B39),,IF(SUM('Stage 1'!M37,'Stage 2'!M37,'Stage 3'!M37,'Stage 4'!M37,'Stage 5'!M37,'Stage 6'!M37)=0,\"Yes\",\"No\"))","v":0},null,{"$f":"IF(P38=0,99999,P38)","v":99999},{"$f":"IF(Q38=0,99999,Q38)","v":99999},{"$f":"IF(ISBLANK('Shooter Information'!C39),\"ZZZZZZZZZZ\",C38)","v":"ZZZZZZZZZZ"},{"$f":"CELL(\"row\",'Shooter Information'!B39)","v":39}]
[{"$f":"IF(ISBLANK('Shooter Information'!B40),,ROW()-4)","v":0},{"$f":"'Shooter Information'!B40","v":0},{"$f":"'Shooter Information'!C40","v":0},{"$f":"+'Stage 1'!K38","v":0},{"$f":"+'Stage 1'!L38","v":0},{"$f":"+'Stage 2'!K38","v":0},{"$f":"+'Stage 2'!L38","v":0},{"$f":"+'Stage 3'!K38","v":0},{"$f":"+'Stage 3'!L38","v":0},{"$f":"+'Stage 4'!K38","v":0},{"$f":"+'Stage 4'!L38","v":0},{"$f":"+'Stage 5'!K38","v":0},{"$f":"+'Stage 5'!L38","v":0},{"$f":"+'Stage 6'!K38","v":0},{"$f":"+'Stage 6'!L38","v":0},{"$f":"+D39+F39+H39+J39+L39+N39","v":0},{"$f":"+E39+G39+I39+K39+M39+O39","v":0},{"$f":"IF(ISBLANK('Shooter Information'!B40),,IF(SUM('Stage 1'!M38,'Stage 2'!M38,'Stage 3'!M38,'Stage 4'!M38,'Stage 5'!M38,'Stage 6'!M38)=0,\"Yes\",\"No\"))","v":0},null,{"$f":"IF(P39=0,99999,P39)","v":99999},{"$f":"IF(Q39=0,99999,Q39)","v":99999},{"$f":"IF(ISBLANK('Shooter Information'!C40),\"ZZZZZZZZZZ\",C39)","v":"ZZZZZZZZZZ"},{"$f":"CELL(\"row\",'Shooter Information'!B40)","v":40}]
[{"$f":"IF(ISBLANK('Shooter Information'!B41),,ROW()-4)","v":0},{"$f":"'Shooter Information'!B41","v":0},{"$f":"'Shooter Information'!C41","v":0},{"$f":"+'Stage 1'!K39","v":0},{"$f":"+'Stage 1'!L39","v":0},{"$f":"+'Stage 2'!K39","v":0},{"$f":"+'Stage 2'!L39","v":0},{"$f":"+'Stage 3'!K39","v":0},{"$f":"+'Stage 3'!L39","v":0},{"$f":"+'Stage 4'!K39","v":0},{"$f":"+'Stage 4'!L39","v":0},{"$f":"+'Stage 5'!K39","v":0},{"$f":"+'Stage 5'!L39","v":0},{"$f":"+'Stage 6'!K39","v":0},{"$f":"+'Stage 6'!L39","v":0},{"$f":"+D40+F40+H40+J40+L40+N40","v":0},{"$f":"+E40+G40+I40+K40+M40+O40","v":0},{"$f":"IF(ISBLANK('Shooter Information'!B41),,IF(SUM('Stage 1'!M39,'Stage 2'!M39,'Stage 3'!M39,'Stage 4'!M39,'Stage 5'!M39,'Stage 6'!M39)=0,\"Yes\",\"No\"))","v":0},null,{"$f":"IF(P40=0,99999,P40)","v":99999},{"$f":"IF(Q40=0,99999,Q40)","v":99999},{"$f":"IF(ISBLANK('Shooter Information'!C41),\"ZZZZZZZZZZ\",C40)","v":"ZZZZZZZZZZ"},{"$f":"CELL(\"row\",'Shooter Information'!B41)","v":41}]
[{"$f":"IF(ISBLANK('Shooter Information'!B42),,ROW()-4)","v":0},{"$f":"'Shooter Information'!B42","v":0},{"$f":"'Shooter Information'!C42","v":0},{"$f":"+'Stage 1'!K40","v":0},{"$f":"+'Stage 1'!L40","v":0},{"$f":"+'Stage 2'!K40","v":0},{"$f":"+'Stage 2'!L40","v":0},{"$f":"+'Stage 3'!K40","v":0},{"$f":"+'Stage 3'!L40","v":0},{"$f":"+'Stage 4'!K40","v":0},{"$f":"+'Stage 4'!L40","v":0},{"$f":"+'Stage 5'!K40","v":0},{"$f":"+'Stage 5'!L40","v":0},{"$f":"+'Stage 6'!K40","v":0},{"$f":"+'Stage 6'!L40","v":0},{"$f":"+D41+F41+H41+J41+L41+N41","v":0},{"$f":"+E41+G41+I41+K41+M41+O41","v":0},{"$f":"IF(ISBLANK('Shooter Information'!B42),,IF(SUM('Stage 1'!M40,'Stage 2'!M40,'Stage 3'!M40,'Stage 4'!M40,'Stage 5'!M40,'Stage 6'!M40)=0,\"Yes\",\"No\"))","v":0},null,{"$f":"IF(P41=0,99999,P41)","v":99999},{"$f":"IF(Q41=0,99999,Q41)","v":99999},{"$f":"IF(ISBLANK('Shooter Information'!C42),\"ZZZZZZZZZZ\",C41)","v":"ZZZZZZZZZZ"},{"$f":"CELL(\"row\",'Shooter Information'!B42)","v":42}]
[{"$f":"IF(ISBLANK('Shooter Information'!B43),,ROW()-4)","v":0},{"$f":"'Shooter Information'!B43","v":0},{"$f":"'Shooter Information'!C43","v":0},{"$f":"+'Stage 1'!K41","v":0},{"$f":"+'Stage 1'!L41","v":0},{"$f":"+'Stage 2'!K41","v":0},{"$f":"+'Stage 2'!L41","v":0},{"$f":"+'Stage 3'!K41","v":0},{"$f":"+'Stage 3'!L41","v":0},{"$f":"+'Stage 4'!K41","v":0},{"$f":"+'Stage 4'!L41","v":0},{"$f":"+'Stage 5'!K41","v":0},{"$f":"+'Stage 5'!L41","v":0},{"$f":"+'Stage 6'!K41","v":0},{"$f":"+'Stage 6'!L41","v":0},{"$f":"+D42+F42+H42+J42+L42+N42","v":0},{"$f":"+E42+G42+I42+K42+M42+O42","v":0},{"$f":"IF(ISBLANK('Shooter Information'!B43),,IF(SUM('Stage 1'!M41,'Stage 2'!M41,'Stage 3'!M41,'Stage 4'!M41,'Stage 5'!M41,'Stage 6'!M41)=0,\"Yes\",\"No\"))","v":0},null,{"$f":"IF(P42=0,99999,P42)","v":99999},{"$f":"IF(Q42=0,99999,Q42)","v":99999},{"$f":"IF(ISBLANK('Shooter Information'!C43),\"ZZZZZZZZZZ\",C42)","v":"ZZZZZZZZZZ"},{"$f":"CELL(\"row\",'Shooter Information'!B43)","v":43}]
[{"$f":"IF(ISBLANK('Shooter Information'!B44),,ROW()-4)","v":0},{"$f":"'Shooter Information'!B44","v":0},{"$f":"'Shooter Information'!C44","v":0},{"$f":"+'Stage 1'!K42","v":0},{"$f":"+'Stage 1'!L42","v":0},{"$f":"+'Stage 2'!K42","v":0},{"$f":"+'Stage 2'!L42","v":0},{"$f":"+'Stage 3'!K42","v":0},{"$f":"+'Stage 3'!L42","v":0},{"$f":"+'Stage 4'!K42","v":0},{"$f":"+'Stage 4'!L42","v":0},{"$f":"+'Stage 5'!K42","v":0},{"$f":"+'Stage 5'!L42","v":0},{"$f":"+'Stage 6'!K42","v":0},{"$f":"+'Stage 6'!L42","v":0},{"$f":"+D43+F43+H43+J43+L43+N43","v":0},{"$f":"+E43+G43+I43+K43+M43+O43","v":0},{"$f":"IF(ISBLANK('Shooter Information'!B44),,IF(SUM('Stage 1'!M42,'Stage 2'!M42,'Stage 3'!M42,'Stage 4'!M42,'Stage 5'!M42,'Stage 6'!M42)=0,\"Yes\",\"No\"))","v":0},null,{"$f":"IF(P43=0,99999,P43)","v":99999},{"$f":"IF(Q43=0,99999,Q43)","v":99999},{"$f":"IF(ISBLANK('Shooter Information'!C44),\"ZZZZZZZZZZ\",C43)","v":"ZZZZZZZZZZ"},{"$f":"CELL(\"row\",'Shooter Information'!B44)","v":44}]
[{"$f":"IF(ISBLANK('Shooter Information'!B45),,ROW()-4)","v":0},{"$f":"'Shooter Information'!B45","v":0},{"$f":"'Shooter Information'!C45","v":0},{"$f":"+'Stage 1'!K43","v":0},{"$f":"+'Stage 1'!L43","v":0},{"$f":"+'Stage 2'!K43","v":0},{"$f":"+'Stage 2'!L43","v":0},{"$f":"+'Stage 3'!K43","v":0},{"$f":"+'Stage 3'!L43","v":0},{"$f":"+'Stage 4'!K43","v":0},{"$f":"+'Stage 4'!L43","v":0},{"$f":"+'Stage 5'!K43","v":0},{"$f":"+'Stage 5'!L43","v":0},{"$f":"+'Stage 6'!K43","v":0},{"$f":"+'Stage 6'!L43","v":0},{"$f":"+D44+F44+H44+J44+L44+N44","v":0},{"$f":"+E44+G44+I44+K44+M44+O44","v":0},{"$f":"IF(ISBLANK('Shooter Information'!B45),,IF(SUM('Stage 1'!M43,'Stage 2'!M43,'Stage 3'!M43,'Stage 4'!M43,'Stage 5'!M43,'Stage 6'!M43)=0,\"Yes\",\"No\"))","v":0},null,{"$f":"IF(P44=0,99999,P44)","v":99999},{"$f":"IF(Q44=0,99999,Q44)","v":99999},{"$f":"IF(ISBLANK('Shooter Information'!C45),\"ZZZZZZZZZZ\",C44)","v":"ZZZZZZZZZZ"},{"$f":"CELL(\"row\",'Shooter Information'!B45)","v":45}]
[{"$f":"IF(ISBLANK('Shooter Information'!B46),,ROW()-4)","v":0},{"$f":"'Shooter Information'!B46","v":0},{"$f":"'Shooter Information'!C46","v":0},{"$f":"+'Stage 1'!K44","v":0},{"$f":"+'Stage 1'!L44","v":0},{"$f":"+'Stage 2'!K44","v":0},{"$f":"+'Stage 2'!L44","v":0},{"$f":"+'Stage 3'!K44","v":0},{"$f":"+'Stage 3'!L44","v":0},{"$f":"+'Stage 4'!K44","v":0},{"$f":"+'Stage 4'!L44","v":0},{"$f":"+'Stage 5'!K44","v":0},{"$f":"+'Stage 5'!L44","v":0},{"$f":"+'Stage 6'!K44","v":0},{"$f":"+'Stage 6'!L44","v":0},{"$f":"+D45+F45+H45+J45+L45+N45","v":0},{"$f":"+E45+G45+I45+K45+M45+O45","v":0},{"$f":"IF(ISBLANK('Shooter Information'!B46),,IF(SUM('Stage 1'!M44,'Stage 2'!M44,'Stage 3'!M44,'Stage 4'!M44,'Stage 5'!M44,'Stage 6'!M44)=0,\"Yes\",\"No\"))","v":0},null,{"$f":"IF(P45=0,99999,P45)","v":99999},{"$f":"IF(Q45=0,99999,Q45)","v":99999},{"$f":"IF(ISBLANK('Shooter Information'!C46),\"ZZZZZZZZZZ\",C45)","v":"ZZZZZZZZZZ"},{"$f":"CELL(\"row\",'Shooter Information'!B46)","v":46}]
[{"$f":"IF(ISBLANK('Shooter Information'!B47),,ROW()-4)","v":0},{"$f":"'Shooter Information'!B47","v":0},{"$f":"'Shooter Information'!C47","v":0},{"$f":"+'Stage 1'!K45","v":0},{"$f":"+'Stage 1'!L45","v":0},{"$f":"+'Stage 2'!K45","v":0},{"$f":"+'Stage 2'!L45","v":0},{"$f":"+'Stage 3'!K45","v":0},{"$f":"+'Stage 3'!L45","v":0},{"$f":"+'Stage 4'!K45","v":0},{"$f":"+'Stage 4'!L45","v":0},{"$f":"+'Stage 5'!K45","v":0},{"$f":"+'Stage 5'!L45","v":0},{"$f":"+'Stage 6'!K45","v":0},{"$f":"+'Stage 6'!L45","v":0},{"$f":"+D46+F46+H46+J46+L46+N46","v":0},{"$f":"+E46+G46+I46+K46+M46+O46","v":0},{"$f":"IF(ISBLANK('Shooter Information'!B47),,IF(SUM('Stage 1'!M45,'Stage 2'!M45,'Stage 3'!M45,'Stage 4'!M45,'Stage 5'!M45,'Stage 6'!M45)=0,\"Yes\",\"No\"))","v":0},null,{"$f":"IF(P46=0,99999,P46)","v":99999},{"$f":"IF(Q46=0,99999,Q46)","v":99999},{"$f":"IF(ISBLANK('Shooter Information'!C47),\"ZZZZZZZZZZ\",C46)","v":"ZZZZZZZZZZ"},{"$f":"CELL(\"row\",'Shooter Information'!B47)","v":47}]
[{"$f":"IF(ISBLANK('Shooter Information'!B48),,ROW()-4)","v":0},{"$f":"'Shooter Information'!B48","v":0},{"$f":"'Shooter Information'!C48","v":0},{"$f":"+'Stage 1'!K46","v":0},{"$f":"+'Stage 1'!L46","v":0},{"$f":"+'Stage 2'!K46","v":0},{"$f":"+'Stage 2'!L46","v":0},{"$f":"+'Stage 3'!K46","v":0},{"$f":"+'Stage 3'!L46","v":0},{"$f":"+'Stage 4'!K46","v":0},{"$f":"+'Stage 4'!L46","v":0},{"$f":"+'Stage 5'!K46","v":0},{"$f":"+'Stage 5'!L46","v":0},{"$f":"+'Stage 6'!K46","v":0},{"$f":"+'Stage 6'!L46","v":0},{"$f":"+D47+F47+H47+J47+L47+N47","v":0},{"$f":"+E47+G47+I47+K47+M47+O47","v":0},{"$f":"IF(ISBLANK('Shooter Information'!B48),,IF(SUM('Stage 1'!M46,'Stage 2'!M46,'Stage 3'!M46,'Stage 4'!M46,'Stage 5'!M46,'Stage 6'!M46)=0,\"Yes\",\"No\"))","v":0},null,{"$f":"IF(P47=0,99999,P47)","v":99999},{"$f":"IF(Q47=0,99999,Q47)","v":99999},{"$f":"IF(ISBLANK('Shooter Information'!C48),\"ZZZZZZZZZZ\",C47)","v":"ZZZZZZZZZZ"},{"$f":"CELL(\"row\",'Shooter Information'!B48)","v":48}]
[{"$f":"IF(ISBLANK('Shooter Information'!B49),,ROW()-4)","v":0},{"$f":"'Shooter Information'!B49","v":0},{"$f":"'Shooter Information'!C49","v":0},{"$f":"+'Stage 1'!K47","v":0},{"$f":"+'Stage 1'!L47","v":0},{"$f":"+'Stage 2'!K47","v":0},{"$f":"+'Stage 2'!L47","v":0},{"$f":"+'Stage 3'!K47","v":0},{"$f":"+'Stage 3'!L47","v":0},{"$f":"+'Stage 4'!K47","v":0},{"$f":"+'Stage 4'!L47","v":0},{"$f":"+'Stage 5'!K47","v":0},{"$f":"+'Stage 5'!L47","v":0},{"$f":"+'Stage 6'!K47","v":0},{"$f":"+'Stage 6'!L47","v":0},{"$f":"+D48+F48+H48+J48+L48+N48","v":0},{"$f":"+E48+G48+I48+K48+M48+O48","v":0},{"$f":"IF(ISBLANK('Shooter Information'!B49),,IF(SUM('Stage 1'!M47,'Stage 2'!M47,'Stage 3'!M47,'Stage 4'!M47,'Stage 5'!M47,'Stage 6'!M47)=0,\"Yes\",\"No\"))","v":0},null,{"$f":"IF(P48=0,99999,P48)","v":99999},{"$f":"IF(Q48=0,99999,Q48)","v":99999},{"$f":"IF(ISBLANK('Shooter Information'!C49),\"ZZZZZZZZZZ\",C48)","v":"ZZZZZZZZZZ"},{"$f":"CELL(\"row\",'Shooter Information'!B49)","v":49}]
[{"$f":"IF(ISBLANK('Shooter Information'!B50),,ROW()-4)","v":0},{"$f":"'Shooter Information'!B50","v":0},{"$f":"'Shooter Information'!C50","v":0},{"$f":"+'Stage 1'!K48","v":0},{"$f":"+'Stage 1'!L48","v":0},{"$f":"+'Stage 2'!K48","v":0},{"$f":"+'Stage 2'!L48","v":0},{"$f":"+'Stage 3'!K48","v":0},{"$f":"+'Stage 3'!L48","v":0},{"$f":"+'Stage 4'!K48","v":0},{"$f":"+'Stage 4'!L48","v":0},{"$f":"+'Stage 5'!K48","v":0},{"$f":"+'Stage 5'!L48","v":0},{"$f":"+'Stage 6'!K48","v":0},{"$f":"+'Stage 6'!L48","v":0},{"$f":"+D49+F49+H49+J49+L49+N49","v":0},{"$f":"+E49+G49+I49+K49+M49+O49","v":0},{"$f":"IF(ISBLANK('Shooter Information'!B50),,IF(SUM('Stage 1'!M48,'Stage 2'!M48,'Stage 3'!M48,'Stage 4'!M48,'Stage 5'!M48,'Stage 6'!M48)=0,\"Yes\",\"No\"))","v":0},null,{"$f":"IF(P49=0,99999,P49)","v":99999},{"$f":"IF(Q49=0,99999,Q49)","v":99999},{"$f":"IF(ISBLANK('Shooter Information'!C50),\"ZZZZZZZZZZ\",C49)","v":"ZZZZZZZZZZ"},{"$f":"CELL(\"row\",'Shooter Information'!B50)","v":50}]
[{"$f":"IF(ISBLANK('Shooter Information'!B51),,ROW()-4)","v":0},{"$f":"'Shooter Information'!B51","v":0},{"$f":"'Shooter Information'!C51","v":0},{"$f":"+'Stage 1'!K49","v":0},{"$f":"+'Stage 1'!L49","v":0},{"$f":"+'Stage 2'!K49","v":0},{"$f":"+'Stage 2'!L49","v":0},{"$f":"+'Stage 3'!K49","v":0},{"$f":"+'Stage 3'!L49","v":0},{"$f":"+'Stage 4'!K49","v":0},{"$f":"+'Stage 4'!L49","v":0},{"$f":"+'Stage 5'!K49","v":0},{"$f":"+'Stage 5'!L49","v":0},{"$f":"+'Stage 6'!K49","v":0},{"$f":"+'Stage 6'!L49","v":0},{"$f":"+D50+F50+H50+J50+L50+N50","v":0},{"$f":"+E50+G50+I50+K50+M50+O50","v":0},{"$f":"IF(ISBLANK('Shooter Information'!B51),,IF(SUM('Stage 1'!M49,'Stage 2'!M49,'Stage 3'!M49,'Stage 4'!M49,'Stage 5'!M49,'Stage 6'!M49)=0,\"Yes\",\"No\"))","v":0},null,{"$f":"IF(P50=0,99999,P50)","v":99999},{"$f":"IF(Q50=0,99999,Q50)","v":99999},{"$f":"IF(ISBLANK('Shooter Information'!C51),\"ZZZZZZZZZZ\",C50)","v":"ZZZZZZZZZZ"},{"$f":"CELL(\"row\",'Shooter Information'!B51)","v":51}]
[{"$f":"IF(ISBLANK('Shooter Information'!B52),,ROW()-4)","v":0},{"$f":"'Shooter Information'!B52","v":0},{"$f":"'Shooter Information'!C52","v":0},{"$f":"+'Stage 1'!K50","v":0},{"$f":"+'Stage 1'!L50","v":0},{"$f":"+'Stage 2'!K50","v":0},{"$f":"+'Stage 2'!L50","v":0},{"$f":"+'Stage 3'!K50","v":0},{"$f":"+'Stage 3'!L50","v":0},{"$f":"+'Stage 4'!K50","v":0},{"$f":"+'Stage 4'!L50","v":0},{"$f":"+'Stage 5'!K50","v":0},{"$f":"+'Stage 5'!L50","v":0},{"$f":"+'Stage 6'!K50","v":0},{"$f":"+'Stage 6'!L50","v":0},{"$f":"+D51+F51+H51+J51+L51+N51","v":0},{"$f":"+E51+G51+I51+K51+M51+O51","v":0},{"$f":"IF(ISBLANK('Shooter Information'!B52),,IF(SUM('Stage 1'!M50,'Stage 2'!M50,'Stage 3'!M50,'Stage 4'!M50,'Stage 5'!M50,'Stage 6'!M50)=0,\"Yes\",\"No\"))","v":0},null,{"$f":"IF(P51=0,99999,P51)","v":99999},{"$f":"IF(Q51=0,99999,Q51)","v":99999},{"$f":"IF(ISBLANK('Shooter Information'!C52),\"ZZZZZZZZZZ\",C51)","v":"ZZZZZZZZZZ"},{"$f":"CELL(\"row\",'Shooter Information'!B52)","v":52}]
[{"$f":"IF(ISBLANK('Shooter Information'!B53),,ROW()-4)","v":0},{"$f":"'Shooter Information'!B53","v":0},{"$f":"'Shooter Information'!C53","v":0},{"$f":"+'Stage 1'!K51","v":0},{"$f":"+'Stage 1'!L51","v":0},{"$f":"+'Stage 2'!K51","v":0},{"$f":"+'Stage 2'!L51","v":0},{"$f":"+'Stage 3'!K51","v":0},{"$f":"+'Stage 3'!L51","v":0},{"$f":"+'Stage 4'!K51","v":0},{"$f":"+'Stage 4'!L51","v":0},{"$f":"+'Stage 5'!K51","v":0},{"$f":"+'Stage 5'!L51","v":0},{"$f":"+'Stage 6'!K51","v":0},{"$f":"+'Stage 6'!L51","v":0},{"$f":"+D52+F52+H52+J52+L52+N52","v":0},{"$f":"+E52+G52+I52+K52+M52+O52","v":0},{"$f":"IF(ISBLANK('Shooter Information'!B53),,IF(SUM('Stage 1'!M51,'Stage 2'!M51,'Stage 3'!M51,'Stage 4'!M51,'Stage 5'!M51,'Stage 6'!M51)=0,\"Yes\",\"No\"))","v":0},null,{"$f":"IF(P52=0,99999,P52)","v":99999},{"$f":"IF(Q52=0,99999,Q52)","v":99999},{"$f":"IF(ISBLANK('Shooter Information'!C53),\"ZZZZZZZZZZ\",C52)","v":"ZZZZZZZZZZ"},{"$f":"CELL(\"row\",'Shooter Information'!B53)","v":53}]
[{"$f":"IF(ISBLANK('Shooter Information'!B54),,ROW()-4)","v":0},{"$f":"'Shooter Information'!B54","v":0},{"$f":"'Shooter Information'!C54","v":0},{"$f":"+'Stage 1'!K52","v":0},{"$f":"+'Stage 1'!L52","v":0},{"$f":"+'Stage 2'!K52","v":0},{"$f":"+'Stage 2'!L52","v":0},{"$f":"+'Stage 3'!K52","v":0},{"$f":"+'Stage 3'!L52","v":0},{"$f":"+'Stage 4'!K52","v":0},{"$f":"+'Stage 4'!L52","v":0},{"$f":"+'Stage 5'!K52","v":0},{"$f":"+'Stage 5'!L52","v":0},{"$f":"+'Stage 6'!K52","v":0},{"$f":"+'Stage 6'!L52","v":0},{"$f":"+D53+F53+H53+J53+L53+N53","v":0},{"$f":"+E53+G53+I53+K53+M53+O53","v":0},{"$f":"IF(ISBLANK('Shooter Information'!B54),,IF(SUM('Stage 1'!M52,'Stage 2'!M52,'Stage 3'!M52,'Stage 4'!M52,'Stage 5'!M52,'Stage 6'!M52)=0,\"Yes\",\"No\"))","v":0},null,{"$f":"IF(P53=0,99999,P53)","v":99999},{"$f":"IF(Q53=0,99999,Q53)","v":99999},{"$f":"IF(ISBLANK('Shooter Information'!C54),\"ZZZZZZZZZZ\",C53)","v":"ZZZZZZZZZZ"},{"$f":"CELL(\"row\",'Shooter Information'!B54)","v":54}]
[{"$f":"IF(ISBLANK('Shooter Information'!B55),,ROW()-4)","v":0},{"$f":"'Shooter Information'!B55","v":0},{"$f":"'Shooter Information'!C55","v":0},{"$f":"+'Stage 1'!K53","v":0},{"$f":"+'Stage 1'!L53","v":0},{"$f":"+'Stage 2'!K53","v":0},{"$f":"+'Stage 2'!L53","v":0},{"$f":"+'Stage 3'!K53","v":0},{"$f":"+'Stage 3'!L53","v":0},{"$f":"+'Stage 4'!K53","v":0},{"$f":"+'Stage 4'!L53","v":0},{"$f":"+'Stage 5'!K53","v":0},{"$f":"+'Stage 5'!L53","v":0},{"$f":"+'Stage 6'!K53","v":0},{"$f":"+'Stage 6'!L53","v":0},{"$f":"+D54+F54+H54+J54+L54+N54","v":0},{"$f":"+E54+G54+I54+K54+M54+O54","v":0},{"$f":"IF(ISBLANK('Shooter Information'!B55),,IF(SUM('Stage 1'!M53,'Stage 2'!M53,'Stage 3'!M53,'Stage 4'!M53,'Stage 5'!M53,'Stage 6'!M53)=0,\"Yes\",\"No\"))","v":0},null,{"$f":"IF(P54=0,99999,P54)","v":99999},{"$f":"IF(Q54=0,99999,Q54)","v":99999},{"$f":"IF(ISBLANK('Shooter Information'!C55),\"ZZZZZZZZZZ\",C54)","v":"ZZZZZZZZZZ"},{"$f":"CELL(\"row\",'Shooter Information'!B55)","v":55}]
[{"$f":"IF(ISBLANK('Shooter Information'!B56),,ROW()-4)","v":0},{"$f":"'Shooter Information'!B56","v":0},{"$f":"'Shooter Information'!C56","v":0},{"$f":"+'Stage 1'!K54","v":0},{"$f":"+'Stage 1'!L54","v":0},{"$f":"+'Stage 2'!K54","v":0},{"$f":"+'Stage 2'!L54","v":0},{"$f":"+'Stage 3'!K54","v":0},{"$f":"+'Stage 3'!L54","v":0},{"$f":"+'Stage 4'!K54","v":0},{"$f":"+'Stage 4'!L54","v":0},{"$f":"+'Stage 5'!K54","v":0},{"$f":"+'Stage 5'!L54","v":0},{"$f":"+'Stage 6'!K54","v":0},{"$f":"+'Stage 6'!L54","v":0},{"$f":"+D55+F55+H55+J55+L55+N55","v":0},{"$f":"+E55+G55+I55+K55+M55+O55","v":0},{"$f":"IF(ISBLANK('Shooter Information'!B56),,IF(SUM('Stage 1'!M54,'Stage 2'!M54,'Stage 3'!M54,'Stage 4'!M54,'Stage 5'!M54,'Stage 6'!M54)=0,\"Yes\",\"No\"))","v":0},null,{"$f":"IF(P55=0,99999,P55)","v":99999},{"$f":"IF(Q55=0,99999,Q55)","v":99999},{"$f":"IF(ISBLANK('Shooter Information'!C56),\"ZZZZZZZZZZ\",C55)","v":"ZZZZZZZZZZ"},{"$f":"CELL(\"row\",'Shooter Information'!B56)","v":56}]
[{"$f":"IF(ISBLANK('Shooter Information'!B57),,ROW()-4)","v":0},{"$f":"'Shooter Information'!B57","v":0},{"$f":"'Shooter Information'!C57","v":0},{"$f":"+'Stage 1'!K55","v":0},{"$f":"+'Stage 1'!L55","v":0},{"$f":"+'Stage 2'!K55","v":0},{"$f":"+'Stage 2'!L55","v":0},{"$f":"+'Stage 3'!K55","v":0},{"$f":"+'Stage 3'!L55","v":0},{"$f":"+'Stage 4'!K55","v":0},{"$f":"+'Stage 4'!L55","v":0},{"$f":"+'Stage 5'!K55","v":0},{"$f":"+'Stage 5'!L55","v":0},{"$f":"+'Stage 6'!K55","v":0},{"$f":"+'Stage 6'!L55","v":0},{"$f":"+D56+F56+H56+J56+L56+N56","v":0},{"$f":"+E56+G56+I56+K56+M56+O56","v":0},{"$f":"IF(ISBLANK('Shooter Information'!B57),,IF(SUM('Stage 1'!M55,'Stage 2'!M55,'Stage 3'!M55,'Stage 4'!M55,'Stage 5'!M55,'Stage 6'!M55)=0,\"Yes\",\"No\"))","v":0},null,{"$f":"IF(P56=0,99999,P56)","v":99999},{"$f":"IF(Q56=0,99999,Q56)","v":99999},{"$f":"IF(ISBLANK('Shooter Information'!C57),\"ZZZZZZZZZZ\",C56)","v":"ZZZZZZZZZZ"},{"$f":"CELL(\"row\",'Shooter Information'!B57)","v":57}]
[{"$f":"IF(ISBLANK('Shooter Information'!B58),,ROW()-4)","v":0},{"$f":"'Shooter Information'!B58","v":0},{"$f":"'Shooter Information'!C58","v":0},{"$f":"+'Stage 1'!K56","v":0},{"$f":"+'Stage 1'!L56","v":0},{"$f":"+'Stage 2'!K56","v":0},{"$f":"+'Stage 2'!L56","v":0},{"$f":"+'Stage 3'!K56","v":0},{"$f":"+'Stage 3'!L56","v":0},{"$f":"+'Stage 4'!K56","v":0},{"$f":"+'Stage 4'!L56","v":0},{"$f":"+'Stage 5'!K56","v":0},{"$f":"+'Stage 5'!L56","v":0},{"$f":"+'Stage 6'!K56","v":0},{"$f":"+'Stage 6'!L56","v":0},{"$f":"+D57+F57+H57+J57+L57+N57","v":0},{"$f":"+E57+G57+I57+K57+M57+O57","v":0},{"$f":"IF(ISBLANK('Shooter Information'!B58),,IF(SUM('Stage 1'!M56,'Stage 2'!M56,'Stage 3'!M56,'Stage 4'!M56,'Stage 5'!M56,'Stage 6'!M56)=0,\"Yes\",\"No\"))","v":0},null,{"$f":"IF(P57=0,99999,P57)","v":99999},{"$f":"IF(Q57=0,99999,Q57)","v":99999},{"$f":"IF(ISBLANK('Shooter Information'!C58),\"ZZZZZZZZZZ\",C57)","v":"ZZZZZZZZZZ"},{"$f":"CELL(\"row\",'Shooter Information'!B58)","v":58}]
[{"$f":"IF(ISBLANK('Shooter Information'!B59),,ROW()-4)","v":0},{"$f":"'Shooter Information'!B59","v":0},{"$f":"'Shooter Information'!C59","v":0},{"$f":"+'Stage 1'!K57","v":0},{"$f":"+'Stage 1'!L57","v":0},{"$f":"+'Stage 2'!K57","v":0},{"$f":"+'Stage 2'!L57","v":0},{"$f":"+'Stage 3'!K57","v":0},{"$f":"+'Stage 3'!L57","v":0},{"$f":"+'Stage 4'!K57","v":0},{"$f":"+'Stage 4'!L57","v":0},{"$f":"+'Stage 5'!K57","v":0},{"$f":"+'Stage 5'!L57","v":0},{"$f":"+'Stage 6'!K57","v":0},{"$f":"+'Stage 6'!L57","v":0},{"$f":"+D58+F58+H58+J58+L58+N58","v":0},{"$f":"+E58+G58+I58+K58+M58+O58","v":0},{"$f":"IF(ISBLANK('Shooter Information'!B59),,IF(SUM('Stage 1'!M57,'Stage 2'!M57,'Stage 3'!M57,'Stage 4'!M57,'Stage 5'!M57,'Stage 6'!M57)=0,\"Yes\",\"No\"))","v":0},null,{"$f":"IF(P58=0,99999,P58)","v":99999},{"$f":"IF(Q58=0,99999,Q58)","v":99999},{"$f":"IF(ISBLANK('Shooter Information'!C59),\"ZZZZZZZZZZ\",C58)","v":"ZZZZZZZZZZ"},{"$f":"CELL(\"row\",'Shooter Information'!B59)","v":59}]
[{"$f":"IF(ISBLANK('Shooter Information'!B60),,ROW()-4)","v":0},{"$f":"'Shooter Information'!B60","v":0},{"$f":"'Shooter Information'!C60","v":0},{"$f":"+'Stage 1'!K58","v":0},{"$f":"+'Stage 1'!L58","v":0},{"$f":"+'Stage 2'!K58","v":0},{"$f":"+'Stage 2'!L58","v":0},{"$f":"+'Stage 3'!K58","v":0},{"$f":"+'Stage 3'!L58","v":0},{"$f":"+'Stage 4'!K58","v":0},{"$f":"+'Stage 4'!L58","v":0},{"$f":"+'Stage 5'!K58","v":0},{"$f":"+'Stage 5'!L58","v":0},{"$f":"+'Stage 6'!K58","v":0},{"$f":"+'Stage 6'!L58","v":0},{"$f":"+D59+F59+H59+J59+L59+N59","v":0},{"$f":"+E59+G59+I59+K59+M59+O59","v":0},{"$f":"IF(ISBLANK('Shooter Information'!B60),,IF(SUM('Stage 1'!M58,'Stage 2'!M58,'Stage 3'!M58,'Stage 4'!M58,'Stage 5'!M58,'Stage 6'!M58)=0,\"Yes\",\"No\"))","v":0},null,{"$f":"IF(P59=0,99999,P59)","v":99999},{"$f":"IF(Q59=0,99999,Q59)","v":99999},{"$f":"IF(ISBLANK('Shooter Information'!C60),\"ZZZZZZZZZZ\",C59)","v":"ZZZZZZZZZZ"},{"$f":"CELL(\"row\",'Shooter Information'!B60)","v":60}]
[{"$f":"IF(ISBLANK('Shooter Information'!B61),,ROW()-4)","v":0},{"$f":"'Shooter Information'!B61","v":0},{"$f":"'Shooter Information'!C61","v":0},{"$f":"+'Stage 1'!K59","v":0},{"$f":"+'Stage 1'!L59","v":0},{"$f":"+'Stage 2'!K59","v":0},{"$f":"+'Stage 2'!L59","v":0},{"$f":"+'Stage 3'!K59","v":0},{"$f":"+'Stage 3'!L59","v":0},{"$f":"+'Stage 4'!K59","v":0},{"$f":"+'Stage 4'!L59","v":0},{"$f":"+'Stage 5'!K59","v":0},{"$f":"+'Stage 5'!L59","v":0},{"$f":"+'Stage 6'!K59","v":0},{"$f":"+'Stage 6'!L59","v":0},{"$f":"+D60+F60+H60+J60+L60+N60","v":0},{"$f":"+E60+G60+I60+K60+M60+O60","v":0},{"$f":"IF(ISBLANK('Shooter Information'!B61),,IF(SUM('Stage 1'!M59,'Stage 2'!M59,'Stage 3'!M59,'Stage 4'!M59,'Stage 5'!M59,'Stage 6'!M59)=0,\"Yes\",\"No\"))","v":0},null,{"$f":"IF(P60=0,99999,P60)","v":99999},{"$f":"IF(Q60=0,99999,Q60)","v":99999},{"$f":"IF(ISBLANK('Shooter Information'!C61),\"ZZZZZZZZZZ\",C60)","v":"ZZZZZZZZZZ"},{"$f":"CELL(\"row\",'Shooter Information'!B61)","v":61}]
[{"$f":"IF(ISBLANK('Shooter Information'!B62),,ROW()-4)","v":0},{"$f":"'Shooter Information'!B62","v":0},{"$f":"'Shooter Information'!C62","v":0},{"$f":"+'Stage 1'!K60","v":0},{"$f":"+'Stage 1'!L60","v":0},{"$f":"+'Stage 2'!K60","v":0},{"$f":"+'Stage 2'!L60","v":0},{"$f":"+'Stage 3'!K60","v":0},{"$f":"+'Stage 3'!L60","v":0},{"$f":"+'Stage 4'!K60","v":0},{"$f":"+'Stage 4'!L60","v":0},{"$f":"+'Stage 5'!K60","v":0},{"$f":"+'Stage 5'!L60","v":0},{"$f":"+'Stage 6'!K60","v":0},{"$f":"+'Stage 6'!L60","v":0},{"$f":"+D61+F61+H61+J61+L61+N61","v":0},{"$f":"+E61+G61+I61+K61+M61+O61","v":0},{"$f":"IF(ISBLANK('Shooter Information'!B62),,IF(SUM('Stage 1'!M60,'Stage 2'!M60,'Stage 3'!M60,'Stage 4'!M60,'Stage 5'!M60,'Stage 6'!M60)=0,\"Yes\",\"No\"))","v":0},null,{"$f":"IF(P61=0,99999,P61)","v":99999},{"$f":"IF(Q61=0,99999,Q61)","v":99999},{"$f":"IF(ISBLANK('Shooter Information'!C62),\"ZZZZZZZZZZ\",C61)","v":"ZZZZZZZZZZ"},{"$f":"CELL(\"row\",'Shooter Information'!B62)","v":62}]
[{"$f":"IF(ISBLANK('Shooter Information'!B63),,ROW()-4)","v":0},{"$f":"'Shooter Information'!B63","v":0},{"$f":"'Shooter Information'!C63","v":0},{"$f":"+'Stage 1'!K61","v":0},{"$f":"+'Stage 1'!L61","v":0},{"$f":"+'Stage 2'!K61","v":0},{"$f":"+'Stage 2'!L61","v":0},{"$f":"+'Stage 3'!K61","v":0},{"$f":"+'Stage 3'!L61","v":0},{"$f":"+'Stage 4'!K61","v":0},{"$f":"+'Stage 4'!L61","v":0},{"$f":"+'Stage 5'!K61","v":0},{"$f":"+'Stage 5'!L61","v":0},{"$f":"+'Stage 6'!K61","v":0},{"$f":"+'Stage 6'!L61","v":0},{"$f":"+D62+F62+H62+J62+L62+N62","v":0},{"$f":"+E62+G62+I62+K62+M62+O62","v":0},{"$f":"IF(ISBLANK('Shooter Information'!B63),,IF(SUM('Stage 1'!M61,'Stage 2'!M61,'Stage 3'!M61,'Stage 4'!M61,'Stage 5'!M61,'Stage 6'!M61)=0,\"Yes\",\"No\"))","v":0},null,{"$f":"IF(P62=0,99999,P62)","v":99999},{"$f":"IF(Q62=0,99999,Q62)","v":99999},{"$f":"IF(ISBLANK('Shooter Information'!C63),\"ZZZZZZZZZZ\",C62)","v":"ZZZZZZZZZZ"},{"$f":"CELL(\"row\",'Shooter Information'!B63)","v":63}]
[{"$f":"IF(ISBLANK('Shooter Information'!B64),,ROW()-4)","v":0},{"$f":"'Shooter Information'!B64","v":0},{"$f":"'Shooter Information'!C64","v":0},{"$f":"+'Stage 1'!K62","v":0},{"$f":"+'Stage 1'!L62","v":0},{"$f":"+'Stage 2'!K62","v":0},{"$f":"+'Stage 2'!L62","v":0},{"$f":"+'Stage 3'!K62","v":0},{"$f":"+'Stage 3'!L62","v":0},{"$f":"+'Stage 4'!K62","v":0},{"$f":"+'Stage 4'!L62","v":0},{"$f":"+'Stage 5'!K62","v":0},{"$f":"+'Stage 5'!L62","v":0},{"$f":"+'Stage 6'!K62","v":0},{"$f":"+'Stage 6'!L62","v":0},{"$f":"+D63+F63+H63+J63+L63+N63","v":0},{"$f":"+E63+G63+I63+K63+M63+O63","v":0},{"$f":"IF(ISBLANK('Shooter Information'!B64),,IF(SUM('Stage 1'!M62,'Stage 2'!M62,'Stage 3'!M62,'Stage 4'!M62,'Stage 5'!M62,'Stage 6'!M62)=0,\"Yes\",\"No\"))","v":0},null,{"$f":"IF(P63=0,99999,P63)","v":99999},{"$f":"IF(Q63=0,99999,Q63)","v":99999},{"$f":"IF(ISBLANK('Shooter Information'!C64),\"ZZZZZZZZZZ\",C63)","v":"ZZZZZZZZZZ"},{"$f":"CELL(\"row\",'Shooter Information'!B64)","v":64}]
[{"$f":"IF(ISBLANK('Shooter Information'!B65),,ROW()-4)","v":0},{"$f":"'Shooter Information'!B65","v":0},{"$f":"'Shooter Information'!C65","v":0},{"$f":"+'Stage 1'!K63","v":0},{"$f":"+'Stage 1'!L63","v":0},{"$f":"+'Stage 2'!K63","v":0},{"$f":"+'Stage 2'!L63","v":0},{"$f":"+'Stage 3'!K63","v":0},{"$f":"+'Stage 3'!L63","v":0},{"$f":"+'Stage 4'!K63","v":0},{"$f":"+'Stage 4'!L63","v":0},{"$f":"+'Stage 5'!K63","v":0},{"$f":"+'Stage 5'!L63","v":0},{"$f":"+'Stage 6'!K63","v":0},{"$f":"+'Stage 6'!L63","v":0},{"$f":"+D64+F64+H64+J64+L64+N64","v":0},{"$f":"+E64+G64+I64+K64+M64+O64","v":0},{"$f":"IF(ISBLANK('Shooter Information'!B65),,IF(SUM('Stage 1'!M63,'Stage 2'!M63,'Stage 3'!M63,'Stage 4'!M63,'Stage 5'!M63,'Stage 6'!M63)=0,\"Yes\",\"No\"))","v":0},null,{"$f":"IF(P64=0,99999,P64)","v":99999},{"$f":"IF(Q64=0,99999,Q64)","v":99999},{"$f":"IF(ISBLANK('Shooter Information'!C65),\"ZZZZZZZZZZ\",C64)","v":"ZZZZZZZZZZ"},{"$f":"CELL(\"row\",'Shooter Information'!B65)","v":65}]
[{"$f":"IF(ISBLANK('Shooter Information'!B66),,ROW()-4)","v":0},{"$f":"'Shooter Information'!B66","v":0},{"$f":"'Shooter Information'!C66","v":0},{"$f":"+'Stage 1'!K64","v":0},{"$f":"+'Stage 1'!L64","v":0},{"$f":"+'Stage 2'!K64","v":0},{"$f":"+'Stage 2'!L64","v":0},{"$f":"+'Stage 3'!K64","v":0},{"$f":"+'Stage 3'!L64","v":0},{"$f":"+'Stage 4'!K64","v":0},{"$f":"+'Stage 4'!L64","v":0},{"$f":"+'Stage 5'!K64","v":0},{"$f":"+'Stage 5'!L64","v":0},{"$f":"+'Stage 6'!K64","v":0},{"$f":"+'Stage 6'!L64","v":0},{"$f":"+D65+F65+H65+J65+L65+N65","v":0},{"$f":"+E65+G65+I65+K65+M65+O65","v":0},{"$f":"IF(ISBLANK('Shooter Information'!B66),,IF(SUM('Stage 1'!M64,'Stage 2'!M64,'Stage 3'!M64,'Stage 4'!M64,'Stage 5'!M64,'Stage 6'!M64)=0,\"Yes\",\"No\"))","v":0},null,{"$f":"IF(P65=0,99999,P65)","v":99999},{"$f":"IF(Q65=0,99999,Q65)","v":99999},{"$f":"IF(ISBLANK('Shooter Information'!C66),\"ZZZZZZZZZZ\",C65)","v":"ZZZZZZZZZZ"},{"$f":"CELL(\"row\",'Shooter Information'!B66)","v":66}]
[{"$f":"IF(ISBLANK('Shooter Information'!B67),,ROW()-4)","v":0},{"$f":"'Shooter Information'!B67","v":0},{"$f":"'Shooter Information'!C67","v":0},{"$f":"+'Stage 1'!K65","v":0},{"$f":"+'Stage 1'!L65","v":0},{"$f":"+'Stage 2'!K65","v":0},{"$f":"+'Stage 2'!L65","v":0},{"$f":"+'Stage 3'!K65","v":0},{"$f":"+'Stage 3'!L65","v":0},{"$f":"+'Stage 4'!K65","v":0},{"$f":"+'Stage 4'!L65","v":0},{"$f":"+'Stage 5'!K65","v":0},{"$f":"+'Stage 5'!L65","v":0},{"$f":"+'Stage 6'!K65","v":0},{"$f":"+'Stage 6'!L65","v":0},{"$f":"+D66+F66+H66+J66+L66+N66","v":0},{"$f":"+E66+G66+I66+K66+M66+O66","v":0},{"$f":"IF(ISBLANK('Shooter Information'!B67),,IF(SUM('Stage 1'!M65,'Stage 2'!M65,'Stage 3'!M65,'Stage 4'!M65,'Stage 5'!M65,'Stage 6'!M65)=0,\"Yes\",\"No\"))","v":0},null,{"$f":"IF(P66=0,99999,P66)","v":99999},{"$f":"IF(Q66=0,99999,Q66)","v":99999},{"$f":"IF(ISBLANK('Shooter Information'!C67),\"ZZZZZZZZZZ\",C66)","v":"ZZZZZZZZZZ"},{"$f":"CELL(\"row\",'Shooter Information'!B67)","v":67}]
[{"$f":"IF(ISBLANK('Shooter Information'!B68),,ROW()-4)","v":0},{"$f":"'Shooter Information'!B68","v":0},{"$f":"'Shooter Information'!C68","v":0},{"$f":"+'Stage 1'!K66","v":0},{"$f":"+'Stage 1'!L66","v":0},{"$f":"+'Stage 2'!K66","v":0},{"$f":"+'Stage 2'!L66","v":0},{"$f":"+'Stage 3'!K66","v":0},{"$f":"+'Stage 3'!L66","v":0},{"$f":"+'Stage 4'!K66","v":0},{"$f":"+'Stage 4'!L66","v":0},{"$f":"+'Stage 5'!K66","v":0},{"$f":"+'Stage 5'!L66","v":0},{"$f":"+'Stage 6'!K66","v":0},{"$f":"+'Stage 6'!L66","v":0},{"$f":"+D67+F67+H67+J67+L67+N67","v":0},{"$f":"+E67+G67+I67+K67+M67+O67","v":0},{"$f":"IF(ISBLANK('Shooter Information'!B68),,IF(SUM('Stage 1'!M66,'Stage 2'!M66,'Stage 3'!M66,'Stage 4'!M66,'Stage 5'!M66,'Stage 6'!M66)=0,\"Yes\",\"No\"))","v":0},null,{"$f":"IF(P67=0,99999,P67)","v":99999},{"$f":"IF(Q67=0,99999,Q67)","v":99999},{"$f":"IF(ISBLANK('Shooter Information'!C68),\"ZZZZZZZZZZ\",C67)","v":"ZZZZZZZZZZ"},{"$f":"CELL(\"row\",'Shooter Information'!B68)","v":68}]
[{"$f":"IF(ISBLANK('Shooter Information'!B69),,ROW()-4)","v":0},{"$f":"'Shooter Information'!B69","v":0},{"$f":"'Shooter Information'!C69","v":0},{"$f":"+'Stage 1'!K67","v":0},{"$f":"+'Stage 1'!L67","v":0},{"$f":"+'Stage 2'!K67","v":0},{"$f":"+'Stage 2'!L67","v":0},{"$f":"+'Stage 3'!K67","v":0},{"$f":"+'Stage 3'!L67","v":0},{"$f":"+'Stage 4'!K67","v":0},{"$f":"+'Stage 4'!L67","v":0},{"$f":"+'Stage 5'!K67","v":0},{"$f":"+'Stage 5'!L67","v":0},{"$f":"+'Stage 6'!K67","v":0},{"$f":"+'Stage 6'!L67","v":0},{"$f":"+D68+F68+H68+J68+L68+N68","v":0},{"$f":"+E68+G68+I68+K68+M68+O68","v":0},{"$f":"IF(ISBLANK('Shooter Information'!B69),,IF(SUM('Stage 1'!M67,'Stage 2'!M67,'Stage 3'!M67,'Stage 4'!M67,'Stage 5'!M67,'Stage 6'!M67)=0,\"Yes\",\"No\"))","v":0},null,{"$f":"IF(P68=0,99999,P68)","v":99999},{"$f":"IF(Q68=0,99999,Q68)","v":99999},{"$f":"IF(ISBLANK('Shooter Information'!C69),\"ZZZZZZZZZZ\",C68)","v":"ZZZZZZZZZZ"},{"$f":"CELL(\"row\",'Shooter Information'!B69)","v":69}]
[{"$f":"IF(ISBLANK('Shooter Information'!B70),,ROW()-4)","v":0},{"$f":"'Shooter Information'!B70","v":0},{"$f":"'Shooter Information'!C70","v":0},{"$f":"+'Stage 1'!K68","v":0},{"$f":"+'Stage 1'!L68","v":0},{"$f":"+'Stage 2'!K68","v":0},{"$f":"+'Stage 2'!L68","v":0},{"$f":"+'Stage 3'!K68","v":0},{"$f":"+'Stage 3'!L68","v":0},{"$f":"+'Stage 4'!K68","v":0},{"$f":"+'Stage 4'!L68","v":0},{"$f":"+'Stage 5'!K68","v":0},{"$f":"+'Stage 5'!L68","v":0},{"$f":"+'Stage 6'!K68","v":0},{"$f":"+'Stage 6'!L68","v":0},{"$f":"+D69+F69+H69+J69+L69+N69","v":0},{"$f":"+E69+G69+I69+K69+M69+O69","v":0},{"$f":"IF(ISBLANK('Shooter Information'!B70),,IF(SUM('Stage 1'!M68,'Stage 2'!M68,'Stage 3'!M68,'Stage 4'!M68,'Stage 5'!M68,'Stage 6'!M68)=0,\"Yes\",\"No\"))","v":0},null,{"$f":"IF(P69=0,99999,P69)","v":99999},{"$f":"IF(Q69=0,99999,Q69)","v":99999},{"$f":"IF(ISBLANK('Shooter Information'!C70),\"ZZZZZZZZZZ\",C69)","v":"ZZZZZZZZZZ"},{"$f":"CELL(\"row\",'Shooter Information'!B70)","v":70}]
[{"$f":"IF(ISBLANK('Shooter Information'!B71),,ROW()-4)","v":0},{"$f":"'Shooter Information'!B71","v":0},{"$f":"'Shooter Information'!C71","v":0},{"$f":"+'Stage 1'!K69","v":0},{"$f":"+'Stage 1'!L69","v":0},{"$f":"+'Stage 2'!K69","v":0},{"$f":"+'Stage 2'!L69","v":0},{"$f":"+'Stage 3'!K69","v":0},{"$f":"+'Stage 3'!L69","v":0},{"$f":"+'Stage 4'!K69","v":0},{"$f":"+'Stage 4'!L69","v":0},{"$f":"+'Stage 5'!K69","v":0},{"$f":"+'Stage 5'!L69","v":0},{"$f":"+'Stage 6'!K69","v":0},{"$f":"+'Stage 6'!L69","v":0},{"$f":"+D70+F70+H70+J70+L70+N70","v":0},{"$f":"+E70+G70+I70+K70+M70+O70","v":0},{"$f":"IF(ISBLANK('Shooter Information'!B71),,IF(SUM('Stage 1'!M69,'Stage 2'!M69,'Stage 3'!M69,'Stage 4'!M69,'Stage 5'!M69,'Stage 6'!M69)=0,\"Yes\",\"No\"))","v":0},null,{"$f":"IF(P70=0,99999,P70)","v":99999},{"$f":"IF(Q70=0,99999,Q70)","v":99999},{"$f":"IF(ISBLANK('Shooter Information'!C71),\"ZZZZZZZZZZ\",C70)","v":"ZZZZZZZZZZ"},{"$f":"CELL(\"row\",'Shooter Information'!B71)","v":71}]
[{"$f":"IF(ISBLANK('Shooter Information'!B72),,ROW()-4)","v":0},{"$f":"'Shooter Information'!B72","v":0},{"$f":"'Shooter Information'!C72","v":0},{"$f":"+'Stage 1'!K70","v":0},{"$f":"+'Stage 1'!L70","v":0},{"$f":"+'Stage 2'!K70","v":0},{"$f":"+'Stage 2'!L70","v":0},{"$f":"+'Stage 3'!K70","v":0},{"$f":"+'Stage 3'!L70","v":0},{"$f":"+'Stage 4'!K70","v":0},{"$f":"+'Stage 4'!L70","v":0},{"$f":"+'Stage 5'!K70","v":0},{"$f":"+'Stage 5'!L70","v":0},{"$f":"+'Stage 6'!K70","v":0},{"$f":"+'Stage 6'!L70","v":0},{"$f":"+D71+F71+H71+J71+L71+N71","v":0},{"$f":"+E71+G71+I71+K71+M71+O71","v":0},{"$f":"IF(ISBLANK('Shooter Information'!B72),,IF(SUM('Stage 1'!M70,'Stage 2'!M70,'Stage 3'!M70,'Stage 4'!M70,'Stage 5'!M70,'Stage 6'!M70)=0,\"Yes\",\"No\"))","v":0},null,{"$f":"IF(P71=0,99999,P71)","v":99999},{"$f":"IF(Q71=0,99999,Q71)","v":99999},{"$f":"IF(ISBLANK('Shooter Information'!C72),\"ZZZZZZZZZZ\",C71)","v":"ZZZZZZZZZZ"},{"$f":"CELL(\"row\",'Shooter Information'!B72)","v":72}]
[{"$f":"IF(ISBLANK('Shooter Information'!B73),,ROW()-4)","v":0},{"$f":"'Shooter Information'!B73","v":0},{"$f":"'Shooter Information'!C73","v":0},{"$f":"+'Stage 1'!K71","v":0},{"$f":"+'Stage 1'!L71","v":0},{"$f":"+'Stage 2'!K71","v":0},{"$f":"+'Stage 2'!L71","v":0},{"$f":"+'Stage 3'!K71","v":0},{"$f":"+'Stage 3'!L71","v":0},{"$f":"+'Stage 4'!K71","v":0},{"$f":"+'Stage 4'!L71","v":0},{"$f":"+'Stage 5'!K71","v":0},{"$f":"+'Stage 5'!L71","v":0},{"$f":"+'Stage 6'!K71","v":0},{"$f":"+'Stage 6'!L71","v":0},{"$f":"+D72+F72+H72+J72+L72+N72","v":0},{"$f":"+E72+G72+I72+K72+M72+O72","v":0},{"$f":"IF(ISBLANK('Shooter Information'!B73),,IF(SUM('Stage 1'!M71,'Stage 2'!M71,'Stage 3'!M71,'Stage 4'!M71,'Stage 5'!M71,'Stage 6'!M71)=0,\"Yes\",\"No\"))","v":0},null,{"$f":"IF(P72=0,99999,P72)","v":99999},{"$f":"IF(Q72=0,99999,Q72)","v":99999},{"$f":"IF(ISBLANK('Shooter Information'!C73),\"ZZZZZZZZZZ\",C72)","v":"ZZZZZZZZZZ"},{"$f":"CELL(\"row\",'Shooter Information'!B73)","v":73}]
[{"$f":"IF(ISBLANK('Shooter Information'!B74),,ROW()-4)","v":0},{"$f":"'Shooter Information'!B74","v":0},{"$f":"'Shooter Information'!C74","v":0},{"$f":"+'Stage 1'!K72","v":0},{"$f":"+'Stage 1'!L72","v":0},{"$f":"+'Stage 2'!K72","v":0},{"$f":"+'Stage 2'!L72","v":0},{"$f":"+'Stage 3'!K72","v":0},{"$f":"+'Stage 3'!L72","v":0},{"$f":"+'Stage 4'!K72","v":0},{"$f":"+'Stage 4'!L72","v":0},{"$f":"+'Stage 5'!K72","v":0},{"$f":"+'Stage 5'!L72","v":0},{"$f":"+'Stage 6'!K72","v":0},{"$f":"+'Stage 6'!L72","v":0},{"$f":"+D73+F73+H73+J73+L73+N73","v":0},{"$f":"+E73+G73+I73+K73+M73+O73","v":0},{"$f":"IF(ISBLANK('Shooter Information'!B74),,IF(SUM('Stage 1'!M72,'Stage 2'!M72,'Stage 3'!M72,'Stage 4'!M72,'Stage 5'!M72,'Stage 6'!M72)=0,\"Yes\",\"No\"))","v":0},null,{"$f":"IF(P73=0,99999,P73)","v":99999},{"$f":"IF(Q73=0,99999,Q73)","v":99999},{"$f":"IF(ISBLANK('Shooter Information'!C74),\"ZZZZZZZZZZ\",C73)","v":"ZZZZZZZZZZ"},{"$f":"CELL(\"row\",'Shooter Information'!B74)","v":74}]
[{"$f":"IF(ISBLANK('Shooter Information'!B75),,ROW()-4)","v":0},{"$f":"'Shooter Information'!B75","v":0},{"$f":"'Shooter Information'!C75","v":0},{"$f":"+'Stage 1'!K73","v":0},{"$f":"+'Stage 1'!L73","v":0},{"$f":"+'Stage 2'!K73","v":0},{"$f":"+'Stage 2'!L73","v":0},{"$f":"+'Stage 3'!K73","v":0},{"$f":"+'Stage 3'!L73","v":0},{"$f":"+'Stage 4'!K73","v":0},{"$f":"+'Stage 4'!L73","v":0},{"$f":"+'Stage 5'!K73","v":0},{"$f":"+'Stage 5'!L73","v":0},{"$f":"+'Stage 6'!K73","v":0},{"$f":"+'Stage 6'!L73","v":0},{"$f":"+D74+F74+H74+J74+L74+N74","v":0},{"$f":"+E74+G74+I74+K74+M74+O74","v":0},{"$f":"IF(ISBLANK('Shooter Information'!B75),,IF(SUM('Stage 1'!M73,'Stage 2'!M73,'Stage 3'!M73,'Stage 4'!M73,'Stage 5'!M73,'Stage 6'!M73)=0,\"Yes\",\"No\"))","v":0},null,{"$f":"IF(P74=0,99999,P74)","v":99999},{"$f":"IF(Q74=0,99999,Q74)","v":99999},{"$f":"IF(ISBLANK('Shooter Information'!C75),\"ZZZZZZZZZZ\",C74)","v":"ZZZZZZZZZZ"},{"$f":"CELL(\"row\",'Shooter Information'!B75)","v":75}]
[{"$f":"IF(ISBLANK('Shooter Information'!B76),,ROW()-4)","v":0},{"$f":"'Shooter Information'!B76","v":0},{"$f":"'Shooter Information'!C76","v":0},{"$f":"+'Stage 1'!K74","v":0},{"$f":"+'Stage 1'!L74","v":0},{"$f":"+'Stage 2'!K74","v":0},{"$f":"+'Stage 2'!L74","v":0},{"$f":"+'Stage 3'!K74","v":0},{"$f":"+'Stage 3'!L74","v":0},{"$f":"+'Stage 4'!K74","v":0},{"$f":"+'Stage 4'!L74","v":0},{"$f":"+'Stage 5'!K74","v":0},{"$f":"+'Stage 5'!L74","v":0},{"$f":"+'Stage 6'!K74","v":0},{"$f":"+'Stage 6'!L74","v":0},{"$f":"+D75+F75+H75+J75+L75+N75","v":0},{"$f":"+E75+G75+I75+K75+M75+O75","v":0},{"$f":"IF(ISBLANK('Shooter Information'!B76),,IF(SUM('Stage 1'!M74,'Stage 2'!M74,'Stage 3'!M74,'Stage 4'!M74,'Stage 5'!M74,'Stage 6'!M74)=0,\"Yes\",\"No\"))","v":0},null,{"$f":"IF(P75=0,99999,P75)","v":99999},{"$f":"IF(Q75=0,99999,Q75)","v":99999},{"$f":"IF(ISBLANK('Shooter Information'!C76),\"ZZZZZZZZZZ\",C75)","v":"ZZZZZZZZZZ"},{"$f":"CELL(\"row\",'Shooter Information'!B76)","v":76}]
[{"$f":"IF(ISBLANK('Shooter Information'!B77),,ROW()-4)","v":0},{"$f":"'Shooter Information'!B77","v":0},{"$f":"'Shooter Information'!C77","v":0},{"$f":"+'Stage 1'!K75","v":0},{"$f":"+'Stage 1'!L75","v":0},{"$f":"+'Stage 2'!K75","v":0},{"$f":"+'Stage 2'!L75","v":0},{"$f":"+'Stage 3'!K75","v":0},{"$f":"+'Stage 3'!L75","v":0},{"$f":"+'Stage 4'!K75","v":0},{"$f":"+'Stage 4'!L75","v":0},{"$f":"+'Stage 5'!K75","v":0},{"$f":"+'Stage 5'!L75","v":0},{"$f":"+'Stage 6'!K75","v":0},{"$f":"+'Stage 6'!L75","v":0},{"$f":"+D76+F76+H76+J76+L76+N76","v":0},{"$f":"+E76+G76+I76+K76+M76+O76","v":0},{"$f":"IF(ISBLANK('Shooter Information'!B77),,IF(SUM('Stage 1'!M75,'Stage 2'!M75,'Stage 3'!M75,'Stage 4'!M75,'Stage 5'!M75,'Stage 6'!M75)=0,\"Yes\",\"No\"))","v":0},null,{"$f":"IF(P76=0,99999,P76)","v":99999},{"$f":"IF(Q76=0,99999,Q76)","v":99999},{"$f":"IF(ISBLANK('Shooter Information'!C77),\"ZZZZZZZZZZ\",C76)","v":"ZZZZZZZZZZ"},{"$f":"CELL(\"row\",'Shooter Information'!B77)","v":77}]
[{"$f":"IF(ISBLANK('Shooter Information'!B78),,ROW()-4)","v":0},{"$f":"'Shooter Information'!B78","v":0},{"$f":"'Shooter Information'!C78","v":0},{"$f":"+'Stage 1'!K76","v":0},{"$f":"+'Stage 1'!L76","v":0},{"$f":"+'Stage 2'!K76","v":0},{"$f":"+'Stage 2'!L76","v":0},{"$f":"+'Stage 3'!K76","v":0},{"$f":"+'Stage 3'!L76","v":0},{"$f":"+'Stage 4'!K76","v":0},{"$f":"+'Stage 4'!L76","v":0},{"$f":"+'Stage 5'!K76","v":0},{"$f":"+'Stage 5'!L76","v":0},{"$f":"+'Stage 6'!K76","v":0},{"$f":"+'Stage 6'!L76","v":0},{"$f":"+D77+F77+H77+J77+L77+N77","v":0},{"$f":"+E77+G77+I77+K77+M77+O77","v":0},{"$f":"IF(ISBLANK('Shooter Information'!B78),,IF(SUM('Stage 1'!M76,'Stage 2'!M76,'Stage 3'!M76,'Stage 4'!M76,'Stage 5'!M76,'Stage 6'!M76)=0,\"Yes\",\"No\"))","v":0},null,{"$f":"IF(P77=0,99999,P77)","v":99999},{"$f":"IF(Q77=0,99999,Q77)","v":99999},{"$f":"IF(ISBLANK('Shooter Information'!C78),\"ZZZZZZZZZZ\",C77)","v":"ZZZZZZZZZZ"},{"$f":"CELL(\"row\",'Shooter Information'!B78)","v":78}]
[{"$f":"IF(ISBLANK('Shooter Information'!B79),,ROW()-4)","v":0},{"$f":"'Shooter Information'!B79","v":0},{"$f":"'Shooter Information'!C79","v":0},{"$f":"+'Stage 1'!K77","v":0},{"$f":"+'Stage 1'!L77","v":0},{"$f":"+'Stage 2'!K77","v":0},{"$f":"+'Stage 2'!L77","v":0},{"$f":"+'Stage 3'!K77","v":0},{"$f":"+'Stage 3'!L77","v":0},{"$f":"+'Stage 4'!K77","v":0},{"$f":"+'Stage 4'!L77","v":0},{"$f":"+'Stage 5'!K77","v":0},{"$f":"+'Stage 5'!L77","v":0},{"$f":"+'Stage 6'!K77","v":0},{"$f":"+'Stage 6'!L77","v":0},{"$f":"+D78+F78+H78+J78+L78+N78","v":0},{"$f":"+E78+G78+I78+K78+M78+O78","v":0},{"$f":"IF(ISBLANK('Shooter Information'!B79),,IF(SUM('Stage 1'!M77,'Stage 2'!M77,'Stage 3'!M77,'Stage 4'!M77,'Stage 5'!M77,'Stage 6'!M77)=0,\"Yes\",\"No\"))","v":0},null,{"$f":"IF(P78=0,99999,P78)","v":99999},{"$f":"IF(Q78=0,99999,Q78)","v":99999},{"$f":"IF(ISBLANK('Shooter Information'!C79),\"ZZZZZZZZZZ\",C78)","v":"ZZZZZZZZZZ"},{"$f":"CELL(\"row\",'Shooter Information'!B79)","v":79}]
[{"$f":"IF(ISBLANK('Shooter Information'!B80),,ROW()-4)","v":0},{"$f":"'Shooter Information'!B80","v":0},{"$f":"'Shooter Information'!C80","v":0},{"$f":"+'Stage 1'!K78","v":0},{"$f":"+'Stage 1'!L78","v":0},{"$f":"+'Stage 2'!K78","v":0},{"$f":"+'Stage 2'!L78","v":0},{"$f":"+'Stage 3'!K78","v":0},{"$f":"+'Stage 3'!L78","v":0},{"$f":"+'Stage 4'!K78","v":0},{"$f":"+'Stage 4'!L78","v":0},{"$f":"+'Stage 5'!K78","v":0},{"$f":"+'Stage 5'!L78","v":0},{"$f":"+'Stage 6'!K78","v":0},{"$f":"+'Stage 6'!L78","v":0},{"$f":"+D79+F79+H79+J79+L79+N79","v":0},{"$f":"+E79+G79+I79+K79+M79+O79","v":0},{"$f":"IF(ISBLANK('Shooter Information'!B80),,IF(SUM('Stage 1'!M78,'Stage 2'!M78,'Stage 3'!M78,'Stage 4'!M78,'Stage 5'!M78,'Stage 6'!M78)=0,\"Yes\",\"No\"))","v":0},null,{"$f":"IF(P79=0,99999,P79)","v":99999},{"$f":"IF(Q79=0,99999,Q79)","v":99999},{"$f":"IF(ISBLANK('Shooter Information'!C80),\"ZZZZZZZZZZ\",C79)","v":"ZZZZZZZZZZ"},{"$f":"CELL(\"row\",'Shooter Information'!B80)","v":80}]