{"text_format":"1","workbook":"xlsx","n_sheets":16,"sheets":["Shooter Information","Stage 1","Stage 2","Stage 3","Stage 4","Stage 5","Stage 6","Stage 7","Stage 8","Stage 9","Stage 10","Stage 11","Stage 12","Score Summary","Match Stats","Data Ranges"],"not_rendered":{"charts":2,"images":0,"macros":1,"external_links":0,"defined_names":7,"comments":0,"pivot_tables":0},"unopened":[],"bounds":{"document_bytes":16777216,"sheet_cells":100000,"rows_first":2000,"rows_last":500,"rows_between":2000,"halvings":0,"cell_chars":16384,"cell_head_chars":4096},"cells_cut":0,"cells_raw":0,"read":"whole","date_system":"1900"}

{"sheet":"Shooter Information","index":0,"n_rows":80,"n_cols":7,"rows_kept":80,"cut":false,"hidden":false,"merged":[]}
[null,"Shooter Information",null,"Club:","Cavalier  Cowboys"]
[null,"Score Method:","R","Date:","Sunday December 1st, 2013"]
[null,null,null,"Number of Shooters:",{"$f":"COUNTA(B6:B80)","v":15},"of",{"$f":"COUNT(A6:A151)","v":75}]
[]
["Roster #","Shooter","Class",null,"Posse","Shooting #"]
[{"$f":"ROW()-5","v":1},"Striker","GF"]
[2,"Lefty Spurmaker",49]
[3,"Hotshod","W"]
[4,"Swifty McDraw","SS"]
[5,"Prairie City Slim","SS"]
[6,"Enid City Kid","FC"]
[7,"Cockroach","CB"]
[8,"Kuba Kid","D"]
[9,"Beartooth","S"]
[10,"Slick Rick","S"]
[11,"Windhorse Rider","GF"]
[12,"Justice Jack","SS"]
[13,"B. S. Walker",49]
[14,"Red Cavanaugh",49]
[15,"Deringer Dan",49]
[16]
[17]
[18]
[19]
[20]
[21]
[22]
[23]
[24]
[25]
[26]
[27]
[28]
[29]
[30]
[31]
[32]
[{"$f":"ROW()-5","v":33}]
[34]
[35]
[36]
[37]
[38]
[39]
[40]
[41]
[42]
[43]
[44]
[45]
[46]
[47]
[48]
[49]
[50]
[51]
[52]
[53]
[54]
[55]
[56]
[57]
[58]
[59]
[60]
[61]
[62]
[63]
[64]
[{"$f":"ROW()-5","v":65}]
[66]
[67]
[68]
[69]
[70]
[71]
[72]
[73]
[74]
[75]

{"sheet":"Stage 1","index":1,"n_rows":78,"n_cols":13,"rows_kept":78,"cut":false,"hidden":false,"merged":[]}
[null,"CAS SCORE SHEET"]
[null,"Stage 1"]
["Roster #","Shooter","Class","Misses","Raw Time","Bonus","10 Sec","30 Sec","DNF","DQ","Total","Rank","Penalties"]
[{"$f":"ROW()-3","v":1},{"$f":"'Shooter Information'!B6","v":"Striker"},{"$f":"'Shooter Information'!C6","v":"GF"},null,25.99,null,null,null,null,null,{"$f":"(D4*5)+E4-F4+(G4*10)+(H4*30)+(I4*999)+(J4*999.99)","v":25.99},{"$f":"IF('Shooter Information'!$E$3-('Shooter Information'!$G$3-RANK(K4,K$4:K$78,1))<0,0,'Shooter Information'!$E$3-('Shooter Information'!$G$3-RANK(K4,K$4:K$78,1)))","v":2},{"$f":"(SUM(D4+G4+H4+I4+J4))","v":0}]
[{"$f":"ROW()-3","v":2},{"$f":"'Shooter Information'!B7","v":"Lefty Spurmaker"},{"$f":"'Shooter Information'!C7","v":49},null,25.84,null,null,null,null,null,{"$f":"(D5*5)+E5-F5+(G5*10)+(H5*30)+(I5*999)+(J5*999.99)","v":25.84},{"$f":"IF('Shooter Information'!$E$3-('Shooter Information'!$G$3-RANK(K5,K$4:K$78,1))<0,0,'Shooter Information'!$E$3-('Shooter Information'!$G$3-RANK(K5,K$4:K$78,1)))","v":1},{"$f":"(SUM(D5+G5+H5+I5+J5))","v":0}]
[3,{"$f":"'Shooter Information'!B8","v":"Hotshod"},{"$f":"'Shooter Information'!C8","v":"W"},null,51.22,null,null,null,null,null,51.22,{"$f":"IF('Shooter Information'!$E$3-('Shooter Information'!$G$3-RANK(K6,K$4:K$78,1))<0,0,'Shooter Information'!$E$3-('Shooter Information'!$G$3-RANK(K6,K$4:K$78,1)))","v":13},0]
[4,{"$f":"'Shooter Information'!B9","v":"Swifty McDraw"},{"$f":"'Shooter Information'!C9","v":"SS"},null,85.05,null,null,null,null,null,85.05,{"$f":"IF('Shooter Information'!$E$3-('Shooter Information'!$G$3-RANK(K7,K$4:K$78,1))<0,0,'Shooter Information'!$E$3-('Shooter Information'!$G$3-RANK(K7,K$4:K$78,1)))","v":14},0]
[5,{"$f":"'Shooter Information'!B10","v":"Prairie City Slim"},{"$f":"'Shooter Information'!C10","v":"SS"},null,45.65,null,null,null,null,null,45.65,{"$f":"IF('Shooter Information'!$E$3-('Shooter Information'!$G$3-RANK(K8,K$4:K$78,1))<0,0,'Shooter Information'!$E$3-('Shooter Information'!$G$3-RANK(K8,K$4:K$78,1)))","v":12},0]
[6,{"$f":"'Shooter Information'!B11","v":"Enid City Kid"},{"$f":"'Shooter Information'!C11","v":"FC"},null,34.35,null,null,null,null,null,34.35,{"$f":"IF('Shooter Information'!$E$3-('Shooter Information'!$G$3-RANK(K9,K$4:K$78,1))<0,0,'Shooter Information'!$E$3-('Shooter Information'!$G$3-RANK(K9,K$4:K$78,1)))","v":5},0]
[7,{"$f":"'Shooter Information'!B12","v":"Cockroach"},{"$f":"'Shooter Information'!C12","v":"CB"},3,26.83,null,null,null,null,null,41.83,{"$f":"IF('Shooter Information'!$E$3-('Shooter Information'!$G$3-RANK(K10,K$4:K$78,1))<0,0,'Shooter Information'!$E$3-('Shooter Information'!$G$3-RANK(K10,K$4:K$78,1)))","v":11},3]
[8,{"$f":"'Shooter Information'!B13","v":"Kuba Kid"},{"$f":"'Shooter Information'!C13","v":"D"},1,35.51,null,null,null,null,null,40.51,{"$f":"IF('Shooter Information'!$E$3-('Shooter Information'!$G$3-RANK(K11,K$4:K$78,1))<0,0,'Shooter Information'!$E$3-('Shooter Information'!$G$3-RANK(K11,K$4:K$78,1)))","v":10},1]
[9,{"$f":"'Shooter Information'!B14","v":"Beartooth"},{"$f":"'Shooter Information'!C14","v":"S"},1,30.89,null,null,null,null,null,35.89,{"$f":"IF('Shooter Information'!$E$3-('Shooter Information'!$G$3-RANK(K12,K$4:K$78,1))<0,0,'Shooter Information'!$E$3-('Shooter Information'!$G$3-RANK(K12,K$4:K$78,1)))","v":6},1]
[10,{"$f":"'Shooter Information'!B15","v":"Slick Rick"},{"$f":"'Shooter Information'!C15","v":"S"},2,118.15,null,null,null,null,null,128.15,{"$f":"IF('Shooter Information'!$E$3-('Shooter Information'!$G$3-RANK(K13,K$4:K$78,1))<0,0,'Shooter Information'!$E$3-('Shooter Information'!$G$3-RANK(K13,K$4:K$78,1)))","v":15},2]
[11,{"$f":"'Shooter Information'!B16","v":"Windhorse Rider"},{"$f":"'Shooter Information'!C16","v":"GF"},null,36.03,null,null,null,null,null,36.03,{"$f":"IF('Shooter Information'!$E$3-('Shooter Information'!$G$3-RANK(K14,K$4:K$78,1))<0,0,'Shooter Information'!$E$3-('Shooter Information'!$G$3-RANK(K14,K$4:K$78,1)))","v":7},0]
[12,{"$f":"'Shooter Information'!B17","v":"Justice Jack"},{"$f":"'Shooter Information'!C17","v":"SS"},null,29.45,null,null,null,null,null,29.45,{"$f":"IF('Shooter Information'!$E$3-('Shooter Information'!$G$3-RANK(K15,K$4:K$78,1))<0,0,'Shooter Information'!$E$3-('Shooter Information'!$G$3-RANK(K15,K$4:K$78,1)))","v":3},0]
[13,{"$f":"'Shooter Information'!B18","v":"B. S. Walker"},{"$f":"'Shooter Information'!C18","v":49},null,36.54,null,null,null,null,null,36.54,{"$f":"IF('Shooter Information'!$E$3-('Shooter Information'!$G$3-RANK(K16,K$4:K$78,1))<0,0,'Shooter Information'!$E$3-('Shooter Information'!$G$3-RANK(K16,K$4:K$78,1)))","v":9},0]
[14,{"$f":"'Shooter Information'!B19","v":"Red Cavanaugh"},{"$f":"'Shooter Information'!C19","v":49},null,31.34,null,null,null,null,null,31.34,{"$f":"IF('Shooter Information'!$E$3-('Shooter Information'!$G$3-RANK(K17,K$4:K$78,1))<0,0,'Shooter Information'!$E$3-('Shooter Information'!$G$3-RANK(K17,K$4:K$78,1)))","v":4},0]
[15,{"$f":"'Shooter Information'!B20","v":"Deringer Dan"},{"$f":"'Shooter Information'!C20","v":49},null,36.17,null,null,null,null,null,36.17,{"$f":"IF('Shooter Information'!$E$3-('Shooter Information'!$G$3-RANK(K18,K$4:K$78,1))<0,0,'Shooter Information'!$E$3-('Shooter Information'!$G$3-RANK(K18,K$4:K$78,1)))","v":8},0]
[16,{"$f":"'Shooter Information'!B21","v":0},{"$f":"'Shooter Information'!C21","v":0},null,null,null,null,null,null,null,0,{"$f":"IF('Shooter Information'!$E$3-('Shooter Information'!$G$3-RANK(K19,K$4:K$78,1))<0,0,'Shooter Information'!$E$3-('Shooter Information'!$G$3-RANK(K19,K$4:K$78,1)))","v":0},0]
[17,{"$f":"'Shooter Information'!B22","v":0},{"$f":"'Shooter Information'!C22","v":0},null,null,null,null,null,null,null,0,{"$f":"IF('Shooter Information'!$E$3-('Shooter Information'!$G$3-RANK(K20,K$4:K$78,1))<0,0,'Shooter Information'!$E$3-('Shooter Information'!$G$3-RANK(K20,K$4:K$78,1)))","v":0},0]
[18,{"$f":"'Shooter Information'!B23","v":0},{"$f":"'Shooter Information'!C23","v":0},null,null,null,null,null,null,null,0,{"$f":"IF('Shooter Information'!$E$3-('Shooter Information'!$G$3-RANK(K21,K$4:K$78,1))<0,0,'Shooter Information'!$E$3-('Shooter Information'!$G$3-RANK(K21,K$4:K$78,1)))","v":0},0]
[19,{"$f":"'Shooter Information'!B24","v":0},{"$f":"'Shooter Information'!C24","v":0},null,null,null,null,null,null,null,0,{"$f":"IF('Shooter Information'!$E$3-('Shooter Information'!$G$3-RANK(K22,K$4:K$78,1))<0,0,'Shooter Information'!$E$3-('Shooter Information'!$G$3-RANK(K22,K$4:K$78,1)))","v":0},0]
[20,{"$f":"'Shooter Information'!B25","v":0},{"$f":"'Shooter Information'!C25","v":0},null,null,null,null,null,null,null,0,{"$f":"IF('Shooter Information'!$E$3-('Shooter Information'!$G$3-RANK(K23,K$4:K$78,1))<0,0,'Shooter Information'!$E$3-('Shooter Information'!$G$3-RANK(K23,K$4:K$78,1)))","v":0},0]
[21,{"$f":"'Shooter Information'!B26","v":0},{"$f":"'Shooter Information'!C26","v":0},null,null,null,null,null,null,null,0,{"$f":"IF('Shooter Information'!$E$3-('Shooter Information'!$G$3-RANK(K24,K$4:K$78,1))<0,0,'Shooter Information'!$E$3-('Shooter Information'!$G$3-RANK(K24,K$4:K$78,1)))","v":0},0]
[22,{"$f":"'Shooter Information'!B27","v":0},{"$f":"'Shooter Information'!C27","v":0},null,null,null,null,null,null,null,0,{"$f":"IF('Shooter Information'!$E$3-('Shooter Information'!$G$3-RANK(K25,K$4:K$78,1))<0,0,'Shooter Information'!$E$3-('Shooter Information'!$G$3-RANK(K25,K$4:K$78,1)))","v":0},0]
[23,{"$f":"'Shooter Information'!B28","v":0},{"$f":"'Shooter Information'!C28","v":0},null,null,null,null,null,null,null,0,{"$f":"IF('Shooter Information'!$E$3-('Shooter Information'!$G$3-RANK(K26,K$4:K$78,1))<0,0,'Shooter Information'!$E$3-('Shooter Information'!$G$3-RANK(K26,K$4:K$78,1)))","v":0},0]
[24,{"$f":"'Shooter Information'!B29","v":0},{"$f":"'Shooter Information'!C29","v":0},null,null,null,null,null,null,null,0,{"$f":"IF('Shooter Information'!$E$3-('Shooter Information'!$G$3-RANK(K27,K$4:K$78,1))<0,0,'Shooter Information'!$E$3-('Shooter Information'!$G$3-RANK(K27,K$4:K$78,1)))","v":0},0]
[25,{"$f":"'Shooter Information'!B30","v":0},{"$f":"'Shooter Information'!C30","v":0},null,null,null,null,null,null,null,0,{"$f":"IF('Shooter Information'!$E$3-('Shooter Information'!$G$3-RANK(K28,K$4:K$78,1))<0,0,'Shooter Information'!$E$3-('Shooter Information'!$G$3-RANK(K28,K$4:K$78,1)))","v":0},0]
[26,{"$f":"'Shooter Information'!B31","v":0},{"$f":"'Shooter Information'!C31","v":0},null,null,null,null,null,null,null,0,{"$f":"IF('Shooter Information'!$E$3-('Shooter Information'!$G$3-RANK(K29,K$4:K$78,1))<0,0,'Shooter Information'!$E$3-('Shooter Information'!$G$3-RANK(K29,K$4:K$78,1)))","v":0},0]
[27,{"$f":"'Shooter Information'!B32","v":0},{"$f":"'Shooter Information'!C32","v":0},null,null,null,null,null,null,null,0,{"$f":"IF('Shooter Information'!$E$3-('Shooter Information'!$G$3-RANK(K30,K$4:K$78,1))<0,0,'Shooter Information'!$E$3-('Shooter Information'!$G$3-RANK(K30,K$4:K$78,1)))","v":0},0]
[28,{"$f":"'Shooter Information'!B33","v":0},{"$f":"'Shooter Information'!C33","v":0},null,null,null,null,null,null,null,0,{"$f":"IF('Shooter Information'!$E$3-('Shooter Information'!$G$3-RANK(K31,K$4:K$78,1))<0,0,'Shooter Information'!$E$3-('Shooter Information'!$G$3-RANK(K31,K$4:K$78,1)))","v":0},0]
[29,{"$f":"'Shooter Information'!B34","v":0},{"$f":"'Shooter Information'!C34","v":0},null,null,null,null,null,null,null,0,{"$f":"IF('Shooter Information'!$E$3-('Shooter Information'!$G$3-RANK(K32,K$4:K$78,1))<0,0,'Shooter Information'!$E$3-('Shooter Information'!$G$3-RANK(K32,K$4:K$78,1)))","v":0},0]
[30,{"$f":"'Shooter Information'!B35","v":0},{"$f":"'Shooter Information'!C35","v":0},null,null,null,null,null,null,null,0,{"$f":"IF('Shooter Information'!$E$3-('Shooter Information'!$G$3-RANK(K33,K$4:K$78,1))<0,0,'Shooter Information'!$E$3-('Shooter Information'!$G$3-RANK(K33,K$4:K$78,1)))","v":0},0]
[31,{"$f":"'Shooter Information'!B36","v":0},{"$f":"'Shooter Information'!C36","v":0},null,null,null,null,null,null,null,0,{"$f":"IF('Shooter Information'!$E$3-('Shooter Information'!$G$3-RANK(K34,K$4:K$78,1))<0,0,'Shooter Information'!$E$3-('Shooter Information'!$G$3-RANK(K34,K$4:K$78,1)))","v":0},0]
[32,{"$f":"'Shooter Information'!B37","v":0},{"$f":"'Shooter Information'!C37","v":0},null,null,null,null,null,null,null,0,{"$f":"IF('Shooter Information'!$E$3-('Shooter Information'!$G$3-RANK(K35,K$4:K$78,1))<0,0,'Shooter Information'!$E$3-('Shooter Information'!$G$3-RANK(K35,K$4:K$78,1)))","v":0},0]
[33,{"$f":"'Shooter Information'!B38","v":0},{"$f":"'Shooter Information'!C38","v":0},null,null,null,null,null,null,null,0,{"$f":"IF('Shooter Information'!$E$3-('Shooter Information'!$G$3-RANK(K36,K$4:K$78,1))<0,0,'Shooter Information'!$E$3-('Shooter Information'!$G$3-RANK(K36,K$4:K$78,1)))","v":0},0]
[34,{"$f":"'Shooter Information'!B39","v":0},{"$f":"'Shooter Information'!C39","v":0},null,null,null,null,null,null,null,0,{"$f":"IF('Shooter Information'!$E$3-('Shooter Information'!$G$3-RANK(K37,K$4:K$78,1))<0,0,'Shooter Information'!$E$3-('Shooter Information'!$G$3-RANK(K37,K$4:K$78,1)))","v":0},0]
[35,{"$f":"'Shooter Information'!B40","v":0},{"$f":"'Shooter Information'!C40","v":0},null,null,null,null,null,null,null,0,{"$f":"IF('Shooter Information'!$E$3-('Shooter Information'!$G$3-RANK(K38,K$4:K$78,1))<0,0,'Shooter Information'!$E$3-('Shooter Information'!$G$3-RANK(K38,K$4:K$78,1)))","v":0},0]
[36,{"$f":"'Shooter Information'!B41","v":0},{"$f":"'Shooter Information'!C41","v":0},null,null,null,null,null,null,null,0,{"$f":"IF('Shooter Information'!$E$3-('Shooter Information'!$G$3-RANK(K39,K$4:K$78,1))<0,0,'Shooter Information'!$E$3-('Shooter Information'!$G$3-RANK(K39,K$4:K$78,1)))","v":0},0]
[37,{"$f":"'Shooter Information'!B42","v":0},{"$f":"'Shooter Information'!C42","v":0},null,null,null,null,null,null,null,0,{"$f":"IF('Shooter Information'!$E$3-('Shooter Information'!$G$3-RANK(K40,K$4:K$78,1))<0,0,'Shooter Information'!$E$3-('Shooter Information'!$G$3-RANK(K40,K$4:K$78,1)))","v":0},0]
[38,{"$f":"'Shooter Information'!B43","v":0},{"$f":"'Shooter Information'!C43","v":0},null,null,null,null,null,null,null,0,{"$f":"IF('Shooter Information'!$E$3-('Shooter Information'!$G$3-RANK(K41,K$4:K$78,1))<0,0,'Shooter Information'!$E$3-('Shooter Information'!$G$3-RANK(K41,K$4:K$78,1)))","v":0},0]
[39,{"$f":"'Shooter Information'!B44","v":0},{"$f":"'Shooter Information'!C44","v":0},null,null,null,null,null,null,null,0,{"$f":"IF('Shooter Information'!$E$3-('Shooter Information'!$G$3-RANK(K42,K$4:K$78,1))<0,0,'Shooter Information'!$E$3-('Shooter Information'!$G$3-RANK(K42,K$4:K$78,1)))","v":0},0]
[40,{"$f":"'Shooter Information'!B45","v":0},{"$f":"'Shooter Information'!C45","v":0},null,null,null,null,null,null,null,0,{"$f":"IF('Shooter Information'!$E$3-('Shooter Information'!$G$3-RANK(K43,K$4:K$78,1))<0,0,'Shooter Information'!$E$3-('Shooter Information'!$G$3-RANK(K43,K$4:K$78,1)))","v":0},0]
[41,{"$f":"'Shooter Information'!B46","v":0},{"$f":"'Shooter Information'!C46","v":0},null,null,null,null,null,null,null,0,{"$f":"IF('Shooter Information'!$E$3-('Shooter Information'!$G$3-RANK(K44,K$4:K$78,1))<0,0,'Shooter Information'!$E$3-('Shooter Information'!$G$3-RANK(K44,K$4:K$78,1)))","v":0},0]
[42,{"$f":"'Shooter Information'!B47","v":0},{"$f":"'Shooter Information'!C47","v":0},null,null,null,null,null,null,null,0,{"$f":"IF('Shooter Information'!$E$3-('Shooter Information'!$G$3-RANK(K45,K$4:K$78,1))<0,0,'Shooter Information'!$E$3-('Shooter Information'!$G$3-RANK(K45,K$4:K$78,1)))","v":0},0]
[43,{"$f":"'Shooter Information'!B48","v":0},{"$f":"'Shooter Information'!C48","v":0},null,null,null,null,null,null,null,0,{"$f":"IF('Shooter Information'!$E$3-('Shooter Information'!$G$3-RANK(K46,K$4:K$78,1))<0,0,'Shooter Information'!$E$3-('Shooter Information'!$G$3-RANK(K46,K$4:K$78,1)))","v":0},0]
[44,{"$f":"'Shooter Information'!B49","v":0},{"$f":"'Shooter Information'!C49","v":0},null,null,null,null,null,null,null,0,{"$f":"IF('Shooter Information'!$E$3-('Shooter Information'!$G$3-RANK(K47,K$4:K$78,1))<0,0,'Shooter Information'!$E$3-('Shooter Information'!$G$3-RANK(K47,K$4:K$78,1)))","v":0},0]
[45,{"$f":"'Shooter Information'!B50","v":0},{"$f":"'Shooter Information'!C50","v":0},null,null,null,null,null,null,null,0,{"$f":"IF('Shooter Information'!$E$3-('Shooter Information'!$G$3-RANK(K48,K$4:K$78,1))<0,0,'Shooter Information'!$E$3-('Shooter Information'!$G$3-RANK(K48,K$4:K$78,1)))","v":0},0]
[46,{"$f":"'Shooter Information'!B51","v":0},{"$f":"'Shooter Information'!C51","v":0},null,null,null,null,null,null,null,0,{"$f":"IF('Shooter Information'!$E$3-('Shooter Information'!$G$3-RANK(K49,K$4:K$78,1))<0,0,'Shooter Information'!$E$3-('Shooter Information'!$G$3-RANK(K49,K$4:K$78,1)))","v":0},0]
[47,{"$f":"'Shooter Information'!B52","v":0},{"$f":"'Shooter Information'!C52","v":0},null,null,null,null,null,null,null,0,{"$f":"IF('Shooter Information'!$E$3-('Shooter Information'!$G$3-RANK(K50,K$4:K$78,1))<0,0,'Shooter Information'!$E$3-('Shooter Information'!$G$3-RANK(K50,K$4:K$78,1)))","v":0},0]
[48,{"$f":"'Shooter Information'!B53","v":0},{"$f":"'Shooter Information'!C53","v":0},null,null,null,null,null,null,null,0,{"$f":"IF('Shooter Information'!$E$3-('Shooter Information'!$G$3-RANK(K51,K$4:K$78,1))<0,0,'Shooter Information'!$E$3-('Shooter Information'!$G$3-RANK(K51,K$4:K$78,1)))","v":0},0]
[49,{"$f":"'Shooter Information'!B54","v":0},{"$f":"'Shooter Information'!C54","v":0},null,null,null,null,null,null,null,0,{"$f":"IF('Shooter Information'!$E$3-('Shooter Information'!$G$3-RANK(K52,K$4:K$78,1))<0,0,'Shooter Information'!$E$3-('Shooter Information'!$G$3-RANK(K52,K$4:K$78,1)))","v":0},0]
[50,{"$f":"'Shooter Information'!B55","v":0},{"$f":"'Shooter Information'!C55","v":0},null,null,null,null,null,null,null,0,{"$f":"IF('Shooter Information'!$E$3-('Shooter Information'!$G$3-RANK(K53,K$4:K$78,1))<0,0,'Shooter Information'!$E$3-('Shooter Information'!$G$3-RANK(K53,K$4:K$78,1)))","v":0},0]
[51,{"$f":"'Shooter Information'!B56","v":0},{"$f":"'Shooter Information'!C56","v":0},null,null,null,null,null,null,null,0,{"$f":"IF('Shooter Information'!$E$3-('Shooter Information'!$G$3-RANK(K54,K$4:K$78,1))<0,0,'Shooter Information'!$E$3-('Shooter Information'!$G$3-RANK(K54,K$4:K$78,1)))","v":0},0]
[52,{"$f":"'Shooter Information'!B57","v":0},{"$f":"'Shooter Information'!C57","v":0},null,null,null,null,null,null,null,0,{"$f":"IF('Shooter Information'!$E$3-('Shooter Information'!$G$3-RANK(K55,K$4:K$78,1))<0,0,'Shooter Information'!$E$3-('Shooter Information'!$G$3-RANK(K55,K$4:K$78,1)))","v":0},0]
[53,{"$f":"'Shooter Information'!B58","v":0},{"$f":"'Shooter Information'!C58","v":0},null,null,null,null,null,null,null,0,{"$f":"IF('Shooter Information'!$E$3-('Shooter Information'!$G$3-RANK(K56,K$4:K$78,1))<0,0,'Shooter Information'!$E$3-('Shooter Information'!$G$3-RANK(K56,K$4:K$78,1)))","v":0},0]
[54,{"$f":"'Shooter Information'!B59","v":0},{"$f":"'Shooter Information'!C59","v":0},null,null,null,null,null,null,null,0,{"$f":"IF('Shooter Information'!$E$3-('Shooter Information'!$G$3-RANK(K57,K$4:K$78,1))<0,0,'Shooter Information'!$E$3-('Shooter Information'!$G$3-RANK(K57,K$4:K$78,1)))","v":0},0]
[55,{"$f":"'Shooter Information'!B60","v":0},{"$f":"'Shooter Information'!C60","v":0},null,null,null,null,null,null,null,0,{"$f":"IF('Shooter Information'!$E$3-('Shooter Information'!$G$3-RANK(K58,K$4:K$78,1))<0,0,'Shooter Information'!$E$3-('Shooter Information'!$G$3-RANK(K58,K$4:K$78,1)))","v":0},0]
[56,{"$f":"'Shooter Information'!B61","v":0},{"$f":"'Shooter Information'!C61","v":0},null,null,null,null,null,null,null,0,{"$f":"IF('Shooter Information'!$E$3-('Shooter Information'!$G$3-RANK(K59,K$4:K$78,1))<0,0,'Shooter Information'!$E$3-('Shooter Information'!$G$3-RANK(K59,K$4:K$78,1)))","v":0},0]
[57,{"$f":"'Shooter Information'!B62","v":0},{"$f":"'Shooter Information'!C62","v":0},null,null,null,null,null,null,null,0,{"$f":"IF('Shooter Information'!$E$3-('Shooter Information'!$G$3-RANK(K60,K$4:K$78,1))<0,0,'Shooter Information'!$E$3-('Shooter Information'!$G$3-RANK(K60,K$4:K$78,1)))","v":0},0]
[58,{"$f":"'Shooter Information'!B63","v":0},{"$f":"'Shooter Information'!C63","v":0},null,null,null,null,null,null,null,0,{"$f":"IF('Shooter Information'!$E$3-('Shooter Information'!$G$3-RANK(K61,K$4:K$78,1))<0,0,'Shooter Information'!$E$3-('Shooter Information'!$G$3-RANK(K61,K$4:K$78,1)))","v":0},0]
[59,{"$f":"'Shooter Information'!B64","v":0},{"$f":"'Shooter Information'!C64","v":0},null,null,null,null,null,null,null,0,{"$f":"IF('Shooter Information'!$E$3-('Shooter Information'!$G$3-RANK(K62,K$4:K$78,1))<0,0,'Shooter Information'!$E$3-('Shooter Information'!$G$3-RANK(K62,K$4:K$78,1)))","v":0},0]
[60,{"$f":"'Shooter Information'!B65","v":0},{"$f":"'Shooter Information'!C65","v":0},null,null,null,null,null,null,null,0,{"$f":"IF('Shooter Information'!$E$3-('Shooter Information'!$G$3-RANK(K63,K$4:K$78,1))<0,0,'Shooter Information'!$E$3-('Shooter Information'!$G$3-RANK(K63,K$4:K$78,1)))","v":0},0]
[61,{"$f":"'Shooter Information'!B66","v":0},{"$f":"'Shooter Information'!C66","v":0},null,null,null,null,null,null,null,{"$f":"(D64*5)+E64-F64+(G64*10)+(H64*30)+(I64*999)+(J64*999.99)","v":0},{"$f":"IF('Shooter Information'!$E$3-('Shooter Information'!$G$3-RANK(K64,K$4:K$78,1))<0,0,'Shooter Information'!$E$3-('Shooter Information'!$G$3-RANK(K64,K$4:K$78,1)))","v":0},{"$f":"(SUM(D64+G64+H64+I64+J64))","v":0}]
[62,{"$f":"'Shooter Information'!B67","v":0},{"$f":"'Shooter Information'!C67","v":0},null,null,null,null,null,null,null,{"$f":"(D65*5)+E65-F65+(G65*10)+(H65*30)+(I65*999)+(J65*999.99)","v":0},{"$f":"IF('Shooter Information'!$E$3-('Shooter Information'!$G$3-RANK(K65,K$4:K$78,1))<0,0,'Shooter Information'!$E$3-('Shooter Information'!$G$3-RANK(K65,K$4:K$78,1)))","v":0},{"$f":"(SUM(D65+G65+H65+I65+J65))","v":0}]
[63,{"$f":"'Shooter Information'!B68","v":0},{"$f":"'Shooter Information'!C68","v":0},null,null,null,null,null,null,null,0,{"$f":"IF('Shooter Information'!$E$3-('Shooter Information'!$G$3-RANK(K66,K$4:K$78,1))<0,0,'Shooter Information'!$E$3-('Shooter Information'!$G$3-RANK(K66,K$4:K$78,1)))","v":0},0]
[64,{"$f":"'Shooter Information'!B69","v":0},{"$f":"'Shooter Information'!C69","v":0},null,null,null,null,null,null,null,0,{"$f":"IF('Shooter Information'!$E$3-('Shooter Information'!$G$3-RANK(K67,K$4:K$78,1))<0,0,'Shooter Information'!$E$3-('Shooter Information'!$G$3-RANK(K67,K$4:K$78,1)))","v":0},0]
[65,{"$f":"'Shooter Information'!B70","v":0},{"$f":"'Shooter Information'!C70","v":0},null,null,null,null,null,null,null,0,{"$f":"IF('Shooter Information'!$E$3-('Shooter Information'!$G$3-RANK(K68,K$4:K$78,1))<0,0,'Shooter Information'!$E$3-('Shooter Information'!$G$3-RANK(K68,K$4:K$78,1)))","v":0},0]
[66,{"$f":"'Shooter Information'!B71","v":0},{"$f":"'Shooter Information'!C71","v":0},null,null,null,null,null,null,null,0,{"$f":"IF('Shooter Information'!$E$3-('Shooter Information'!$G$3-RANK(K69,K$4:K$78,1))<0,0,'Shooter Information'!$E$3-('Shooter Information'!$G$3-RANK(K69,K$4:K$78,1)))","v":0},0]
[67,{"$f":"'Shooter Information'!B72","v":0},{"$f":"'Shooter Information'!C72","v":0},null,null,null,null,null,null,null,0,{"$f":"IF('Shooter Information'!$E$3-('Shooter Information'!$G$3-RANK(K70,K$4:K$78,1))<0,0,'Shooter Information'!$E$3-('Shooter Information'!$G$3-RANK(K70,K$4:K$78,1)))","v":0},0]
[68,{"$f":"'Shooter Information'!B73","v":0},{"$f":"'Shooter Information'!C73","v":0},null,null,null,null,null,null,null,0,{"$f":"IF('Shooter Information'!$E$3-('Shooter Information'!$G$3-RANK(K71,K$4:K$78,1))<0,0,'Shooter Information'!$E$3-('Shooter Information'!$G$3-RANK(K71,K$4:K$78,1)))","v":0},0]
[69,{"$f":"'Shooter Information'!B74","v":0},{"$f":"'Shooter Information'!C74","v":0},null,null,null,null,null,null,null,0,{"$f":"IF('Shooter Information'!$E$3-('Shooter Information'!$G$3-RANK(K72,K$4:K$78,1))<0,0,'Shooter Information'!$E$3-('Shooter Information'!$G$3-RANK(K72,K$4:K$78,1)))","v":0},0]
[70,{"$f":"'Shooter Information'!B75","v":0},{"$f":"'Shooter Information'!C75","v":0},null,null,null,null,null,null,null,0,{"$f":"IF('Shooter Information'!$E$3-('Shooter Information'!$G$3-RANK(K73,K$4:K$78,1))<0,0,'Shooter Information'!$E$3-('Shooter Information'!$G$3-RANK(K73,K$4:K$78,1)))","v":0},0]
[71,{"$f":"'Shooter Information'!B76","v":0},{"$f":"'Shooter Information'!C76","v":0},null,null,null,null,null,null,null,0,{"$f":"IF('Shooter Information'!$E$3-('Shooter Information'!$G$3-RANK(K74,K$4:K$78,1))<0,0,'Shooter Information'!$E$3-('Shooter Information'!$G$3-RANK(K74,K$4:K$78,1)))","v":0},0]
[72,{"$f":"'Shooter Information'!B77","v":0},{"$f":"'Shooter Information'!C77","v":0},null,null,null,null,null,null,null,0,{"$f":"IF('Shooter Information'!$E$3-('Shooter Information'!$G$3-RANK(K75,K$4:K$78,1))<0,0,'Shooter Information'!$E$3-('Shooter Information'!$G$3-RANK(K75,K$4:K$78,1)))","v":0},0]
[73,{"$f":"'Shooter Information'!B78","v":0},{"$f":"'Shooter Information'!C78","v":0},null,null,null,null,null,null,null,0,{"$f":"IF('Shooter Information'!$E$3-('Shooter Information'!$G$3-RANK(K76,K$4:K$78,1))<0,0,'Shooter Information'!$E$3-('Shooter Information'!$G$3-RANK(K76,K$4:K$78,1)))","v":0},0]
[74,{"$f":"'Shooter Information'!B79","v":0},{"$f":"'Shooter Information'!C79","v":0},null,null,null,null,null,null,null,0,{"$f":"IF('Shooter Information'!$E$3-('Shooter Information'!$G$3-RANK(K77,K$4:K$78,1))<0,0,'Shooter Information'!$E$3-('Shooter Information'!$G$3-RANK(K77,K$4:K$78,1)))","v":0},0]
[75,{"$f":"'Shooter Information'!B80","v":0},{"$f":"'Shooter Information'!C80","v":0},null,null,null,null,null,null,null,{"$f":"(D78*5)+E78-F78+(G78*10)+(H78*30)+(I78*999)+(J78*999.99)","v":0},{"$f":"IF('Shooter Information'!$E$3-('Shooter Information'!$G$3-RANK(K78,K$4:K$78,1))<0,0,'Shooter Information'!$E$3-('Shooter Information'!$G$3-RANK(K78,K$4:K$78,1)))","v":0},{"$f":"(SUM(D78+G78+H78+I78+J78))","v":0}]

{"sheet":"Stage 2","index":2,"n_rows":78,"n_cols":13,"rows_kept":78,"cut":false,"hidden":false,"merged":[]}
[null,"CAS SCORE SHEET"]
[null,"Stage 2"]
["Roster #","Shooter","Class","Misses","Raw Time","Bonus","10 Sec","30 Sec","DNF","DQ","Total","Rank","Penalties"]
[{"$f":"ROW()-3","v":1},{"$f":"'Shooter Information'!B6","v":"Striker"},{"$f":"'Shooter Information'!C6","v":"GF"},null,29.83,null,null,null,null,null,{"$f":"(D4*5)+E4-F4+(G4*10)+(H4*30)+(I4*999)+(J4*999.99)","v":29.83},{"$f":"IF('Shooter Information'!$E$3-('Shooter Information'!$G$3-RANK(K4,K$4:K$78,1))<0,0,'Shooter Information'!$E$3-('Shooter Information'!$G$3-RANK(K4,K$4:K$78,1)))","v":4},{"$f":"(SUM(D4+G4+H4+I4+J4))","v":0}]
[{"$f":"ROW()-3","v":2},{"$f":"'Shooter Information'!B7","v":"Lefty Spurmaker"},{"$f":"'Shooter Information'!C7","v":49},null,28.46,null,null,null,null,null,{"$f":"(D5*5)+E5-F5+(G5*10)+(H5*30)+(I5*999)+(J5*999.99)","v":28.46},{"$f":"IF('Shooter Information'!$E$3-('Shooter Information'!$G$3-RANK(K5,K$4:K$78,1))<0,0,'Shooter Information'!$E$3-('Shooter Information'!$G$3-RANK(K5,K$4:K$78,1)))","v":2},{"$f":"(SUM(D5+G5+H5+I5+J5))","v":0}]
[3,{"$f":"'Shooter Information'!B8","v":"Hotshod"},{"$f":"'Shooter Information'!C8","v":"W"},null,34.56,null,null,null,null,null,34.56,{"$f":"IF('Shooter Information'!$E$3-('Shooter Information'!$G$3-RANK(K6,K$4:K$78,1))<0,0,'Shooter Information'!$E$3-('Shooter Information'!$G$3-RANK(K6,K$4:K$78,1)))","v":6},0]
[4,{"$f":"'Shooter Information'!B9","v":"Swifty McDraw"},{"$f":"'Shooter Information'!C9","v":"SS"},null,45.94,null,null,null,null,null,45.94,{"$f":"IF('Shooter Information'!$E$3-('Shooter Information'!$G$3-RANK(K7,K$4:K$78,1))<0,0,'Shooter Information'!$E$3-('Shooter Information'!$G$3-RANK(K7,K$4:K$78,1)))","v":13},0]
[5,{"$f":"'Shooter Information'!B10","v":"Prairie City Slim"},{"$f":"'Shooter Information'!C10","v":"SS"},null,38.17,null,null,null,null,null,38.17,{"$f":"IF('Shooter Information'!$E$3-('Shooter Information'!$G$3-RANK(K8,K$4:K$78,1))<0,0,'Shooter Information'!$E$3-('Shooter Information'!$G$3-RANK(K8,K$4:K$78,1)))","v":9},0]
[6,{"$f":"'Shooter Information'!B11","v":"Enid City Kid"},{"$f":"'Shooter Information'!C11","v":"FC"},null,33.479999999999997,null,1,null,null,null,43.48,{"$f":"IF('Shooter Information'!$E$3-('Shooter Information'!$G$3-RANK(K9,K$4:K$78,1))<0,0,'Shooter Information'!$E$3-('Shooter Information'!$G$3-RANK(K9,K$4:K$78,1)))","v":12},1]
[7,{"$f":"'Shooter Information'!B12","v":"Cockroach"},{"$f":"'Shooter Information'!C12","v":"CB"},null,null,null,null,null,1,null,999,{"$f":"IF('Shooter Information'!$E$3-('Shooter Information'!$G$3-RANK(K10,K$4:K$78,1))<0,0,'Shooter Information'!$E$3-('Shooter Information'!$G$3-RANK(K10,K$4:K$78,1)))","v":15},1]
[8,{"$f":"'Shooter Information'!B13","v":"Kuba Kid"},{"$f":"'Shooter Information'!C13","v":"D"},null,35.42,null,null,null,null,null,35.42,{"$f":"IF('Shooter Information'!$E$3-('Shooter Information'!$G$3-RANK(K11,K$4:K$78,1))<0,0,'Shooter Information'!$E$3-('Shooter Information'!$G$3-RANK(K11,K$4:K$78,1)))","v":7},0]
[9,{"$f":"'Shooter Information'!B14","v":"Beartooth"},{"$f":"'Shooter Information'!C14","v":"S"},1,29.37,null,null,null,null,null,34.370000000000005,{"$f":"IF('Shooter Information'!$E$3-('Shooter Information'!$G$3-RANK(K12,K$4:K$78,1))<0,0,'Shooter Information'!$E$3-('Shooter Information'!$G$3-RANK(K12,K$4:K$78,1)))","v":5},1]
[10,{"$f":"'Shooter Information'!B15","v":"Slick Rick"},{"$f":"'Shooter Information'!C15","v":"S"},null,95.26,null,null,null,null,null,95.26,{"$f":"IF('Shooter Information'!$E$3-('Shooter Information'!$G$3-RANK(K13,K$4:K$78,1))<0,0,'Shooter Information'!$E$3-('Shooter Information'!$G$3-RANK(K13,K$4:K$78,1)))","v":14},0]
[11,{"$f":"'Shooter Information'!B16","v":"Windhorse Rider"},{"$f":"'Shooter Information'!C16","v":"GF"},1,37.69,null,null,null,null,null,42.69,{"$f":"IF('Shooter Information'!$E$3-('Shooter Information'!$G$3-RANK(K14,K$4:K$78,1))<0,0,'Shooter Information'!$E$3-('Shooter Information'!$G$3-RANK(K14,K$4:K$78,1)))","v":11},1]
[12,{"$f":"'Shooter Information'!B17","v":"Justice Jack"},{"$f":"'Shooter Information'!C17","v":"SS"},null,37.340000000000003,null,null,null,null,null,37.340000000000003,{"$f":"IF('Shooter Information'!$E$3-('Shooter Information'!$G$3-RANK(K15,K$4:K$78,1))<0,0,'Shooter Information'!$E$3-('Shooter Information'!$G$3-RANK(K15,K$4:K$78,1)))","v":8},0]
[13,{"$f":"'Shooter Information'!B18","v":"B. S. Walker"},{"$f":"'Shooter Information'!C18","v":49},null,25.89,null,null,null,null,null,25.89,{"$f":"IF('Shooter Information'!$E$3-('Shooter Information'!$G$3-RANK(K16,K$4:K$78,1))<0,0,'Shooter Information'!$E$3-('Shooter Information'!$G$3-RANK(K16,K$4:K$78,1)))","v":1},0]
[14,{"$f":"'Shooter Information'!B19","v":"Red Cavanaugh"},{"$f":"'Shooter Information'!C19","v":49},null,28.87,null,null,null,null,null,28.87,{"$f":"IF('Shooter Information'!$E$3-('Shooter Information'!$G$3-RANK(K17,K$4:K$78,1))<0,0,'Shooter Information'!$E$3-('Shooter Information'!$G$3-RANK(K17,K$4:K$78,1)))","v":3},0]
[15,{"$f":"'Shooter Information'!B20","v":"Deringer Dan"},{"$f":"'Shooter Information'!C20","v":49},1,37.21,null,null,null,null,null,42.21,{"$f":"IF('Shooter Information'!$E$3-('Shooter Information'!$G$3-RANK(K18,K$4:K$78,1))<0,0,'Shooter Information'!$E$3-('Shooter Information'!$G$3-RANK(K18,K$4:K$78,1)))","v":10},1]
[16,{"$f":"'Shooter Information'!B21","v":0},{"$f":"'Shooter Information'!C21","v":0},null,null,null,null,null,null,null,0,{"$f":"IF('Shooter Information'!$E$3-('Shooter Information'!$G$3-RANK(K19,K$4:K$78,1))<0,0,'Shooter Information'!$E$3-('Shooter Information'!$G$3-RANK(K19,K$4:K$78,1)))","v":0},0]
[17,{"$f":"'Shooter Information'!B22","v":0},{"$f":"'Shooter Information'!C22","v":0},null,null,null,null,null,null,null,0,{"$f":"IF('Shooter Information'!$E$3-('Shooter Information'!$G$3-RANK(K20,K$4:K$78,1))<0,0,'Shooter Information'!$E$3-('Shooter Information'!$G$3-RANK(K20,K$4:K$78,1)))","v":0},0]
[18,{"$f":"'Shooter Information'!B23","v":0},{"$f":"'Shooter Information'!C23","v":0},null,null,null,null,null,null,null,0,{"$f":"IF('Shooter Information'!$E$3-('Shooter Information'!$G$3-RANK(K21,K$4:K$78,1))<0,0,'Shooter Information'!$E$3-('Shooter Information'!$G$3-RANK(K21,K$4:K$78,1)))","v":0},0]
[19,{"$f":"'Shooter Information'!B24","v":0},{"$f":"'Shooter Information'!C24","v":0},null,null,null,null,null,null,null,0,{"$f":"IF('Shooter Information'!$E$3-('Shooter Information'!$G$3-RANK(K22,K$4:K$78,1))<0,0,'Shooter Information'!$E$3-('Shooter Information'!$G$3-RANK(K22,K$4:K$78,1)))","v":0},0]
[20,{"$f":"'Shooter Information'!B25","v":0},{"$f":"'Shooter Information'!C25","v":0},null,null,null,null,null,null,null,0,{"$f":"IF('Shooter Information'!$E$3-('Shooter Information'!$G$3-RANK(K23,K$4:K$78,1))<0,0,'Shooter Information'!$E$3-('Shooter Information'!$G$3-RANK(K23,K$4:K$78,1)))","v":0},0]
[21,{"$f":"'Shooter Information'!B26","v":0},{"$f":"'Shooter Information'!C26","v":0},null,null,null,null,null,null,null,0,{"$f":"IF('Shooter Information'!$E$3-('Shooter Information'!$G$3-RANK(K24,K$4:K$78,1))<0,0,'Shooter Information'!$E$3-('Shooter Information'!$G$3-RANK(K24,K$4:K$78,1)))","v":0},0]
[22,{"$f":"'Shooter Information'!B27","v":0},{"$f":"'Shooter Information'!C27","v":0},null,null,null,null,null,null,null,0,{"$f":"IF('Shooter Information'!$E$3-('Shooter Information'!$G$3-RANK(K25,K$4:K$78,1))<0,0,'Shooter Information'!$E$3-('Shooter Information'!$G$3-RANK(K25,K$4:K$78,1)))","v":0},0]
[23,{"$f":"'Shooter Information'!B28","v":0},{"$f":"'Shooter Information'!C28","v":0},null,null,null,null,null,null,null,0,{"$f":"IF('Shooter Information'!$E$3-('Shooter Information'!$G$3-RANK(K26,K$4:K$78,1))<0,0,'Shooter Information'!$E$3-('Shooter Information'!$G$3-RANK(K26,K$4:K$78,1)))","v":0},0]
[24,{"$f":"'Shooter Information'!B29","v":0},{"$f":"'Shooter Information'!C29","v":0},null,null,null,null,null,null,null,0,{"$f":"IF('Shooter Information'!$E$3-('Shooter Information'!$G$3-RANK(K27,K$4:K$78,1))<0,0,'Shooter Information'!$E$3-('Shooter Information'!$G$3-RANK(K27,K$4:K$78,1)))","v":0},0]
[25,{"$f":"'Shooter Information'!B30","v":0},{"$f":"'Shooter Information'!C30","v":0},null,null,null,null,null,null,null,0,{"$f":"IF('Shooter Information'!$E$3-('Shooter Information'!$G$3-RANK(K28,K$4:K$78,1))<0,0,'Shooter Information'!$E$3-('Shooter Information'!$G$3-RANK(K28,K$4:K$78,1)))","v":0},0]
[26,{"$f":"'Shooter Information'!B31","v":0},{"$f":"'Shooter Information'!C31","v":0},null,null,null,null,null,null,null,0,{"$f":"IF('Shooter Information'!$E$3-('Shooter Information'!$G$3-RANK(K29,K$4:K$78,1))<0,0,'Shooter Information'!$E$3-('Shooter Information'!$G$3-RANK(K29,K$4:K$78,1)))","v":0},0]
[27,{"$f":"'Shooter Information'!B32","v":0},{"$f":"'Shooter Information'!C32","v":0},null,null,null,null,null,null,null,0,{"$f":"IF('Shooter Information'!$E$3-('Shooter Information'!$G$3-RANK(K30,K$4:K$78,1))<0,0,'Shooter Information'!$E$3-('Shooter Information'!$G$3-RANK(K30,K$4:K$78,1)))","v":0},0]
[28,{"$f":"'Shooter Information'!B33","v":0},{"$f":"'Shooter Information'!C33","v":0},null,null,null,null,null,null,null,0,{"$f":"IF('Shooter Information'!$E$3-('Shooter Information'!$G$3-RANK(K31,K$4:K$78,1))<0,0,'Shooter Information'!$E$3-('Shooter Information'!$G$3-RANK(K31,K$4:K$78,1)))","v":0},0]
[29,{"$f":"'Shooter Information'!B34","v":0},{"$f":"'Shooter Information'!C34","v":0},null,null,null,null,null,null,null,0,{"$f":"IF('Shooter Information'!$E$3-('Shooter Information'!$G$3-RANK(K32,K$4:K$78,1))<0,0,'Shooter Information'!$E$3-('Shooter Information'!$G$3-RANK(K32,K$4:K$78,1)))","v":0},0]
[30,{"$f":"'Shooter Information'!B35","v":0},{"$f":"'Shooter Information'!C35","v":0},null,null,null,null,null,null,null,0,{"$f":"IF('Shooter Information'!$E$3-('Shooter Information'!$G$3-RANK(K33,K$4:K$78,1))<0,0,'Shooter Information'!$E$3-('Shooter Information'!$G$3-RANK(K33,K$4:K$78,1)))","v":0},0]
[31,{"$f":"'Shooter Information'!B36","v":0},{"$f":"'Shooter Information'!C36","v":0},null,null,null,null,null,null,null,0,{"$f":"IF('Shooter Information'!$E$3-('Shooter Information'!$G$3-RANK(K34,K$4:K$78,1))<0,0,'Shooter Information'!$E$3-('Shooter Information'!$G$3-RANK(K34,K$4:K$78,1)))","v":0},0]
[32,{"$f":"'Shooter Information'!B37","v":0},{"$f":"'Shooter Information'!C37","v":0},null,null,null,null,null,null,null,0,{"$f":"IF('Shooter Information'!$E$3-('Shooter Information'!$G$3-RANK(K35,K$4:K$78,1))<0,0,'Shooter Information'!$E$3-('Shooter Information'!$G$3-RANK(K35,K$4:K$78,1)))","v":0},0]
[33,{"$f":"'Shooter Information'!B38","v":0},{"$f":"'Shooter Information'!C38","v":0},null,null,null,null,null,null,null,0,{"$f":"IF('Shooter Information'!$E$3-('Shooter Information'!$G$3-RANK(K36,K$4:K$78,1))<0,0,'Shooter Information'!$E$3-('Shooter Information'!$G$3-RANK(K36,K$4:K$78,1)))","v":0},0]
[34,{"$f":"'Shooter Information'!B39","v":0},{"$f":"'Shooter Information'!C39","v":0},null,null,null,null,null,null,null,0,{"$f":"IF('Shooter Information'!$E$3-('Shooter Information'!$G$3-RANK(K37,K$4:K$78,1))<0,0,'Shooter Information'!$E$3-('Shooter Information'!$G$3-RANK(K37,K$4:K$78,1)))","v":0},0]
[35,{"$f":"'Shooter Information'!B40","v":0},{"$f":"'Shooter Information'!C40","v":0},null,null,null,null,null,null,null,0,{"$f":"IF('Shooter Information'!$E$3-('Shooter Information'!$G$3-RANK(K38,K$4:K$78,1))<0,0,'Shooter Information'!$E$3-('Shooter Information'!$G$3-RANK(K38,K$4:K$78,1)))","v":0},0]
[36,{"$f":"'Shooter Information'!B41","v":0},{"$f":"'Shooter Information'!C41","v":0},null,null,null,null,null,null,null,0,{"$f":"IF('Shooter Information'!$E$3-('Shooter Information'!$G$3-RANK(K39,K$4:K$78,1))<0,0,'Shooter Information'!$E$3-('Shooter Information'!$G$3-RANK(K39,K$4:K$78,1)))","v":0},0]
[37,{"$f":"'Shooter Information'!B42","v":0},{"$f":"'Shooter Information'!C42","v":0},null,null,null,null,null,null,null,0,{"$f":"IF('Shooter Information'!$E$3-('Shooter Information'!$G$3-RANK(K40,K$4:K$78,1))<0,0,'Shooter Information'!$E$3-('Shooter Information'!$G$3-RANK(K40,K$4:K$78,1)))","v":0},0]
[38,{"$f":"'Shooter Information'!B43","v":0},{"$f":"'Shooter Information'!C43","v":0},null,null,null,null,null,null,null,0,{"$f":"IF('Shooter Information'!$E$3-('Shooter Information'!$G$3-RANK(K41,K$4:K$78,1))<0,0,'Shooter Information'!$E$3-('Shooter Information'!$G$3-RANK(K41,K$4:K$78,1)))","v":0},0]
[39,{"$f":"'Shooter Information'!B44","v":0},{"$f":"'Shooter Information'!C44","v":0},null,null,null,null,null,null,null,0,{"$f":"IF('Shooter Information'!$E$3-('Shooter Information'!$G$3-RANK(K42,K$4:K$78,1))<0,0,'Shooter Information'!$E$3-('Shooter Information'!$G$3-RANK(K42,K$4:K$78,1)))","v":0},0]
[40,{"$f":"'Shooter Information'!B45","v":0},{"$f":"'Shooter Information'!C45","v":0},null,null,null,null,null,null,null,0,{"$f":"IF('Shooter Information'!$E$3-('Shooter Information'!$G$3-RANK(K43,K$4:K$78,1))<0,0,'Shooter Information'!$E$3-('Shooter Information'!$G$3-RANK(K43,K$4:K$78,1)))","v":0},0]
[41,{"$f":"'Shooter Information'!B46","v":0},{"$f":"'Shooter Information'!C46","v":0},null,null,null,null,null,null,null,0,{"$f":"IF('Shooter Information'!$E$3-('Shooter Information'!$G$3-RANK(K44,K$4:K$78,1))<0,0,'Shooter Information'!$E$3-('Shooter Information'!$G$3-RANK(K44,K$4:K$78,1)))","v":0},0]
[42,{"$f":"'Shooter Information'!B47","v":0},{"$f":"'Shooter Information'!C47","v":0},null,null,null,null,null,null,null,0,{"$f":"IF('Shooter Information'!$E$3-('Shooter Information'!$G$3-RANK(K45,K$4:K$78,1))<0,0,'Shooter Information'!$E$3-('Shooter Information'!$G$3-RANK(K45,K$4:K$78,1)))","v":0},0]
[43,{"$f":"'Shooter Information'!B48","v":0},{"$f":"'Shooter Information'!C48","v":0},null,null,null,null,null,null,null,0,{"$f":"IF('Shooter Information'!$E$3-('Shooter Information'!$G$3-RANK(K46,K$4:K$78,1))<0,0,'Shooter Information'!$E$3-('Shooter Information'!$G$3-RANK(K46,K$4:K$78,1)))","v":0},0]
[44,{"$f":"'Shooter Information'!B49","v":0},{"$f":"'Shooter Information'!C49","v":0},null,null,null,null,null,null,null,0,{"$f":"IF('Shooter Information'!$E$3-('Shooter Information'!$G$3-RANK(K47,K$4:K$78,1))<0,0,'Shooter Information'!$E$3-('Shooter Information'!$G$3-RANK(K47,K$4:K$78,1)))","v":0},0]
[45,{"$f":"'Shooter Information'!B50","v":0},{"$f":"'Shooter Information'!C50","v":0},null,null,null,null,null,null,null,0,{"$f":"IF('Shooter Information'!$E$3-('Shooter Information'!$G$3-RANK(K48,K$4:K$78,1))<0,0,'Shooter Information'!$E$3-('Shooter Information'!$G$3-RANK(K48,K$4:K$78,1)))","v":0},0]
[46,{"$f":"'Shooter Information'!B51","v":0},{"$f":"'Shooter Information'!C51","v":0},null,null,null,null,null,null,null,{"$f":"(D49*5)+E49-F49+(G49*10)+(H49*30)+(I49*999)+(J49*999.99)","v":0},{"$f":"IF('Shooter Information'!$E$3-('Shooter Information'!$G$3-RANK(K49,K$4:K$78,1))<0,0,'Shooter Information'!$E$3-('Shooter Information'!$G$3-RANK(K49,K$4:K$78,1)))","v":0},0]
[47,{"$f":"'Shooter Information'!B52","v":0},{"$f":"'Shooter Information'!C52","v":0},null,null,null,null,null,null,null,0,{"$f":"IF('Shooter Information'!$E$3-('Shooter Information'!$G$3-RANK(K50,K$4:K$78,1))<0,0,'Shooter Information'!$E$3-('Shooter Information'!$G$3-RANK(K50,K$4:K$78,1)))","v":0},0]
[48,{"$f":"'Shooter Information'!B53","v":0},{"$f":"'Shooter Information'!C53","v":0},null,null,null,null,null,null,null,0,{"$f":"IF('Shooter Information'!$E$3-('Shooter Information'!$G$3-RANK(K51,K$4:K$78,1))<0,0,'Shooter Information'!$E$3-('Shooter Information'!$G$3-RANK(K51,K$4:K$78,1)))","v":0},0]
[49,{"$f":"'Shooter Information'!B54","v":0},{"$f":"'Shooter Information'!C54","v":0},null,null,null,null,null,null,null,0,{"$f":"IF('Shooter Information'!$E$3-('Shooter Information'!$G$3-RANK(K52,K$4:K$78,1))<0,0,'Shooter Information'!$E$3-('Shooter Information'!$G$3-RANK(K52,K$4:K$78,1)))","v":0},0]
[50,{"$f":"'Shooter Information'!B55","v":0},{"$f":"'Shooter Information'!C55","v":0},null,null,null,null,null,null,null,0,{"$f":"IF('Shooter Information'!$E$3-('Shooter Information'!$G$3-RANK(K53,K$4:K$78,1))<0,0,'Shooter Information'!$E$3-('Shooter Information'!$G$3-RANK(K53,K$4:K$78,1)))","v":0},0]
[51,{"$f":"'Shooter Information'!B56","v":0},{"$f":"'Shooter Information'!C56","v":0},null,null,null,null,null,null,null,0,{"$f":"IF('Shooter Information'!$E$3-('Shooter Information'!$G$3-RANK(K54,K$4:K$78,1))<0,0,'Shooter Information'!$E$3-('Shooter Information'!$G$3-RANK(K54,K$4:K$78,1)))","v":0},0]
[52,{"$f":"'Shooter Information'!B57","v":0},{"$f":"'Shooter Information'!C57","v":0},null,null,null,null,null,null,null,0,{"$f":"IF('Shooter Information'!$E$3-('Shooter Information'!$G$3-RANK(K55,K$4:K$78,1))<0,0,'Shooter Information'!$E$3-('Shooter Information'!$G$3-RANK(K55,K$4:K$78,1)))","v":0},0]
[53,{"$f":"'Shooter Information'!B58","v":0},{"$f":"'Shooter Information'!C58","v":0},null,null,null,null,null,null,null,0,{"$f":"IF('Shooter Information'!$E$3-('Shooter Information'!$G$3-RANK(K56,K$4:K$78,1))<0,0,'Shooter Information'!$E$3-('Shooter Information'!$G$3-RANK(K56,K$4:K$78,1)))","v":0},0]
[54,{"$f":"'Shooter Information'!B59","v":0},{"$f":"'Shooter Information'!C59","v":0},null,null,null,null,null,null,null,0,{"$f":"IF('Shooter Information'!$E$3-('Shooter Information'!$G$3-RANK(K57,K$4:K$78,1))<0,0,'Shooter Information'!$E$3-('Shooter Information'!$G$3-RANK(K57,K$4:K$78,1)))","v":0},0]
[55,{"$f":"'Shooter Information'!B60","v":0},{"$f":"'Shooter Information'!C60","v":0},null,null,null,null,null,null,null,0,{"$f":"IF('Shooter Information'!$E$3-('Shooter Information'!$G$3-RANK(K58,K$4:K$78,1))<0,0,'Shooter Information'!$E$3-('Shooter Information'!$G$3-RANK(K58,K$4:K$78,1)))","v":0},0]
[56,{"$f":"'Shooter Information'!B61","v":0},{"$f":"'Shooter Information'!C61","v":0},null,null,null,null,null,null,null,0,{"$f":"IF('Shooter Information'!$E$3-('Shooter Information'!$G$3-RANK(K59,K$4:K$78,1))<0,0,'Shooter Information'!$E$3-('Shooter Information'!$G$3-RANK(K59,K$4:K$78,1)))","v":0},0]
[57,{"$f":"'Shooter Information'!B62","v":0},{"$f":"'Shooter Information'!C62","v":0},null,null,null,null,null,null,null,0,{"$f":"IF('Shooter Information'!$E$3-('Shooter Information'!$G$3-RANK(K60,K$4:K$78,1))<0,0,'Shooter Information'!$E$3-('Shooter Information'!$G$3-RANK(K60,K$4:K$78,1)))","v":0},0]
[58,{"$f":"'Shooter Information'!B63","v":0},{"$f":"'Shooter Information'!C63","v":0},null,null,null,null,null,null,null,0,{"$f":"IF('Shooter Information'!$E$3-('Shooter Information'!$G$3-RANK(K61,K$4:K$78,1))<0,0,'Shooter Information'!$E$3-('Shooter Information'!$G$3-RANK(K61,K$4:K$78,1)))","v":0},0]
[59,{"$f":"'Shooter Information'!B64","v":0},{"$f":"'Shooter Information'!C64","v":0},null,null,null,null,null,null,null,0,{"$f":"IF('Shooter Information'!$E$3-('Shooter Information'!$G$3-RANK(K62,K$4:K$78,1))<0,0,'Shooter Information'!$E$3-('Shooter Information'!$G$3-RANK(K62,K$4:K$78,1)))","v":0},0]
[60,{"$f":"'Shooter Information'!B65","v":0},{"$f":"'Shooter Information'!C65","v":0},null,null,null,null,null,null,null,0,{"$f":"IF('Shooter Information'!$E$3-('Shooter Information'!$G$3-RANK(K63,K$4:K$78,1))<0,0,'Shooter Information'!$E$3-('Shooter Information'!$G$3-RANK(K63,K$4:K$78,1)))","v":0},0]
[61,{"$f":"'Shooter Information'!B66","v":0},{"$f":"'Shooter Information'!C66","v":0},null,null,null,null,null,null,null,{"$f":"(D64*5)+E64-F64+(G64*10)+(H64*30)+(I64*999)+(J64*999.99)","v":0},{"$f":"IF('Shooter Information'!$E$3-('Shooter Information'!$G$3-RANK(K64,K$4:K$78,1))<0,0,'Shooter Information'!$E$3-('Shooter Information'!$G$3-RANK(K64,K$4:K$78,1)))","v":0},{"$f":"(SUM(D64+G64+H64+I64+J64))","v":0}]
[62,{"$f":"'Shooter Information'!B67","v":0},{"$f":"'Shooter Information'!C67","v":0},null,null,null,null,null,null,null,0,{"$f":"IF('Shooter Information'!$E$3-('Shooter Information'!$G$3-RANK(K65,K$4:K$78,1))<0,0,'Shooter Information'!$E$3-('Shooter Information'!$G$3-RANK(K65,K$4:K$78,1)))","v":0},0]
[63,{"$f":"'Shooter Information'!B68","v":0},{"$f":"'Shooter Information'!C68","v":0},null,null,null,null,null,null,null,0,{"$f":"IF('Shooter Information'!$E$3-('Shooter Information'!$G$3-RANK(K66,K$4:K$78,1))<0,0,'Shooter Information'!$E$3-('Shooter Information'!$G$3-RANK(K66,K$4:K$78,1)))","v":0},0]
[64,{"$f":"'Shooter Information'!B69","v":0},{"$f":"'Shooter Information'!C69","v":0},null,null,null,null,null,null,null,0,{"$f":"IF('Shooter Information'!$E$3-('Shooter Information'!$G$3-RANK(K67,K$4:K$78,1))<0,0,'Shooter Information'!$E$3-('Shooter Information'!$G$3-RANK(K67,K$4:K$78,1)))","v":0},0]
[65,{"$f":"'Shooter Information'!B70","v":0},{"$f":"'Shooter Information'!C70","v":0},null,null,null,null,null,null,null,0,{"$f":"IF('Shooter Information'!$E$3-('Shooter Information'!$G$3-RANK(K68,K$4:K$78,1))<0,0,'Shooter Information'!$E$3-('Shooter Information'!$G$3-RANK(K68,K$4:K$78,1)))","v":0},0]
[66,{"$f":"'Shooter Information'!B71","v":0},{"$f":"'Shooter Information'!C71","v":0},null,null,null,null,null,null,null,0,{"$f":"IF('Shooter Information'!$E$3-('Shooter Information'!$G$3-RANK(K69,K$4:K$78,1))<0,0,'Shooter Information'!$E$3-('Shooter Information'!$G$3-RANK(K69,K$4:K$78,1)))","v":0},0]
[67,{"$f":"'Shooter Information'!B72","v":0},{"$f":"'Shooter Information'!C72","v":0},null,null,null,null,null,null,null,0,{"$f":"IF('Shooter Information'!$E$3-('Shooter Information'!$G$3-RANK(K70,K$4:K$78,1))<0,0,'Shooter Information'!$E$3-('Shooter Information'!$G$3-RANK(K70,K$4:K$78,1)))","v":0},0]
[68,{"$f":"'Shooter Information'!B73","v":0},{"$f":"'Shooter Information'!C73","v":0},null,null,null,null,null,null,null,0,{"$f":"IF('Shooter Information'!$E$3-('Shooter Information'!$G$3-RANK(K71,K$4:K$78,1))<0,0,'Shooter Information'!$E$3-('Shooter Information'!$G$3-RANK(K71,K$4:K$78,1)))","v":0},0]
[69,{"$f":"'Shooter Information'!B74","v":0},{"$f":"'Shooter Information'!C74","v":0},null,null,null,null,null,null,null,0,{"$f":"IF('Shooter Information'!$E$3-('Shooter Information'!$G$3-RANK(K72,K$4:K$78,1))<0,0,'Shooter Information'!$E$3-('Shooter Information'!$G$3-RANK(K72,K$4:K$78,1)))","v":0},0]
[70,{"$f":"'Shooter Information'!B75","v":0},{"$f":"'Shooter Information'!C75","v":0},null,null,null,null,null,null,null,0,{"$f":"IF('Shooter Information'!$E$3-('Shooter Information'!$G$3-RANK(K73,K$4:K$78,1))<0,0,'Shooter Information'!$E$3-('Shooter Information'!$G$3-RANK(K73,K$4:K$78,1)))","v":0},0]
[71,{"$f":"'Shooter Information'!B76","v":0},{"$f":"'Shooter Information'!C76","v":0},null,null,null,null,null,null,null,0,{"$f":"IF('Shooter Information'!$E$3-('Shooter Information'!$G$3-RANK(K74,K$4:K$78,1))<0,0,'Shooter Information'!$E$3-('Shooter Information'!$G$3-RANK(K74,K$4:K$78,1)))","v":0},0]
[72,{"$f":"'Shooter Information'!B77","v":0},{"$f":"'Shooter Information'!C77","v":0},null,null,null,null,null,null,null,0,{"$f":"IF('Shooter Information'!$E$3-('Shooter Information'!$G$3-RANK(K75,K$4:K$78,1))<0,0,'Shooter Information'!$E$3-('Shooter Information'!$G$3-RANK(K75,K$4:K$78,1)))","v":0},0]
[73,{"$f":"'Shooter Information'!B78","v":0},{"$f":"'Shooter Information'!C78","v":0},null,null,null,null,null,null,null,0,{"$f":"IF('Shooter Information'!$E$3-('Shooter Information'!$G$3-RANK(K76,K$4:K$78,1))<0,0,'Shooter Information'!$E$3-('Shooter Information'!$G$3-RANK(K76,K$4:K$78,1)))","v":0},0]
[74,{"$f":"'Shooter Information'!B79","v":0},{"$f":"'Shooter Information'!C79","v":0},null,null,null,null,null,null,null,0,{"$f":"IF('Shooter Information'!$E$3-('Shooter Information'!$G$3-RANK(K77,K$4:K$78,1))<0,0,'Shooter Information'!$E$3-('Shooter Information'!$G$3-RANK(K77,K$4:K$78,1)))","v":0},0]
[75,{"$f":"'Shooter Information'!B80","v":0},{"$f":"'Shooter Information'!C80","v":0},null,null,null,null,null,null,null,0,{"$f":"IF('Shooter Information'!$E$3-('Shooter Information'!$G$3-RANK(K78,K$4:K$78,1))<0,0,'Shooter Information'!$E$3-('Shooter Information'!$G$3-RANK(K78,K$4:K$78,1)))","v":0},0]

{"sheet":"Stage 3","index":3,"n_rows":78,"n_cols":13,"rows_kept":78,"cut":false,"hidden":false,"merged":[]}
[null,"CAS SCORE SHEET"]
[null,"Stage 3"]
["Roster #","Shooter","Class","Misses","Raw Time","Bonus","10 Sec","30 Sec","DNF","DQ","Total","Rank","Penalties"]
[{"$f":"ROW()-3","v":1},{"$f":"'Shooter Information'!B6","v":"Striker"},{"$f":"'Shooter Information'!C6","v":"GF"},null,36.79,null,null,null,null,null,{"$f":"(D4*5)+E4-F4+(G4*10)+(H4*30)+(I4*999)+(J4*999.99)","v":36.79},{"$f":"IF('Shooter Information'!$E$3-('Shooter Information'!$G$3-RANK(K4,K$4:K$78,1))<0,0,'Shooter Information'!$E$3-('Shooter Information'!$G$3-RANK(K4,K$4:K$78,1)))","v":4},{"$f":"(SUM(D4+G4+H4+I4+J4))","v":0}]
[{"$f":"ROW()-3","v":2},{"$f":"'Shooter Information'!B7","v":"Lefty Spurmaker"},{"$f":"'Shooter Information'!C7","v":49},null,33.659999999999997,null,null,null,null,null,{"$f":"(D5*5)+E5-F5+(G5*10)+(H5*30)+(I5*999)+(J5*999.99)","v":33.659999999999997},{"$f":"IF('Shooter Information'!$E$3-('Shooter Information'!$G$3-RANK(K5,K$4:K$78,1))<0,0,'Shooter Information'!$E$3-('Shooter Information'!$G$3-RANK(K5,K$4:K$78,1)))","v":2},{"$f":"(SUM(D5+G5+H5+I5+J5))","v":0}]
[3,{"$f":"'Shooter Information'!B8","v":"Hotshod"},{"$f":"'Shooter Information'!C8","v":"W"},null,49.11,null,null,null,null,null,49.11,{"$f":"IF('Shooter Information'!$E$3-('Shooter Information'!$G$3-RANK(K6,K$4:K$78,1))<0,0,'Shooter Information'!$E$3-('Shooter Information'!$G$3-RANK(K6,K$4:K$78,1)))","v":13},0]
[4,{"$f":"'Shooter Information'!B9","v":"Swifty McDraw"},{"$f":"'Shooter Information'!C9","v":"SS"},null,44.47,null,null,null,null,null,44.47,{"$f":"IF('Shooter Information'!$E$3-('Shooter Information'!$G$3-RANK(K7,K$4:K$78,1))<0,0,'Shooter Information'!$E$3-('Shooter Information'!$G$3-RANK(K7,K$4:K$78,1)))","v":9},0]
[5,{"$f":"'Shooter Information'!B10","v":"Prairie City Slim"},{"$f":"'Shooter Information'!C10","v":"SS"},null,45.15,null,null,null,null,null,45.15,{"$f":"IF('Shooter Information'!$E$3-('Shooter Information'!$G$3-RANK(K8,K$4:K$78,1))<0,0,'Shooter Information'!$E$3-('Shooter Information'!$G$3-RANK(K8,K$4:K$78,1)))","v":10},0]
[6,{"$f":"'Shooter Information'!B11","v":"Enid City Kid"},{"$f":"'Shooter Information'!C11","v":"FC"},null,39.119999999999997,null,null,null,null,null,39.119999999999997,{"$f":"IF('Shooter Information'!$E$3-('Shooter Information'!$G$3-RANK(K9,K$4:K$78,1))<0,0,'Shooter Information'!$E$3-('Shooter Information'!$G$3-RANK(K9,K$4:K$78,1)))","v":7},0]
[7,{"$f":"'Shooter Information'!B12","v":"Cockroach"},{"$f":"'Shooter Information'!C12","v":"CB"},null,null,null,null,null,1,null,999,{"$f":"IF('Shooter Information'!$E$3-('Shooter Information'!$G$3-RANK(K10,K$4:K$78,1))<0,0,'Shooter Information'!$E$3-('Shooter Information'!$G$3-RANK(K10,K$4:K$78,1)))","v":15},1]
[8,{"$f":"'Shooter Information'!B13","v":"Kuba Kid"},{"$f":"'Shooter Information'!C13","v":"D"},null,39.6,null,null,null,null,null,39.6,{"$f":"IF('Shooter Information'!$E$3-('Shooter Information'!$G$3-RANK(K11,K$4:K$78,1))<0,0,'Shooter Information'!$E$3-('Shooter Information'!$G$3-RANK(K11,K$4:K$78,1)))","v":8},0]
[9,{"$f":"'Shooter Information'!B14","v":"Beartooth"},{"$f":"'Shooter Information'!C14","v":"S"},null,36.799999999999997,null,null,null,null,null,36.799999999999997,{"$f":"IF('Shooter Information'!$E$3-('Shooter Information'!$G$3-RANK(K12,K$4:K$78,1))<0,0,'Shooter Information'!$E$3-('Shooter Information'!$G$3-RANK(K12,K$4:K$78,1)))","v":5},0]
[10,{"$f":"'Shooter Information'!B15","v":"Slick Rick"},{"$f":"'Shooter Information'!C15","v":"S"},1,92.7,null,null,null,null,null,97.7,{"$f":"IF('Shooter Information'!$E$3-('Shooter Information'!$G$3-RANK(K13,K$4:K$78,1))<0,0,'Shooter Information'!$E$3-('Shooter Information'!$G$3-RANK(K13,K$4:K$78,1)))","v":14},1]
[11,{"$f":"'Shooter Information'!B16","v":"Windhorse Rider"},{"$f":"'Shooter Information'!C16","v":"GF"},null,48.35,null,null,null,null,null,48.35,{"$f":"IF('Shooter Information'!$E$3-('Shooter Information'!$G$3-RANK(K14,K$4:K$78,1))<0,0,'Shooter Information'!$E$3-('Shooter Information'!$G$3-RANK(K14,K$4:K$78,1)))","v":12},0]
[12,{"$f":"'Shooter Information'!B17","v":"Justice Jack"},{"$f":"'Shooter Information'!C17","v":"SS"},null,33.75,null,null,null,null,null,33.75,{"$f":"IF('Shooter Information'!$E$3-('Shooter Information'!$G$3-RANK(K15,K$4:K$78,1))<0,0,'Shooter Information'!$E$3-('Shooter Information'!$G$3-RANK(K15,K$4:K$78,1)))","v":3},0]
[13,{"$f":"'Shooter Information'!B18","v":"B. S. Walker"},{"$f":"'Shooter Information'!C18","v":49},null,30.93,null,null,null,null,null,30.93,{"$f":"IF('Shooter Information'!$E$3-('Shooter Information'!$G$3-RANK(K16,K$4:K$78,1))<0,0,'Shooter Information'!$E$3-('Shooter Information'!$G$3-RANK(K16,K$4:K$78,1)))","v":1},0]
[14,{"$f":"'Shooter Information'!B19","v":"Red Cavanaugh"},{"$f":"'Shooter Information'!C19","v":49},1,33.619999999999997,null,null,null,null,null,38.619999999999997,{"$f":"IF('Shooter Information'!$E$3-('Shooter Information'!$G$3-RANK(K17,K$4:K$78,1))<0,0,'Shooter Information'!$E$3-('Shooter Information'!$G$3-RANK(K17,K$4:K$78,1)))","v":6},1]
[15,{"$f":"'Shooter Information'!B20","v":"Deringer Dan"},{"$f":"'Shooter Information'!C20","v":49},null,46.3,null,null,null,null,null,46.3,{"$f":"IF('Shooter Information'!$E$3-('Shooter Information'!$G$3-RANK(K18,K$4:K$78,1))<0,0,'Shooter Information'!$E$3-('Shooter Information'!$G$3-RANK(K18,K$4:K$78,1)))","v":11},0]
[16,{"$f":"'Shooter Information'!B21","v":0},{"$f":"'Shooter Information'!C21","v":0},null,null,null,null,null,null,null,0,{"$f":"IF('Shooter Information'!$E$3-('Shooter Information'!$G$3-RANK(K19,K$4:K$78,1))<0,0,'Shooter Information'!$E$3-('Shooter Information'!$G$3-RANK(K19,K$4:K$78,1)))","v":0},0]
[17,{"$f":"'Shooter Information'!B22","v":0},{"$f":"'Shooter Information'!C22","v":0},null,null,null,null,null,null,null,0,{"$f":"IF('Shooter Information'!$E$3-('Shooter Information'!$G$3-RANK(K20,K$4:K$78,1))<0,0,'Shooter Information'!$E$3-('Shooter Information'!$G$3-RANK(K20,K$4:K$78,1)))","v":0},0]
[18,{"$f":"'Shooter Information'!B23","v":0},{"$f":"'Shooter Information'!C23","v":0},null,null,null,null,null,null,null,0,{"$f":"IF('Shooter Information'!$E$3-('Shooter Information'!$G$3-RANK(K21,K$4:K$78,1))<0,0,'Shooter Information'!$E$3-('Shooter Information'!$G$3-RANK(K21,K$4:K$78,1)))","v":0},0]
[19,{"$f":"'Shooter Information'!B24","v":0},{"$f":"'Shooter Information'!C24","v":0},null,null,null,null,null,null,null,0,{"$f":"IF('Shooter Information'!$E$3-('Shooter Information'!$G$3-RANK(K22,K$4:K$78,1))<0,0,'Shooter Information'!$E$3-('Shooter Information'!$G$3-RANK(K22,K$4:K$78,1)))","v":0},0]
[20,{"$f":"'Shooter Information'!B25","v":0},{"$f":"'Shooter Information'!C25","v":0},null,null,null,null,null,null,null,0,{"$f":"IF('Shooter Information'!$E$3-('Shooter Information'!$G$3-RANK(K23,K$4:K$78,1))<0,0,'Shooter Information'!$E$3-('Shooter Information'!$G$3-RANK(K23,K$4:K$78,1)))","v":0},0]
[21,{"$f":"'Shooter Information'!B26","v":0},{"$f":"'Shooter Information'!C26","v":0},null,null,null,null,null,null,null,0,{"$f":"IF('Shooter Information'!$E$3-('Shooter Information'!$G$3-RANK(K24,K$4:K$78,1))<0,0,'Shooter Information'!$E$3-('Shooter Information'!$G$3-RANK(K24,K$4:K$78,1)))","v":0},0]
[22,{"$f":"'Shooter Information'!B27","v":0},{"$f":"'Shooter Information'!C27","v":0},null,null,null,null,null,null,null,0,{"$f":"IF('Shooter Information'!$E$3-('Shooter Information'!$G$3-RANK(K25,K$4:K$78,1))<0,0,'Shooter Information'!$E$3-('Shooter Information'!$G$3-RANK(K25,K$4:K$78,1)))","v":0},0]
[23,{"$f":"'Shooter Information'!B28","v":0},{"$f":"'Shooter Information'!C28","v":0},null,null,null,null,null,null,null,0,{"$f":"IF('Shooter Information'!$E$3-('Shooter Information'!$G$3-RANK(K26,K$4:K$78,1))<0,0,'Shooter Information'!$E$3-('Shooter Information'!$G$3-RANK(K26,K$4:K$78,1)))","v":0},0]
[24,{"$f":"'Shooter Information'!B29","v":0},{"$f":"'Shooter Information'!C29","v":0},null,null,null,null,null,null,null,0,{"$f":"IF('Shooter Information'!$E$3-('Shooter Information'!$G$3-RANK(K27,K$4:K$78,1))<0,0,'Shooter Information'!$E$3-('Shooter Information'!$G$3-RANK(K27,K$4:K$78,1)))","v":0},0]
[25,{"$f":"'Shooter Information'!B30","v":0},{"$f":"'Shooter Information'!C30","v":0},null,null,null,null,null,null,null,0,{"$f":"IF('Shooter Information'!$E$3-('Shooter Information'!$G$3-RANK(K28,K$4:K$78,1))<0,0,'Shooter Information'!$E$3-('Shooter Information'!$G$3-RANK(K28,K$4:K$78,1)))","v":0},0]
[26,{"$f":"'Shooter Information'!B31","v":0},{"$f":"'Shooter Information'!C31","v":0},null,null,null,null,null,null,null,0,{"$f":"IF('Shooter Information'!$E$3-('Shooter Information'!$G$3-RANK(K29,K$4:K$78,1))<0,0,'Shooter Information'!$E$3-('Shooter Information'!$G$3-RANK(K29,K$4:K$78,1)))","v":0},0]
[27,{"$f":"'Shooter Information'!B32","v":0},{"$f":"'Shooter Information'!C32","v":0},null,null,null,null,null,null,null,0,{"$f":"IF('Shooter Information'!$E$3-('Shooter Information'!$G$3-RANK(K30,K$4:K$78,1))<0,0,'Shooter Information'!$E$3-('Shooter Information'!$G$3-RANK(K30,K$4:K$78,1)))","v":0},0]
[28,{"$f":"'Shooter Information'!B33","v":0},{"$f":"'Shooter Information'!C33","v":0},null,null,null,null,null,null,null,0,{"$f":"IF('Shooter Information'!$E$3-('Shooter Information'!$G$3-RANK(K31,K$4:K$78,1))<0,0,'Shooter Information'!$E$3-('Shooter Information'!$G$3-RANK(K31,K$4:K$78,1)))","v":0},0]
[29,{"$f":"'Shooter Information'!B34","v":0},{"$f":"'Shooter Information'!C34","v":0},null,null,null,null,null,null,null,0,{"$f":"IF('Shooter Information'!$E$3-('Shooter Information'!$G$3-RANK(K32,K$4:K$78,1))<0,0,'Shooter Information'!$E$3-('Shooter Information'!$G$3-RANK(K32,K$4:K$78,1)))","v":0},0]
[30,{"$f":"'Shooter Information'!B35","v":0},{"$f":"'Shooter Information'!C35","v":0},null,null,null,null,null,null,null,0,{"$f":"IF('Shooter Information'!$E$3-('Shooter Information'!$G$3-RANK(K33,K$4:K$78,1))<0,0,'Shooter Information'!$E$3-('Shooter Information'!$G$3-RANK(K33,K$4:K$78,1)))","v":0},0]
[31,{"$f":"'Shooter Information'!B36","v":0},{"$f":"'Shooter Information'!C36","v":0},null,null,null,null,null,null,null,0,{"$f":"IF('Shooter Information'!$E$3-('Shooter Information'!$G$3-RANK(K34,K$4:K$78,1))<0,0,'Shooter Information'!$E$3-('Shooter Information'!$G$3-RANK(K34,K$4:K$78,1)))","v":0},0]
[32,{"$f":"'Shooter Information'!B37","v":0},{"$f":"'Shooter Information'!C37","v":0},null,null,null,null,null,null,null,0,{"$f":"IF('Shooter Information'!$E$3-('Shooter Information'!$G$3-RANK(K35,K$4:K$78,1))<0,0,'Shooter Information'!$E$3-('Shooter Information'!$G$3-RANK(K35,K$4:K$78,1)))","v":0},0]
[33,{"$f":"'Shooter Information'!B38","v":0},{"$f":"'Shooter Information'!C38","v":0},null,null,null,null,null,null,null,0,{"$f":"IF('Shooter Information'!$E$3-('Shooter Information'!$G$3-RANK(K36,K$4:K$78,1))<0,0,'Shooter Information'!$E$3-('Shooter Information'!$G$3-RANK(K36,K$4:K$78,1)))","v":0},0]
[34,{"$f":"'Shooter Information'!B39","v":0},{"$f":"'Shooter Information'!C39","v":0},null,null,null,null,null,null,null,0,{"$f":"IF('Shooter Information'!$E$3-('Shooter Information'!$G$3-RANK(K37,K$4:K$78,1))<0,0,'Shooter Information'!$E$3-('Shooter Information'!$G$3-RANK(K37,K$4:K$78,1)))","v":0},0]
[35,{"$f":"'Shooter Information'!B40","v":0},{"$f":"'Shooter Information'!C40","v":0},null,null,null,null,null,null,null,0,{"$f":"IF('Shooter Information'!$E$3-('Shooter Information'!$G$3-RANK(K38,K$4:K$78,1))<0,0,'Shooter Information'!$E$3-('Shooter Information'!$G$3-RANK(K38,K$4:K$78,1)))","v":0},0]
[36,{"$f":"'Shooter Information'!B41","v":0},{"$f":"'Shooter Information'!C41","v":0},null,null,null,null,null,null,null,0,{"$f":"IF('Shooter Information'!$E$3-('Shooter Information'!$G$3-RANK(K39,K$4:K$78,1))<0,0,'Shooter Information'!$E$3-('Shooter Information'!$G$3-RANK(K39,K$4:K$78,1)))","v":0},0]
[37,{"$f":"'Shooter Information'!B42","v":0},{"$f":"'Shooter Information'!C42","v":0},null,null,null,null,null,null,null,0,{"$f":"IF('Shooter Information'!$E$3-('Shooter Information'!$G$3-RANK(K40,K$4:K$78,1))<0,0,'Shooter Information'!$E$3-('Shooter Information'!$G$3-RANK(K40,K$4:K$78,1)))","v":0},0]
[38,{"$f":"'Shooter Information'!B43","v":0},{"$f":"'Shooter Information'!C43","v":0},null,null,null,null,null,null,null,0,{"$f":"IF('Shooter Information'!$E$3-('Shooter Information'!$G$3-RANK(K41,K$4:K$78,1))<0,0,'Shooter Information'!$E$3-('Shooter Information'!$G$3-RANK(K41,K$4:K$78,1)))","v":0},0]
[39,{"$f":"'Shooter Information'!B44","v":0},{"$f":"'Shooter Information'!C44","v":0},null,null,null,null,null,null,null,0,{"$f":"IF('Shooter Information'!$E$3-('Shooter Information'!$G$3-RANK(K42,K$4:K$78,1))<0,0,'Shooter Information'!$E$3-('Shooter Information'!$G$3-RANK(K42,K$4:K$78,1)))","v":0},0]
[40,{"$f":"'Shooter Information'!B45","v":0},{"$f":"'Shooter Information'!C45","v":0},null,null,null,null,null,null,null,0,{"$f":"IF('Shooter Information'!$E$3-('Shooter Information'!$G$3-RANK(K43,K$4:K$78,1))<0,0,'Shooter Information'!$E$3-('Shooter Information'!$G$3-RANK(K43,K$4:K$78,1)))","v":0},0]
[41,{"$f":"'Shooter Information'!B46","v":0},{"$f":"'Shooter Information'!C46","v":0},null,null,null,null,null,null,null,0,{"$f":"IF('Shooter Information'!$E$3-('Shooter Information'!$G$3-RANK(K44,K$4:K$78,1))<0,0,'Shooter Information'!$E$3-('Shooter Information'!$G$3-RANK(K44,K$4:K$78,1)))","v":0},0]
[42,{"$f":"'Shooter Information'!B47","v":0},{"$f":"'Shooter Information'!C47","v":0},null,null,null,null,null,null,null,0,{"$f":"IF('Shooter Information'!$E$3-('Shooter Information'!$G$3-RANK(K45,K$4:K$78,1))<0,0,'Shooter Information'!$E$3-('Shooter Information'!$G$3-RANK(K45,K$4:K$78,1)))","v":0},0]
[43,{"$f":"'Shooter Information'!B48","v":0},{"$f":"'Shooter Information'!C48","v":0},null,null,null,null,null,null,null,0,{"$f":"IF('Shooter Information'!$E$3-('Shooter Information'!$G$3-RANK(K46,K$4:K$78,1))<0,0,'Shooter Information'!$E$3-('Shooter Information'!$G$3-RANK(K46,K$4:K$78,1)))","v":0},0]
[44,{"$f":"'Shooter Information'!B49","v":0},{"$f":"'Shooter Information'!C49","v":0},null,null,null,null,null,null,null,0,{"$f":"IF('Shooter Information'!$E$3-('Shooter Information'!$G$3-RANK(K47,K$4:K$78,1))<0,0,'Shooter Information'!$E$3-('Shooter Information'!$G$3-RANK(K47,K$4:K$78,1)))","v":0},0]
[45,{"$f":"'Shooter Information'!B50","v":0},{"$f":"'Shooter Information'!C50","v":0},null,null,null,null,null,null,null,0,{"$f":"IF('Shooter Information'!$E$3-('Shooter Information'!$G$3-RANK(K48,K$4:K$78,1))<0,0,'Shooter Information'!$E$3-('Shooter Information'!$G$3-RANK(K48,K$4:K$78,1)))","v":0},0]
[46,{"$f":"'Shooter Information'!B51","v":0},{"$f":"'Shooter Information'!C51","v":0},null,null,null,null,null,null,null,{"$f":"(D49*5)+E49-F49+(G49*10)+(H49*30)+(I49*999)+(J49*999.99)","v":0},{"$f":"IF('Shooter Information'!$E$3-('Shooter Information'!$G$3-RANK(K49,K$4:K$78,1))<0,0,'Shooter Information'!$E$3-('Shooter Information'!$G$3-RANK(K49,K$4:K$78,1)))","v":0},0]
[47,{"$f":"'Shooter Information'!B52","v":0},{"$f":"'Shooter Information'!C52","v":0},null,null,null,null,null,null,null,0,{"$f":"IF('Shooter Information'!$E$3-('Shooter Information'!$G$3-RANK(K50,K$4:K$78,1))<0,0,'Shooter Information'!$E$3-('Shooter Information'!$G$3-RANK(K50,K$4:K$78,1)))","v":0},0]
[48,{"$f":"'Shooter Information'!B53","v":0},{"$f":"'Shooter Information'!C53","v":0},null,null,null,null,null,null,null,0,{"$f":"IF('Shooter Information'!$E$3-('Shooter Information'!$G$3-RANK(K51,K$4:K$78,1))<0,0,'Shooter Information'!$E$3-('Shooter Information'!$G$3-RANK(K51,K$4:K$78,1)))","v":0},0]
[49,{"$f":"'Shooter Information'!B54","v":0},{"$f":"'Shooter Information'!C54","v":0},null,null,null,null,null,null,null,0,{"$f":"IF('Shooter Information'!$E$3-('Shooter Information'!$G$3-RANK(K52,K$4:K$78,1))<0,0,'Shooter Information'!$E$3-('Shooter Information'!$G$3-RANK(K52,K$4:K$78,1)))","v":0},0]
[50,{"$f":"'Shooter Information'!B55","v":0},{"$f":"'Shooter Information'!C55","v":0},null,null,null,null,null,null,null,0,{"$f":"IF('Shooter Information'!$E$3-('Shooter Information'!$G$3-RANK(K53,K$4:K$78,1))<0,0,'Shooter Information'!$E$3-('Shooter Information'!$G$3-RANK(K53,K$4:K$78,1)))","v":0},0]
[51,{"$f":"'Shooter Information'!B56","v":0},{"$f":"'Shooter Information'!C56","v":0},null,null,null,null,null,null,null,0,{"$f":"IF('Shooter Information'!$E$3-('Shooter Information'!$G$3-RANK(K54,K$4:K$78,1))<0,0,'Shooter Information'!$E$3-('Shooter Information'!$G$3-RANK(K54,K$4:K$78,1)))","v":0},0]
[52,{"$f":"'Shooter Information'!B57","v":0},{"$f":"'Shooter Information'!C57","v":0},null,null,null,null,null,null,null,0,{"$f":"IF('Shooter Information'!$E$3-('Shooter Information'!$G$3-RANK(K55,K$4:K$78,1))<0,0,'Shooter Information'!$E$3-('Shooter Information'!$G$3-RANK(K55,K$4:K$78,1)))","v":0},0]
[53,{"$f":"'Shooter Information'!B58","v":0},{"$f":"'Shooter Information'!C58","v":0},null,null,null,null,null,null,null,0,{"$f":"IF('Shooter Information'!$E$3-('Shooter Information'!$G$3-RANK(K56,K$4:K$78,1))<0,0,'Shooter Information'!$E$3-('Shooter Information'!$G$3-RANK(K56,K$4:K$78,1)))","v":0},0]
[54,{"$f":"'Shooter Information'!B59","v":0},{"$f":"'Shooter Information'!C59","v":0},null,null,null,null,null,null,null,0,{"$f":"IF('Shooter Information'!$E$3-('Shooter Information'!$G$3-RANK(K57,K$4:K$78,1))<0,0,'Shooter Information'!$E$3-('Shooter Information'!$G$3-RANK(K57,K$4:K$78,1)))","v":0},0]
[55,{"$f":"'Shooter Information'!B60","v":0},{"$f":"'Shooter Information'!C60","v":0},null,null,null,null,null,null,null,0,{"$f":"IF('Shooter Information'!$E$3-('Shooter Information'!$G$3-RANK(K58,K$4:K$78,1))<0,0,'Shooter Information'!$E$3-('Shooter Information'!$G$3-RANK(K58,K$4:K$78,1)))","v":0},0]
[56,{"$f":"'Shooter Information'!B61","v":0},{"$f":"'Shooter Information'!C61","v":0},null,null,null,null,null,null,null,0,{"$f":"IF('Shooter Information'!$E$3-('Shooter Information'!$G$3-RANK(K59,K$4:K$78,1))<0,0,'Shooter Information'!$E$3-('Shooter Information'!$G$3-RANK(K59,K$4:K$78,1)))","v":0},0]
[57,{"$f":"'Shooter Information'!B62","v":0},{"$f":"'Shooter Information'!C62","v":0},null,null,null,null,null,null,null,0,{"$f":"IF('Shooter Information'!$E$3-('Shooter Information'!$G$3-RANK(K60,K$4:K$78,1))<0,0,'Shooter Information'!$E$3-('Shooter Information'!$G$3-RANK(K60,K$4:K$78,1)))","v":0},0]
[58,{"$f":"'Shooter Information'!B63","v":0},{"$f":"'Shooter Information'!C63","v":0},null,null,null,null,null,null,null,0,{"$f":"IF('Shooter Information'!$E$3-('Shooter Information'!$G$3-RANK(K61,K$4:K$78,1))<0,0,'Shooter Information'!$E$3-('Shooter Information'!$G$3-RANK(K61,K$4:K$78,1)))","v":0},0]
[59,{"$f":"'Shooter Information'!B64","v":0},{"$f":"'Shooter Information'!C64","v":0},null,null,null,null,null,null,null,0,{"$f":"IF('Shooter Information'!$E$3-('Shooter Information'!$G$3-RANK(K62,K$4:K$78,1))<0,0,'Shooter Information'!$E$3-('Shooter Information'!$G$3-RANK(K62,K$4:K$78,1)))","v":0},0]
[60,{"$f":"'Shooter Information'!B65","v":0},{"$f":"'Shooter Information'!C65","v":0},null,null,null,null,null,null,null,0,{"$f":"IF('Shooter Information'!$E$3-('Shooter Information'!$G$3-RANK(K63,K$4:K$78,1))<0,0,'Shooter Information'!$E$3-('Shooter Information'!$G$3-RANK(K63,K$4:K$78,1)))","v":0},0]
[61,{"$f":"'Shooter Information'!B66","v":0},{"$f":"'Shooter Information'!C66","v":0},null,null,null,null,null,null,null,{"$f":"(D64*5)+E64-F64+(G64*10)+(H64*30)+(I64*999)+(J64*999.99)","v":0},{"$f":"IF('Shooter Information'!$E$3-('Shooter Information'!$G$3-RANK(K64,K$4:K$78,1))<0,0,'Shooter Information'!$E$3-('Shooter Information'!$G$3-RANK(K64,K$4:K$78,1)))","v":0},{"$f":"(SUM(D64+G64+H64+I64+J64))","v":0}]
[62,{"$f":"'Shooter Information'!B67","v":0},{"$f":"'Shooter Information'!C67","v":0},null,null,null,null,null,null,null,0,{"$f":"IF('Shooter Information'!$E$3-('Shooter Information'!$G$3-RANK(K65,K$4:K$78,1))<0,0,'Shooter Information'!$E$3-('Shooter Information'!$G$3-RANK(K65,K$4:K$78,1)))","v":0},0]
[63,{"$f":"'Shooter Information'!B68","v":0},{"$f":"'Shooter Information'!C68","v":0},null,null,null,null,null,null,null,0,{"$f":"IF('Shooter Information'!$E$3-('Shooter Information'!$G$3-RANK(K66,K$4:K$78,1))<0,0,'Shooter Information'!$E$3-('Shooter Information'!$G$3-RANK(K66,K$4:K$78,1)))","v":0},0]
[64,{"$f":"'Shooter Information'!B69","v":0},{"$f":"'Shooter Information'!C69","v":0},null,null,null,null,null,null,null,0,{"$f":"IF('Shooter Information'!$E$3-('Shooter Information'!$G$3-RANK(K67,K$4:K$78,1))<0,0,'Shooter Information'!$E$3-('Shooter Information'!$G$3-RANK(K67,K$4:K$78,1)))","v":0},0]
[65,{"$f":"'Shooter Information'!B70","v":0},{"$f":"'Shooter Information'!C70","v":0},null,null,null,null,null,null,null,0,{"$f":"IF('Shooter Information'!$E$3-('Shooter Information'!$G$3-RANK(K68,K$4:K$78,1))<0,0,'Shooter Information'!$E$3-('Shooter Information'!$G$3-RANK(K68,K$4:K$78,1)))","v":0},0]
[66,{"$f":"'Shooter Information'!B71","v":0},{"$f":"'Shooter Information'!C71","v":0},null,null,null,null,null,null,null,0,{"$f":"IF('Shooter Information'!$E$3-('Shooter Information'!$G$3-RANK(K69,K$4:K$78,1))<0,0,'Shooter Information'!$E$3-('Shooter Information'!$G$3-RANK(K69,K$4:K$78,1)))","v":0},0]
[67,{"$f":"'Shooter Information'!B72","v":0},{"$f":"'Shooter Information'!C72","v":0},null,null,null,null,null,null,null,0,{"$f":"IF('Shooter Information'!$E$3-('Shooter Information'!$G$3-RANK(K70,K$4:K$78,1))<0,0,'Shooter Information'!$E$3-('Shooter Information'!$G$3-RANK(K70,K$4:K$78,1)))","v":0},0]
[68,{"$f":"'Shooter Information'!B73","v":0},{"$f":"'Shooter Information'!C73","v":0},null,null,null,null,null,null,null,0,{"$f":"IF('Shooter Information'!$E$3-('Shooter Information'!$G$3-RANK(K71,K$4:K$78,1))<0,0,'Shooter Information'!$E$3-('Shooter Information'!$G$3-RANK(K71,K$4:K$78,1)))","v":0},0]
[69,{"$f":"'Shooter Information'!B74","v":0},{"$f":"'Shooter Information'!C74","v":0},null,null,null,null,null,null,null,0,{"$f":"IF('Shooter Information'!$E$3-('Shooter Information'!$G$3-RANK(K72,K$4:K$78,1))<0,0,'Shooter Information'!$E$3-('Shooter Information'!$G$3-RANK(K72,K$4:K$78,1)))","v":0},0]
[70,{"$f":"'Shooter Information'!B75","v":0},{"$f":"'Shooter Information'!C75","v":0},null,null,null,null,null,null,null,0,{"$f":"IF('Shooter Information'!$E$3-('Shooter Information'!$G$3-RANK(K73,K$4:K$78,1))<0,0,'Shooter Information'!$E$3-('Shooter Information'!$G$3-RANK(K73,K$4:K$78,1)))","v":0},0]
[71,{"$f":"'Shooter Information'!B76","v":0},{"$f":"'Shooter Information'!C76","v":0},null,null,null,null,null,null,null,0,{"$f":"IF('Shooter Information'!$E$3-('Shooter Information'!$G$3-RANK(K74,K$4:K$78,1))<0,0,'Shooter Information'!$E$3-('Shooter Information'!$G$3-RANK(K74,K$4:K$78,1)))","v":0},0]
[72,{"$f":"'Shooter Information'!B77","v":0},{"$f":"'Shooter Information'!C77","v":0},null,null,null,null,null,null,null,0,{"$f":"IF('Shooter Information'!$E$3-('Shooter Information'!$G$3-RANK(K75,K$4:K$78,1))<0,0,'Shooter Information'!$E$3-('Shooter Information'!$G$3-RANK(K75,K$4:K$78,1)))","v":0},0]
[73,{"$f":"'Shooter Information'!B78","v":0},{"$f":"'Shooter Information'!C78","v":0},null,null,null,null,null,null,null,0,{"$f":"IF('Shooter Information'!$E$3-('Shooter Information'!$G$3-RANK(K76,K$4:K$78,1))<0,0,'Shooter Information'!$E$3-('Shooter Information'!$G$3-RANK(K76,K$4:K$78,1)))","v":0},0]
[74,{"$f":"'Shooter Information'!B79","v":0},{"$f":"'Shooter Information'!C79","v":0},null,null,null,null,null,null,null,0,{"$f":"IF('Shooter Information'!$E$3-('Shooter Information'!$G$3-RANK(K77,K$4:K$78,1))<0,0,'Shooter Information'!$E$3-('Shooter Information'!$G$3-RANK(K77,K$4:K$78,1)))","v":0},0]
[75,{"$f":"'Shooter Information'!B80","v":0},{"$f":"'Shooter Information'!C80","v":0},null,null,null,null,null,null,null,0,{"$f":"IF('Shooter Information'!$E$3-('Shooter Information'!$G$3-RANK(K78,K$4:K$78,1))<0,0,'Shooter Information'!$E$3-('Shooter Information'!$G$3-RANK(K78,K$4:K$78,1)))","v":0},0]

{"sheet":"Stage 4","index":4,"n_rows":78,"n_cols":13,"rows_kept":78,"cut":false,"hidden":false,"merged":[]}
[null,"CAS SCORE SHEET"]
[null,"Stage 4"]
["Roster #","Shooter","Class","Misses","Raw Time","Bonus","10 Sec","30 Sec","DNF","DQ","Total","Rank","Penalties"]
[{"$f":"ROW()-3","v":1},{"$f":"'Shooter Information'!B6","v":"Striker"},{"$f":"'Shooter Information'!C6","v":"GF"},1,33.56,null,null,null,null,null,{"$f":"(D4*5)+E4-F4+(G4*10)+(H4*30)+(I4*999)+(J4*999.99)","v":38.56},{"$f":"IF('Shooter Information'!$E$3-('Shooter Information'!$G$3-RANK(K4,K$4:K$78,1))<0,0,'Shooter Information'!$E$3-('Shooter Information'!$G$3-RANK(K4,K$4:K$78,1)))","v":10},{"$f":"(SUM(D4+G4+H4+I4+J4))","v":1}]
[{"$f":"ROW()-3","v":2},{"$f":"'Shooter Information'!B7","v":"Lefty Spurmaker"},{"$f":"'Shooter Information'!C7","v":49},1,28.9,null,null,null,null,null,{"$f":"(D5*5)+E5-F5+(G5*10)+(H5*30)+(I5*999)+(J5*999.99)","v":33.9},{"$f":"IF('Shooter Information'!$E$3-('Shooter Information'!$G$3-RANK(K5,K$4:K$78,1))<0,0,'Shooter Information'!$E$3-('Shooter Information'!$G$3-RANK(K5,K$4:K$78,1)))","v":5},{"$f":"(SUM(D5+G5+H5+I5+J5))","v":1}]
[3,{"$f":"'Shooter Information'!B8","v":"Hotshod"},{"$f":"'Shooter Information'!C8","v":"W"},null,36.33,null,null,null,null,null,36.33,{"$f":"IF('Shooter Information'!$E$3-('Shooter Information'!$G$3-RANK(K6,K$4:K$78,1))<0,0,'Shooter Information'!$E$3-('Shooter Information'!$G$3-RANK(K6,K$4:K$78,1)))","v":8},0]
[4,{"$f":"'Shooter Information'!B9","v":"Swifty McDraw"},{"$f":"'Shooter Information'!C9","v":"SS"},null,35.549999999999997,null,null,null,null,null,35.549999999999997,{"$f":"IF('Shooter Information'!$E$3-('Shooter Information'!$G$3-RANK(K7,K$4:K$78,1))<0,0,'Shooter Information'!$E$3-('Shooter Information'!$G$3-RANK(K7,K$4:K$78,1)))","v":7},0]
[5,{"$f":"'Shooter Information'!B10","v":"Prairie City Slim"},{"$f":"'Shooter Information'!C10","v":"SS"},null,40.17,null,null,null,null,null,40.17,{"$f":"IF('Shooter Information'!$E$3-('Shooter Information'!$G$3-RANK(K8,K$4:K$78,1))<0,0,'Shooter Information'!$E$3-('Shooter Information'!$G$3-RANK(K8,K$4:K$78,1)))","v":11},0]
[6,{"$f":"'Shooter Information'!B11","v":"Enid City Kid"},{"$f":"'Shooter Information'!C11","v":"FC"},null,34.270000000000003,null,null,null,null,null,34.270000000000003,{"$f":"IF('Shooter Information'!$E$3-('Shooter Information'!$G$3-RANK(K9,K$4:K$78,1))<0,0,'Shooter Information'!$E$3-('Shooter Information'!$G$3-RANK(K9,K$4:K$78,1)))","v":6},0]
[7,{"$f":"'Shooter Information'!B12","v":"Cockroach"},{"$f":"'Shooter Information'!C12","v":"CB"},null,27.99,null,null,null,null,null,27.99,{"$f":"IF('Shooter Information'!$E$3-('Shooter Information'!$G$3-RANK(K10,K$4:K$78,1))<0,0,'Shooter Information'!$E$3-('Shooter Information'!$G$3-RANK(K10,K$4:K$78,1)))","v":2},0]
[8,{"$f":"'Shooter Information'!B13","v":"Kuba Kid"},{"$f":"'Shooter Information'!C13","v":"D"},null,33.17,null,null,null,null,null,33.17,{"$f":"IF('Shooter Information'!$E$3-('Shooter Information'!$G$3-RANK(K11,K$4:K$78,1))<0,0,'Shooter Information'!$E$3-('Shooter Information'!$G$3-RANK(K11,K$4:K$78,1)))","v":4},0]
[9,{"$f":"'Shooter Information'!B14","v":"Beartooth"},{"$f":"'Shooter Information'!C14","v":"S"},null,36.67,null,null,null,null,null,36.67,{"$f":"IF('Shooter Information'!$E$3-('Shooter Information'!$G$3-RANK(K12,K$4:K$78,1))<0,0,'Shooter Information'!$E$3-('Shooter Information'!$G$3-RANK(K12,K$4:K$78,1)))","v":9},0]
[10,{"$f":"'Shooter Information'!B15","v":"Slick Rick"},{"$f":"'Shooter Information'!C15","v":"S"},2,69.87,null,null,null,null,null,79.87,{"$f":"IF('Shooter Information'!$E$3-('Shooter Information'!$G$3-RANK(K13,K$4:K$78,1))<0,0,'Shooter Information'!$E$3-('Shooter Information'!$G$3-RANK(K13,K$4:K$78,1)))","v":15},2]
[11,{"$f":"'Shooter Information'!B16","v":"Windhorse Rider"},{"$f":"'Shooter Information'!C16","v":"GF"},null,44.45,null,1,null,null,null,54.45,{"$f":"IF('Shooter Information'!$E$3-('Shooter Information'!$G$3-RANK(K14,K$4:K$78,1))<0,0,'Shooter Information'!$E$3-('Shooter Information'!$G$3-RANK(K14,K$4:K$78,1)))","v":14},1]
[12,{"$f":"'Shooter Information'!B17","v":"Justice Jack"},{"$f":"'Shooter Information'!C17","v":"SS"},null,31.6,null,null,null,null,null,31.6,{"$f":"IF('Shooter Information'!$E$3-('Shooter Information'!$G$3-RANK(K15,K$4:K$78,1))<0,0,'Shooter Information'!$E$3-('Shooter Information'!$G$3-RANK(K15,K$4:K$78,1)))","v":3},0]
[13,{"$f":"'Shooter Information'!B18","v":"B. S. Walker"},{"$f":"'Shooter Information'!C18","v":49},null,25.47,null,null,null,null,null,25.47,{"$f":"IF('Shooter Information'!$E$3-('Shooter Information'!$G$3-RANK(K16,K$4:K$78,1))<0,0,'Shooter Information'!$E$3-('Shooter Information'!$G$3-RANK(K16,K$4:K$78,1)))","v":1},0]
[14,{"$f":"'Shooter Information'!B19","v":"Red Cavanaugh"},{"$f":"'Shooter Information'!C19","v":49},1,31.56,null,1,null,null,null,46.56,{"$f":"IF('Shooter Information'!$E$3-('Shooter Information'!$G$3-RANK(K17,K$4:K$78,1))<0,0,'Shooter Information'!$E$3-('Shooter Information'!$G$3-RANK(K17,K$4:K$78,1)))","v":12},2]
[15,{"$f":"'Shooter Information'!B20","v":"Deringer Dan"},{"$f":"'Shooter Information'!C20","v":49},null,47.6,null,null,null,null,null,47.6,{"$f":"IF('Shooter Information'!$E$3-('Shooter Information'!$G$3-RANK(K18,K$4:K$78,1))<0,0,'Shooter Information'!$E$3-('Shooter Information'!$G$3-RANK(K18,K$4:K$78,1)))","v":13},0]
[16,{"$f":"'Shooter Information'!B21","v":0},{"$f":"'Shooter Information'!C21","v":0},null,null,null,null,null,null,null,0,{"$f":"IF('Shooter Information'!$E$3-('Shooter Information'!$G$3-RANK(K19,K$4:K$78,1))<0,0,'Shooter Information'!$E$3-('Shooter Information'!$G$3-RANK(K19,K$4:K$78,1)))","v":0},0]
[17,{"$f":"'Shooter Information'!B22","v":0},{"$f":"'Shooter Information'!C22","v":0},null,null,null,null,null,null,null,0,{"$f":"IF('Shooter Information'!$E$3-('Shooter Information'!$G$3-RANK(K20,K$4:K$78,1))<0,0,'Shooter Information'!$E$3-('Shooter Information'!$G$3-RANK(K20,K$4:K$78,1)))","v":0},0]
[18,{"$f":"'Shooter Information'!B23","v":0},{"$f":"'Shooter Information'!C23","v":0},null,null,null,null,null,null,null,0,{"$f":"IF('Shooter Information'!$E$3-('Shooter Information'!$G$3-RANK(K21,K$4:K$78,1))<0,0,'Shooter Information'!$E$3-('Shooter Information'!$G$3-RANK(K21,K$4:K$78,1)))","v":0},0]
[19,{"$f":"'Shooter Information'!B24","v":0},{"$f":"'Shooter Information'!C24","v":0},null,null,null,null,null,null,null,0,{"$f":"IF('Shooter Information'!$E$3-('Shooter Information'!$G$3-RANK(K22,K$4:K$78,1))<0,0,'Shooter Information'!$E$3-('Shooter Information'!$G$3-RANK(K22,K$4:K$78,1)))","v":0},0]
[20,{"$f":"'Shooter Information'!B25","v":0},{"$f":"'Shooter Information'!C25","v":0},null,null,null,null,null,null,null,0,{"$f":"IF('Shooter Information'!$E$3-('Shooter Information'!$G$3-RANK(K23,K$4:K$78,1))<0,0,'Shooter Information'!$E$3-('Shooter Information'!$G$3-RANK(K23,K$4:K$78,1)))","v":0},0]
[21,{"$f":"'Shooter Information'!B26","v":0},{"$f":"'Shooter Information'!C26","v":0},null,null,null,null,null,null,null,0,{"$f":"IF('Shooter Information'!$E$3-('Shooter Information'!$G$3-RANK(K24,K$4:K$78,1))<0,0,'Shooter Information'!$E$3-('Shooter Information'!$G$3-RANK(K24,K$4:K$78,1)))","v":0},0]
[22,{"$f":"'Shooter Information'!B27","v":0},{"$f":"'Shooter Information'!C27","v":0},null,null,null,null,null,null,null,0,{"$f":"IF('Shooter Information'!$E$3-('Shooter Information'!$G$3-RANK(K25,K$4:K$78,1))<0,0,'Shooter Information'!$E$3-('Shooter Information'!$G$3-RANK(K25,K$4:K$78,1)))","v":0},0]
[23,{"$f":"'Shooter Information'!B28","v":0},{"$f":"'Shooter Information'!C28","v":0},null,null,null,null,null,null,null,0,{"$f":"IF('Shooter Information'!$E$3-('Shooter Information'!$G$3-RANK(K26,K$4:K$78,1))<0,0,'Shooter Information'!$E$3-('Shooter Information'!$G$3-RANK(K26,K$4:K$78,1)))","v":0},0]
[24,{"$f":"'Shooter Information'!B29","v":0},{"$f":"'Shooter Information'!C29","v":0},null,null,null,null,null,null,null,0,{"$f":"IF('Shooter Information'!$E$3-('Shooter Information'!$G$3-RANK(K27,K$4:K$78,1))<0,0,'Shooter Information'!$E$3-('Shooter Information'!$G$3-RANK(K27,K$4:K$78,1)))","v":0},0]
[25,{"$f":"'Shooter Information'!B30","v":0},{"$f":"'Shooter Information'!C30","v":0},null,null,null,null,null,null,null,0,{"$f":"IF('Shooter Information'!$E$3-('Shooter Information'!$G$3-RANK(K28,K$4:K$78,1))<0,0,'Shooter Information'!$E$3-('Shooter Information'!$G$3-RANK(K28,K$4:K$78,1)))","v":0},0]
[26,{"$f":"'Shooter Information'!B31","v":0},{"$f":"'Shooter Information'!C31","v":0},null,null,null,null,null,null,null,0,{"$f":"IF('Shooter Information'!$E$3-('Shooter Information'!$G$3-RANK(K29,K$4:K$78,1))<0,0,'Shooter Information'!$E$3-('Shooter Information'!$G$3-RANK(K29,K$4:K$78,1)))","v":0},0]
[27,{"$f":"'Shooter Information'!B32","v":0},{"$f":"'Shooter Information'!C32","v":0},null,null,null,null,null,null,null,0,{"$f":"IF('Shooter Information'!$E$3-('Shooter Information'!$G$3-RANK(K30,K$4:K$78,1))<0,0,'Shooter Information'!$E$3-('Shooter Information'!$G$3-RANK(K30,K$4:K$78,1)))","v":0},0]
[28,{"$f":"'Shooter Information'!B33","v":0},{"$f":"'Shooter Information'!C33","v":0},null,null,null,null,null,null,null,0,{"$f":"IF('Shooter Information'!$E$3-('Shooter Information'!$G$3-RANK(K31,K$4:K$78,1))<0,0,'Shooter Information'!$E$3-('Shooter Information'!$G$3-RANK(K31,K$4:K$78,1)))","v":0},0]
[29,{"$f":"'Shooter Information'!B34","v":0},{"$f":"'Shooter Information'!C34","v":0},null,null,null,null,null,null,null,0,{"$f":"IF('Shooter Information'!$E$3-('Shooter Information'!$G$3-RANK(K32,K$4:K$78,1))<0,0,'Shooter Information'!$E$3-('Shooter Information'!$G$3-RANK(K32,K$4:K$78,1)))","v":0},0]
[30,{"$f":"'Shooter Information'!B35","v":0},{"$f":"'Shooter Information'!C35","v":0},null,null,null,null,null,null,null,0,{"$f":"IF('Shooter Information'!$E$3-('Shooter Information'!$G$3-RANK(K33,K$4:K$78,1))<0,0,'Shooter Information'!$E$3-('Shooter Information'!$G$3-RANK(K33,K$4:K$78,1)))","v":0},0]
[31,{"$f":"'Shooter Information'!B36","v":0},{"$f":"'Shooter Information'!C36","v":0},null,null,null,null,null,null,null,0,{"$f":"IF('Shooter Information'!$E$3-('Shooter Information'!$G$3-RANK(K34,K$4:K$78,1))<0,0,'Shooter Information'!$E$3-('Shooter Information'!$G$3-RANK(K34,K$4:K$78,1)))","v":0},0]
[32,{"$f":"'Shooter Information'!B37","v":0},{"$f":"'Shooter Information'!C37","v":0},null,null,null,null,null,null,null,0,{"$f":"IF('Shooter Information'!$E$3-('Shooter Information'!$G$3-RANK(K35,K$4:K$78,1))<0,0,'Shooter Information'!$E$3-('Shooter Information'!$G$3-RANK(K35,K$4:K$78,1)))","v":0},0]
[33,{"$f":"'Shooter Information'!B38","v":0},{"$f":"'Shooter Information'!C38","v":0},null,null,null,null,null,null,null,0,{"$f":"IF('Shooter Information'!$E$3-('Shooter Information'!$G$3-RANK(K36,K$4:K$78,1))<0,0,'Shooter Information'!$E$3-('Shooter Information'!$G$3-RANK(K36,K$4:K$78,1)))","v":0},0]
[34,{"$f":"'Shooter Information'!B39","v":0},{"$f":"'Shooter Information'!C39","v":0},null,null,null,null,null,null,null,0,{"$f":"IF('Shooter Information'!$E$3-('Shooter Information'!$G$3-RANK(K37,K$4:K$78,1))<0,0,'Shooter Information'!$E$3-('Shooter Information'!$G$3-RANK(K37,K$4:K$78,1)))","v":0},0]
[35,{"$f":"'Shooter Information'!B40","v":0},{"$f":"'Shooter Information'!C40","v":0},null,null,null,null,null,null,null,0,{"$f":"IF('Shooter Information'!$E$3-('Shooter Information'!$G$3-RANK(K38,K$4:K$78,1))<0,0,'Shooter Information'!$E$3-('Shooter Information'!$G$3-RANK(K38,K$4:K$78,1)))","v":0},0]
[36,{"$f":"'Shooter Information'!B41","v":0},{"$f":"'Shooter Information'!C41","v":0},null,null,null,null,null,null,null,0,{"$f":"IF('Shooter Information'!$E$3-('Shooter Information'!$G$3-RANK(K39,K$4:K$78,1))<0,0,'Shooter Information'!$E$3-('Shooter Information'!$G$3-RANK(K39,K$4:K$78,1)))","v":0},0]
[37,{"$f":"'Shooter Information'!B42","v":0},{"$f":"'Shooter Information'!C42","v":0},null,null,null,null,null,null,null,0,{"$f":"IF('Shooter Information'!$E$3-('Shooter Information'!$G$3-RANK(K40,K$4:K$78,1))<0,0,'Shooter Information'!$E$3-('Shooter Information'!$G$3-RANK(K40,K$4:K$78,1)))","v":0},0]
[38,{"$f":"'Shooter Information'!B43","v":0},{"$f":"'Shooter Information'!C43","v":0},null,null,null,null,null,null,null,0,{"$f":"IF('Shooter Information'!$E$3-('Shooter Information'!$G$3-RANK(K41,K$4:K$78,1))<0,0,'Shooter Information'!$E$3-('Shooter Information'!$G$3-RANK(K41,K$4:K$78,1)))","v":0},0]
[39,{"$f":"'Shooter Information'!B44","v":0},{"$f":"'Shooter Information'!C44","v":0},null,null,null,null,null,null,null,0,{"$f":"IF('Shooter Information'!$E$3-('Shooter Information'!$G$3-RANK(K42,K$4:K$78,1))<0,0,'Shooter Information'!$E$3-('Shooter Information'!$G$3-RANK(K42,K$4:K$78,1)))","v":0},0]
[40,{"$f":"'Shooter Information'!B45","v":0},{"$f":"'Shooter Information'!C45","v":0},null,null,null,null,null,null,null,0,{"$f":"IF('Shooter Information'!$E$3-('Shooter Information'!$G$3-RANK(K43,K$4:K$78,1))<0,0,'Shooter Information'!$E$3-('Shooter Information'!$G$3-RANK(K43,K$4:K$78,1)))","v":0},0]
[41,{"$f":"'Shooter Information'!B46","v":0},{"$f":"'Shooter Information'!C46","v":0},null,null,null,null,null,null,null,0,{"$f":"IF('Shooter Information'!$E$3-('Shooter Information'!$G$3-RANK(K44,K$4:K$78,1))<0,0,'Shooter Information'!$E$3-('Shooter Information'!$G$3-RANK(K44,K$4:K$78,1)))","v":0},0]
[42,{"$f":"'Shooter Information'!B47","v":0},{"$f":"'Shooter Information'!C47","v":0},null,null,null,null,null,null,null,0,{"$f":"IF('Shooter Information'!$E$3-('Shooter Information'!$G$3-RANK(K45,K$4:K$78,1))<0,0,'Shooter Information'!$E$3-('Shooter Information'!$G$3-RANK(K45,K$4:K$78,1)))","v":0},0]
[43,{"$f":"'Shooter Information'!B48","v":0},{"$f":"'Shooter Information'!C48","v":0},null,null,null,null,null,null,null,0,{"$f":"IF('Shooter Information'!$E$3-('Shooter Information'!$G$3-RANK(K46,K$4:K$78,1))<0,0,'Shooter Information'!$E$3-('Shooter Information'!$G$3-RANK(K46,K$4:K$78,1)))","v":0},0]
[44,{"$f":"'Shooter Information'!B49","v":0},{"$f":"'Shooter Information'!C49","v":0},null,null,null,null,null,null,null,0,{"$f":"IF('Shooter Information'!$E$3-('Shooter Information'!$G$3-RANK(K47,K$4:K$78,1))<0,0,'Shooter Information'!$E$3-('Shooter Information'!$G$3-RANK(K47,K$4:K$78,1)))","v":0},0]
[45,{"$f":"'Shooter Information'!B50","v":0},{"$f":"'Shooter Information'!C50","v":0},null,null,null,null,null,null,null,0,{"$f":"IF('Shooter Information'!$E$3-('Shooter Information'!$G$3-RANK(K48,K$4:K$78,1))<0,0,'Shooter Information'!$E$3-('Shooter Information'!$G$3-RANK(K48,K$4:K$78,1)))","v":0},0]
[46,{"$f":"'Shooter Information'!B51","v":0},{"$f":"'Shooter Information'!C51","v":0},null,null,null,null,null,null,null,{"$f":"(D49*5)+E49-F49+(G49*10)+(H49*30)+(I49*999)+(J49*999.99)","v":0},{"$f":"IF('Shooter Information'!$E$3-('Shooter Information'!$G$3-RANK(K49,K$4:K$78,1))<0,0,'Shooter Information'!$E$3-('Shooter Information'!$G$3-RANK(K49,K$4:K$78,1)))","v":0},0]
[47,{"$f":"'Shooter Information'!B52","v":0},{"$f":"'Shooter Information'!C52","v":0},null,null,null,null,null,null,null,0,{"$f":"IF('Shooter Information'!$E$3-('Shooter Information'!$G$3-RANK(K50,K$4:K$78,1))<0,0,'Shooter Information'!$E$3-('Shooter Information'!$G$3-RANK(K50,K$4:K$78,1)))","v":0},0]
[48,{"$f":"'Shooter Information'!B53","v":0},{"$f":"'Shooter Information'!C53","v":0},null,null,null,null,null,null,null,0,{"$f":"IF('Shooter Information'!$E$3-('Shooter Information'!$G$3-RANK(K51,K$4:K$78,1))<0,0,'Shooter Information'!$E$3-('Shooter Information'!$G$3-RANK(K51,K$4:K$78,1)))","v":0},0]
[49,{"$f":"'Shooter Information'!B54","v":0},{"$f":"'Shooter Information'!C54","v":0},null,null,null,null,null,null,null,0,{"$f":"IF('Shooter Information'!$E$3-('Shooter Information'!$G$3-RANK(K52,K$4:K$78,1))<0,0,'Shooter Information'!$E$3-('Shooter Information'!$G$3-RANK(K52,K$4:K$78,1)))","v":0},0]
[50,{"$f":"'Shooter Information'!B55","v":0},{"$f":"'Shooter Information'!C55","v":0},null,null,null,null,null,null,null,0,{"$f":"IF('Shooter Information'!$E$3-('Shooter Information'!$G$3-RANK(K53,K$4:K$78,1))<0,0,'Shooter Information'!$E$3-('Shooter Information'!$G$3-RANK(K53,K$4:K$78,1)))","v":0},0]
[51,{"$f":"'Shooter Information'!B56","v":0},{"$f":"'Shooter Information'!C56","v":0},null,null,null,null,null,null,null,0,{"$f":"IF('Shooter Information'!$E$3-('Shooter Information'!$G$3-RANK(K54,K$4:K$78,1))<0,0,'Shooter Information'!$E$3-('Shooter Information'!$G$3-RANK(K54,K$4:K$78,1)))","v":0},0]
[52,{"$f":"'Shooter Information'!B57","v":0},{"$f":"'Shooter Information'!C57","v":0},null,null,null,null,null,null,null,0,{"$f":"IF('Shooter Information'!$E$3-('Shooter Information'!$G$3-RANK(K55,K$4:K$78,1))<0,0,'Shooter Information'!$E$3-('Shooter Information'!$G$3-RANK(K55,K$4:K$78,1)))","v":0},0]
[53,{"$f":"'Shooter Information'!B58","v":0},{"$f":"'Shooter Information'!C58","v":0},null,null,null,null,null,null,null,0,{"$f":"IF('Shooter Information'!$E$3-('Shooter Information'!$G$3-RANK(K56,K$4:K$78,1))<0,0,'Shooter Information'!$E$3-('Shooter Information'!$G$3-RANK(K56,K$4:K$78,1)))","v":0},0]
[54,{"$f":"'Shooter Information'!B59","v":0},{"$f":"'Shooter Information'!C59","v":0},null,null,null,null,null,null,null,0,{"$f":"IF('Shooter Information'!$E$3-('Shooter Information'!$G$3-RANK(K57,K$4:K$78,1))<0,0,'Shooter Information'!$E$3-('Shooter Information'!$G$3-RANK(K57,K$4:K$78,1)))","v":0},0]
[55,{"$f":"'Shooter Information'!B60","v":0},{"$f":"'Shooter Information'!C60","v":0},null,null,null,null,null,null,null,0,{"$f":"IF('Shooter Information'!$E$3-('Shooter Information'!$G$3-RANK(K58,K$4:K$78,1))<0,0,'Shooter Information'!$E$3-('Shooter Information'!$G$3-RANK(K58,K$4:K$78,1)))","v":0},0]
[56,{"$f":"'Shooter Information'!B61","v":0},{"$f":"'Shooter Information'!C61","v":0},null,null,null,null,null,null,null,0,{"$f":"IF('Shooter Information'!$E$3-('Shooter Information'!$G$3-RANK(K59,K$4:K$78,1))<0,0,'Shooter Information'!$E$3-('Shooter Information'!$G$3-RANK(K59,K$4:K$78,1)))","v":0},0]
[57,{"$f":"'Shooter Information'!B62","v":0},{"$f":"'Shooter Information'!C62","v":0},null,null,null,null,null,null,null,0,{"$f":"IF('Shooter Information'!$E$3-('Shooter Information'!$G$3-RANK(K60,K$4:K$78,1))<0,0,'Shooter Information'!$E$3-('Shooter Information'!$G$3-RANK(K60,K$4:K$78,1)))","v":0},0]
[58,{"$f":"'Shooter Information'!B63","v":0},{"$f":"'Shooter Information'!C63","v":0},null,null,null,null,null,null,null,0,{"$f":"IF('Shooter Information'!$E$3-('Shooter Information'!$G$3-RANK(K61,K$4:K$78,1))<0,0,'Shooter Information'!$E$3-('Shooter Information'!$G$3-RANK(K61,K$4:K$78,1)))","v":0},0]
[59,{"$f":"'Shooter Information'!B64","v":0},{"$f":"'Shooter Information'!C64","v":0},null,null,null,null,null,null,null,0,{"$f":"IF('Shooter Information'!$E$3-('Shooter Information'!$G$3-RANK(K62,K$4:K$78,1))<0,0,'Shooter Information'!$E$3-('Shooter Information'!$G$3-RANK(K62,K$4:K$78,1)))","v":0},0]
[60,{"$f":"'Shooter Information'!B65","v":0},{"$f":"'Shooter Information'!C65","v":0},null,null,null,null,null,null,null,0,{"$f":"IF('Shooter Information'!$E$3-('Shooter Information'!$G$3-RANK(K63,K$4:K$78,1))<0,0,'Shooter Information'!$E$3-('Shooter Information'!$G$3-RANK(K63,K$4:K$78,1)))","v":0},0]
[61,{"$f":"'Shooter Information'!B66","v":0},{"$f":"'Shooter Information'!C66","v":0},null,null,null,null,null,null,null,{"$f":"(D64*5)+E64-F64+(G64*10)+(H64*30)+(I64*999)+(J64*999.99)","v":0},{"$f":"IF('Shooter Information'!$E$3-('Shooter Information'!$G$3-RANK(K64,K$4:K$78,1))<0,0,'Shooter Information'!$E$3-('Shooter Information'!$G$3-RANK(K64,K$4:K$78,1)))","v":0},{"$f":"(SUM(D64+G64+H64+I64+J64))","v":0}]
[62,{"$f":"'Shooter Information'!B67","v":0},{"$f":"'Shooter Information'!C67","v":0},null,null,null,null,null,null,null,0,{"$f":"IF('Shooter Information'!$E$3-('Shooter Information'!$G$3-RANK(K65,K$4:K$78,1))<0,0,'Shooter Information'!$E$3-('Shooter Information'!$G$3-RANK(K65,K$4:K$78,1)))","v":0},0]
[63,{"$f":"'Shooter Information'!B68","v":0},{"$f":"'Shooter Information'!C68","v":0},null,null,null,null,null,null,null,0,{"$f":"IF('Shooter Information'!$E$3-('Shooter Information'!$G$3-RANK(K66,K$4:K$78,1))<0,0,'Shooter Information'!$E$3-('Shooter Information'!$G$3-RANK(K66,K$4:K$78,1)))","v":0},0]
[64,{"$f":"'Shooter Information'!B69","v":0},{"$f":"'Shooter Information'!C69","v":0},null,null,null,null,null,null,null,0,{"$f":"IF('Shooter Information'!$E$3-('Shooter Information'!$G$3-RANK(K67,K$4:K$78,1))<0,0,'Shooter Information'!$E$3-('Shooter Information'!$G$3-RANK(K67,K$4:K$78,1)))","v":0},0]
[65,{"$f":"'Shooter Information'!B70","v":0},{"$f":"'Shooter Information'!C70","v":0},null,null,null,null,null,null,null,0,{"$f":"IF('Shooter Information'!$E$3-('Shooter Information'!$G$3-RANK(K68,K$4:K$78,1))<0,0,'Shooter Information'!$E$3-('Shooter Information'!$G$3-RANK(K68,K$4:K$78,1)))","v":0},0]
[66,{"$f":"'Shooter Information'!B71","v":0},{"$f":"'Shooter Information'!C71","v":0},null,null,null,null,null,null,null,0,{"$f":"IF('Shooter Information'!$E$3-('Shooter Information'!$G$3-RANK(K69,K$4:K$78,1))<0,0,'Shooter Information'!$E$3-('Shooter Information'!$G$3-RANK(K69,K$4:K$78,1)))","v":0},0]
[67,{"$f":"'Shooter Information'!B72","v":0},{"$f":"'Shooter Information'!C72","v":0},null,null,null,null,null,null,null,0,{"$f":"IF('Shooter Information'!$E$3-('Shooter Information'!$G$3-RANK(K70,K$4:K$78,1))<0,0,'Shooter Information'!$E$3-('Shooter Information'!$G$3-RANK(K70,K$4:K$78,1)))","v":0},0]
[68,{"$f":"'Shooter Information'!B73","v":0},{"$f":"'Shooter Information'!C73","v":0},null,null,null,null,null,null,null,0,{"$f":"IF('Shooter Information'!$E$3-('Shooter Information'!$G$3-RANK(K71,K$4:K$78,1))<0,0,'Shooter Information'!$E$3-('Shooter Information'!$G$3-RANK(K71,K$4:K$78,1)))","v":0},0]
[69,{"$f":"'Shooter Information'!B74","v":0},{"$f":"'Shooter Information'!C74","v":0},null,null,null,null,null,null,null,0,{"$f":"IF('Shooter Information'!$E$3-('Shooter Information'!$G$3-RANK(K72,K$4:K$78,1))<0,0,'Shooter Information'!$E$3-('Shooter Information'!$G$3-RANK(K72,K$4:K$78,1)))","v":0},0]
[70,{"$f":"'Shooter Information'!B75","v":0},{"$f":"'Shooter Information'!C75","v":0},null,null,null,null,null,null,null,0,{"$f":"IF('Shooter Information'!$E$3-('Shooter Information'!$G$3-RANK(K73,K$4:K$78,1))<0,0,'Shooter Information'!$E$3-('Shooter Information'!$G$3-RANK(K73,K$4:K$78,1)))","v":0},0]
[71,{"$f":"'Shooter Information'!B76","v":0},{"$f":"'Shooter Information'!C76","v":0},null,null,null,null,null,null,null,0,{"$f":"IF('Shooter Information'!$E$3-('Shooter Information'!$G$3-RANK(K74,K$4:K$78,1))<0,0,'Shooter Information'!$E$3-('Shooter Information'!$G$3-RANK(K74,K$4:K$78,1)))","v":0},0]
[72,{"$f":"'Shooter Information'!B77","v":0},{"$f":"'Shooter Information'!C77","v":0},null,null,null,null,null,null,null,0,{"$f":"IF('Shooter Information'!$E$3-('Shooter Information'!$G$3-RANK(K75,K$4:K$78,1))<0,0,'Shooter Information'!$E$3-('Shooter Information'!$G$3-RANK(K75,K$4:K$78,1)))","v":0},0]
[73,{"$f":"'Shooter Information'!B78","v":0},{"$f":"'Shooter Information'!C78","v":0},null,null,null,null,null,null,null,0,{"$f":"IF('Shooter Information'!$E$3-('Shooter Information'!$G$3-RANK(K76,K$4:K$78,1))<0,0,'Shooter Information'!$E$3-('Shooter Information'!$G$3-RANK(K76,K$4:K$78,1)))","v":0},0]
[74,{"$f":"'Shooter Information'!B79","v":0},{"$f":"'Shooter Information'!C79","v":0},null,null,null,null,null,null,null,0,{"$f":"IF('Shooter Information'!$E$3-('Shooter Information'!$G$3-RANK(K77,K$4:K$78,1))<0,0,'Shooter Information'!$E$3-('Shooter Information'!$G$3-RANK(K77,K$4:K$78,1)))","v":0},0]
[75,{"$f":"'Shooter Information'!B80","v":0},{"$f":"'Shooter Information'!C80","v":0},null,null,null,null,null,null,null,0,{"$f":"IF('Shooter Information'!$E$3-('Shooter Information'!$G$3-RANK(K78,K$4:K$78,1))<0,0,'Shooter Information'!$E$3-('Shooter Information'!$G$3-RANK(K78,K$4:K$78,1)))","v":0},0]

{"sheet":"Stage 5","index":5,"n_rows":78,"n_cols":13,"rows_kept":78,"cut":false,"hidden":false,"merged":[]}
[null,"CAS SCORE SHEET"]
[null,"Stage 5"]
["Roster #","Shooter","Class","Misses","Raw Time","Bonus","10 Sec","30 Sec","DNF","DQ","Total","Rank","Penalties"]
[{"$f":"ROW()-3","v":1},{"$f":"'Shooter Information'!B6","v":"Striker"},{"$f":"'Shooter Information'!C6","v":"GF"},null,26.75,null,null,null,null,null,{"$f":"(D4*5)+E4-F4+(G4*10)+(H4*30)+(I4*999)+(J4*999.99)","v":26.75},{"$f":"IF('Shooter Information'!$E$3-('Shooter Information'!$G$3-RANK(K4,K$4:K$78,1))<0,0,'Shooter Information'!$E$3-('Shooter Information'!$G$3-RANK(K4,K$4:K$78,1)))","v":1},{"$f":"(SUM(D4+G4+H4+I4+J4))","v":0}]
[{"$f":"ROW()-3","v":2},{"$f":"'Shooter Information'!B7","v":"Lefty Spurmaker"},{"$f":"'Shooter Information'!C7","v":49},1,25.98,null,null,null,null,null,{"$f":"(D5*5)+E5-F5+(G5*10)+(H5*30)+(I5*999)+(J5*999.99)","v":30.98},{"$f":"IF('Shooter Information'!$E$3-('Shooter Information'!$G$3-RANK(K5,K$4:K$78,1))<0,0,'Shooter Information'!$E$3-('Shooter Information'!$G$3-RANK(K5,K$4:K$78,1)))","v":6},{"$f":"(SUM(D5+G5+H5+I5+J5))","v":1}]
[3,{"$f":"'Shooter Information'!B8","v":"Hotshod"},{"$f":"'Shooter Information'!C8","v":"W"},null,38.75,null,null,null,null,null,38.75,{"$f":"IF('Shooter Information'!$E$3-('Shooter Information'!$G$3-RANK(K6,K$4:K$78,1))<0,0,'Shooter Information'!$E$3-('Shooter Information'!$G$3-RANK(K6,K$4:K$78,1)))","v":14},0]
[4,{"$f":"'Shooter Information'!B9","v":"Swifty McDraw"},{"$f":"'Shooter Information'!C9","v":"SS"},null,38.07,null,null,null,null,null,38.07,{"$f":"IF('Shooter Information'!$E$3-('Shooter Information'!$G$3-RANK(K7,K$4:K$78,1))<0,0,'Shooter Information'!$E$3-('Shooter Information'!$G$3-RANK(K7,K$4:K$78,1)))","v":13},0]
[5,{"$f":"'Shooter Information'!B10","v":"Prairie City Slim"},{"$f":"'Shooter Information'!C10","v":"SS"},null,36.04,null,null,null,null,null,36.04,{"$f":"IF('Shooter Information'!$E$3-('Shooter Information'!$G$3-RANK(K8,K$4:K$78,1))<0,0,'Shooter Information'!$E$3-('Shooter Information'!$G$3-RANK(K8,K$4:K$78,1)))","v":10},0]
[6,{"$f":"'Shooter Information'!B11","v":"Enid City Kid"},{"$f":"'Shooter Information'!C11","v":"FC"},null,32.380000000000003,null,null,null,null,null,32.380000000000003,{"$f":"IF('Shooter Information'!$E$3-('Shooter Information'!$G$3-RANK(K9,K$4:K$78,1))<0,0,'Shooter Information'!$E$3-('Shooter Information'!$G$3-RANK(K9,K$4:K$78,1)))","v":7},0]
[7,{"$f":"'Shooter Information'!B12","v":"Cockroach"},{"$f":"'Shooter Information'!C12","v":"CB"},null,30.22,null,null,null,null,null,30.22,{"$f":"IF('Shooter Information'!$E$3-('Shooter Information'!$G$3-RANK(K10,K$4:K$78,1))<0,0,'Shooter Information'!$E$3-('Shooter Information'!$G$3-RANK(K10,K$4:K$78,1)))","v":4},0]
[8,{"$f":"'Shooter Information'!B13","v":"Kuba Kid"},{"$f":"'Shooter Information'!C13","v":"D"},null,27.96,null,null,null,null,null,27.96,{"$f":"IF('Shooter Information'!$E$3-('Shooter Information'!$G$3-RANK(K11,K$4:K$78,1))<0,0,'Shooter Information'!$E$3-('Shooter Information'!$G$3-RANK(K11,K$4:K$78,1)))","v":3},0]
[9,{"$f":"'Shooter Information'!B14","v":"Beartooth"},{"$f":"'Shooter Information'!C14","v":"S"},null,32.909999999999997,null,null,null,null,null,32.909999999999997,{"$f":"IF('Shooter Information'!$E$3-('Shooter Information'!$G$3-RANK(K12,K$4:K$78,1))<0,0,'Shooter Information'!$E$3-('Shooter Information'!$G$3-RANK(K12,K$4:K$78,1)))","v":8},0]
[10,{"$f":"'Shooter Information'!B15","v":"Slick Rick"},{"$f":"'Shooter Information'!C15","v":"S"},null,72.33,null,null,null,null,null,72.33,{"$f":"IF('Shooter Information'!$E$3-('Shooter Information'!$G$3-RANK(K13,K$4:K$78,1))<0,0,'Shooter Information'!$E$3-('Shooter Information'!$G$3-RANK(K13,K$4:K$78,1)))","v":15},0]
[11,{"$f":"'Shooter Information'!B16","v":"Windhorse Rider"},{"$f":"'Shooter Information'!C16","v":"GF"},null,33.24,null,null,null,null,null,33.24,{"$f":"IF('Shooter Information'!$E$3-('Shooter Information'!$G$3-RANK(K14,K$4:K$78,1))<0,0,'Shooter Information'!$E$3-('Shooter Information'!$G$3-RANK(K14,K$4:K$78,1)))","v":9},0]
[12,{"$f":"'Shooter Information'!B17","v":"Justice Jack"},{"$f":"'Shooter Information'!C17","v":"SS"},null,30.33,null,null,null,null,null,30.33,{"$f":"IF('Shooter Information'!$E$3-('Shooter Information'!$G$3-RANK(K15,K$4:K$78,1))<0,0,'Shooter Information'!$E$3-('Shooter Information'!$G$3-RANK(K15,K$4:K$78,1)))","v":5},0]
[13,{"$f":"'Shooter Information'!B18","v":"B. S. Walker"},{"$f":"'Shooter Information'!C18","v":49},null,26.81,null,null,null,null,null,26.81,{"$f":"IF('Shooter Information'!$E$3-('Shooter Information'!$G$3-RANK(K16,K$4:K$78,1))<0,0,'Shooter Information'!$E$3-('Shooter Information'!$G$3-RANK(K16,K$4:K$78,1)))","v":2},0]
[14,{"$f":"'Shooter Information'!B19","v":"Red Cavanaugh"},{"$f":"'Shooter Information'!C19","v":49},null,36.409999999999997,null,null,null,null,null,36.409999999999997,{"$f":"IF('Shooter Information'!$E$3-('Shooter Information'!$G$3-RANK(K17,K$4:K$78,1))<0,0,'Shooter Information'!$E$3-('Shooter Information'!$G$3-RANK(K17,K$4:K$78,1)))","v":11},0]
[15,{"$f":"'Shooter Information'!B20","v":"Deringer Dan"},{"$f":"'Shooter Information'!C20","v":49},null,37.979999999999997,null,null,null,null,null,37.979999999999997,{"$f":"IF('Shooter Information'!$E$3-('Shooter Information'!$G$3-RANK(K18,K$4:K$78,1))<0,0,'Shooter Information'!$E$3-('Shooter Information'!$G$3-RANK(K18,K$4:K$78,1)))","v":12},0]
[16,{"$f":"'Shooter Information'!B21","v":0},{"$f":"'Shooter Information'!C21","v":0},null,null,null,null,null,null,null,0,{"$f":"IF('Shooter Information'!$E$3-('Shooter Information'!$G$3-RANK(K19,K$4:K$78,1))<0,0,'Shooter Information'!$E$3-('Shooter Information'!$G$3-RANK(K19,K$4:K$78,1)))","v":0},0]
[17,{"$f":"'Shooter Information'!B22","v":0},{"$f":"'Shooter Information'!C22","v":0},null,null,null,null,null,null,null,0,{"$f":"IF('Shooter Information'!$E$3-('Shooter Information'!$G$3-RANK(K20,K$4:K$78,1))<0,0,'Shooter Information'!$E$3-('Shooter Information'!$G$3-RANK(K20,K$4:K$78,1)))","v":0},0]
[18,{"$f":"'Shooter Information'!B23","v":0},{"$f":"'Shooter Information'!C23","v":0},null,null,null,null,null,null,null,0,{"$f":"IF('Shooter Information'!$E$3-('Shooter Information'!$G$3-RANK(K21,K$4:K$78,1))<0,0,'Shooter Information'!$E$3-('Shooter Information'!$G$3-RANK(K21,K$4:K$78,1)))","v":0},0]
[19,{"$f":"'Shooter Information'!B24","v":0},{"$f":"'Shooter Information'!C24","v":0},null,null,null,null,null,null,null,0,{"$f":"IF('Shooter Information'!$E$3-('Shooter Information'!$G$3-RANK(K22,K$4:K$78,1))<0,0,'Shooter Information'!$E$3-('Shooter Information'!$G$3-RANK(K22,K$4:K$78,1)))","v":0},0]
[20,{"$f":"'Shooter Information'!B25","v":0},{"$f":"'Shooter Information'!C25","v":0},null,null,null,null,null,null,null,0,{"$f":"IF('Shooter Information'!$E$3-('Shooter Information'!$G$3-RANK(K23,K$4:K$78,1))<0,0,'Shooter Information'!$E$3-('Shooter Information'!$G$3-RANK(K23,K$4:K$78,1)))","v":0},0]
[21,{"$f":"'Shooter Information'!B26","v":0},{"$f":"'Shooter Information'!C26","v":0},null,null,null,null,null,null,null,0,{"$f":"IF('Shooter Information'!$E$3-('Shooter Information'!$G$3-RANK(K24,K$4:K$78,1))<0,0,'Shooter Information'!$E$3-('Shooter Information'!$G$3-RANK(K24,K$4:K$78,1)))","v":0},0]
[22,{"$f":"'Shooter Information'!B27","v":0},{"$f":"'Shooter Information'!C27","v":0},null,null,null,null,null,null,null,0,{"$f":"IF('Shooter Information'!$E$3-('Shooter Information'!$G$3-RANK(K25,K$4:K$78,1))<0,0,'Shooter Information'!$E$3-('Shooter Information'!$G$3-RANK(K25,K$4:K$78,1)))","v":0},0]
[23,{"$f":"'Shooter Information'!B28","v":0},{"$f":"'Shooter Information'!C28","v":0},null,null,null,null,null,null,null,0,{"$f":"IF('Shooter Information'!$E$3-('Shooter Information'!$G$3-RANK(K26,K$4:K$78,1))<0,0,'Shooter Information'!$E$3-('Shooter Information'!$G$3-RANK(K26,K$4:K$78,1)))","v":0},0]
[24,{"$f":"'Shooter Information'!B29","v":0},{"$f":"'Shooter Information'!C29","v":0},null,null,null,null,null,null,null,0,{"$f":"IF('Shooter Information'!$E$3-('Shooter Information'!$G$3-RANK(K27,K$4:K$78,1))<0,0,'Shooter Information'!$E$3-('Shooter Information'!$G$3-RANK(K27,K$4:K$78,1)))","v":0},0]
[25,{"$f":"'Shooter Information'!B30","v":0},{"$f":"'Shooter Information'!C30","v":0},null,null,null,null,null,null,null,0,{"$f":"IF('Shooter Information'!$E$3-('Shooter Information'!$G$3-RANK(K28,K$4:K$78,1))<0,0,'Shooter Information'!$E$3-('Shooter Information'!$G$3-RANK(K28,K$4:K$78,1)))","v":0},0]
[26,{"$f":"'Shooter Information'!B31","v":0},{"$f":"'Shooter Information'!C31","v":0},null,null,null,null,null,null,null,0,{"$f":"IF('Shooter Information'!$E$3-('Shooter Information'!$G$3-RANK(K29,K$4:K$78,1))<0,0,'Shooter Information'!$E$3-('Shooter Information'!$G$3-RANK(K29,K$4:K$78,1)))","v":0},0]
[27,{"$f":"'Shooter Information'!B32","v":0},{"$f":"'Shooter Information'!C32","v":0},null,null,null,null,null,null,null,0,{"$f":"IF('Shooter Information'!$E$3-('Shooter Information'!$G$3-RANK(K30,K$4:K$78,1))<0,0,'Shooter Information'!$E$3-('Shooter Information'!$G$3-RANK(K30,K$4:K$78,1)))","v":0},0]
[28,{"$f":"'Shooter Information'!B33","v":0},{"$f":"'Shooter Information'!C33","v":0},null,null,null,null,null,null,null,0,{"$f":"IF('Shooter Information'!$E$3-('Shooter Information'!$G$3-RANK(K31,K$4:K$78,1))<0,0,'Shooter Information'!$E$3-('Shooter Information'!$G$3-RANK(K31,K$4:K$78,1)))","v":0},0]
[29,{"$f":"'Shooter Information'!B34","v":0},{"$f":"'Shooter Information'!C34","v":0},null,null,null,null,null,null,null,0,{"$f":"IF('Shooter Information'!$E$3-('Shooter Information'!$G$3-RANK(K32,K$4:K$78,1))<0,0,'Shooter Information'!$E$3-('Shooter Information'!$G$3-RANK(K32,K$4:K$78,1)))","v":0},0]
[30,{"$f":"'Shooter Information'!B35","v":0},{"$f":"'Shooter Information'!C35","v":0},null,null,null,null,null,null,null,0,{"$f":"IF('Shooter Information'!$E$3-('Shooter Information'!$G$3-RANK(K33,K$4:K$78,1))<0,0,'Shooter Information'!$E$3-('Shooter Information'!$G$3-RANK(K33,K$4:K$78,1)))","v":0},0]
[31,{"$f":"'Shooter Information'!B36","v":0},{"$f":"'Shooter Information'!C36","v":0},null,null,null,null,null,null,null,0,{"$f":"IF('Shooter Information'!$E$3-('Shooter Information'!$G$3-RANK(K34,K$4:K$78,1))<0,0,'Shooter Information'!$E$3-('Shooter Information'!$G$3-RANK(K34,K$4:K$78,1)))","v":0},0]
[32,{"$f":"'Shooter Information'!B37","v":0},{"$f":"'Shooter Information'!C37","v":0},null,null,null,null,null,null,null,0,{"$f":"IF('Shooter Information'!$E$3-('Shooter Information'!$G$3-RANK(K35,K$4:K$78,1))<0,0,'Shooter Information'!$E$3-('Shooter Information'!$G$3-RANK(K35,K$4:K$78,1)))","v":0},0]
[33,{"$f":"'Shooter Information'!B38","v":0},{"$f":"'Shooter Information'!C38","v":0},null,null,null,null,null,null,null,0,{"$f":"IF('Shooter Information'!$E$3-('Shooter Information'!$G$3-RANK(K36,K$4:K$78,1))<0,0,'Shooter Information'!$E$3-('Shooter Information'!$G$3-RANK(K36,K$4:K$78,1)))","v":0},0]
[34,{"$f":"'Shooter Information'!B39","v":0},{"$f":"'Shooter Information'!C39","v":0},null,null,null,null,null,null,null,0,{"$f":"IF('Shooter Information'!$E$3-('Shooter Information'!$G$3-RANK(K37,K$4:K$78,1))<0,0,'Shooter Information'!$E$3-('Shooter Information'!$G$3-RANK(K37,K$4:K$78,1)))","v":0},0]
[35,{"$f":"'Shooter Information'!B40","v":0},{"$f":"'Shooter Information'!C40","v":0},null,null,null,null,null,null,null,0,{"$f":"IF('Shooter Information'!$E$3-('Shooter Information'!$G$3-RANK(K38,K$4:K$78,1))<0,0,'Shooter Information'!$E$3-('Shooter Information'!$G$3-RANK(K38,K$4:K$78,1)))","v":0},0]
[36,{"$f":"'Shooter Information'!B41","v":0},{"$f":"'Shooter Information'!C41","v":0},null,null,null,null,null,null,null,0,{"$f":"IF('Shooter Information'!$E$3-('Shooter Information'!$G$3-RANK(K39,K$4:K$78,1))<0,0,'Shooter Information'!$E$3-('Shooter Information'!$G$3-RANK(K39,K$4:K$78,1)))","v":0},0]
[37,{"$f":"'Shooter Information'!B42","v":0},{"$f":"'Shooter Information'!C42","v":0},null,null,null,null,null,null,null,0,{"$f":"IF('Shooter Information'!$E$3-('Shooter Information'!$G$3-RANK(K40,K$4:K$78,1))<0,0,'Shooter Information'!$E$3-('Shooter Information'!$G$3-RANK(K40,K$4:K$78,1)))","v":0},0]
[38,{"$f":"'Shooter Information'!B43","v":0},{"$f":"'Shooter Information'!C43","v":0},null,null,null,null,null,null,null,0,{"$f":"IF('Shooter Information'!$E$3-('Shooter Information'!$G$3-RANK(K41,K$4:K$78,1))<0,0,'Shooter Information'!$E$3-('Shooter Information'!$G$3-RANK(K41,K$4:K$78,1)))","v":0},0]
[39,{"$f":"'Shooter Information'!B44","v":0},{"$f":"'Shooter Information'!C44","v":0},null,null,null,null,null,null,null,0,{"$f":"IF('Shooter Information'!$E$3-('Shooter Information'!$G$3-RANK(K42,K$4:K$78,1))<0,0,'Shooter Information'!$E$3-('Shooter Information'!$G$3-RANK(K42,K$4:K$78,1)))","v":0},0]
[40,{"$f":"'Shooter Information'!B45","v":0},{"$f":"'Shooter Information'!C45","v":0},null,null,null,null,null,null,null,0,{"$f":"IF('Shooter Information'!$E$3-('Shooter Information'!$G$3-RANK(K43,K$4:K$78,1))<0,0,'Shooter Information'!$E$3-('Shooter Information'!$G$3-RANK(K43,K$4:K$78,1)))","v":0},0]
[41,{"$f":"'Shooter Information'!B46","v":0},{"$f":"'Shooter Information'!C46","v":0},null,null,null,null,null,null,null,0,{"$f":"IF('Shooter Information'!$E$3-('Shooter Information'!$G$3-RANK(K44,K$4:K$78,1))<0,0,'Shooter Information'!$E$3-('Shooter Information'!$G$3-RANK(K44,K$4:K$78,1)))","v":0},0]
[42,{"$f":"'Shooter Information'!B47","v":0},{"$f":"'Shooter Information'!C47","v":0},null,null,null,null,null,null,null,0,{"$f":"IF('Shooter Information'!$E$3-('Shooter Information'!$G$3-RANK(K45,K$4:K$78,1))<0,0,'Shooter Information'!$E$3-('Shooter Information'!$G$3-RANK(K45,K$4:K$78,1)))","v":0},0]
[43,{"$f":"'Shooter Information'!B48","v":0},{"$f":"'Shooter Information'!C48","v":0},null,null,null,null,null,null,null,0,{"$f":"IF('Shooter Information'!$E$3-('Shooter Information'!$G$3-RANK(K46,K$4:K$78,1))<0,0,'Shooter Information'!$E$3-('Shooter Information'!$G$3-RANK(K46,K$4:K$78,1)))","v":0},0]
[44,{"$f":"'Shooter Information'!B49","v":0},{"$f":"'Shooter Information'!C49","v":0},null,null,null,null,null,null,null,0,{"$f":"IF('Shooter Information'!$E$3-('Shooter Information'!$G$3-RANK(K47,K$4:K$78,1))<0,0,'Shooter Information'!$E$3-('Shooter Information'!$G$3-RANK(K47,K$4:K$78,1)))","v":0},0]
[45,{"$f":"'Shooter Information'!B50","v":0},{"$f":"'Shooter Information'!C50","v":0},null,null,null,null,null,null,null,0,{"$f":"IF('Shooter Information'!$E$3-('Shooter Information'!$G$3-RANK(K48,K$4:K$78,1))<0,0,'Shooter Information'!$E$3-('Shooter Information'!$G$3-RANK(K48,K$4:K$78,1)))","v":0},0]
[46,{"$f":"'Shooter Information'!B51","v":0},{"$f":"'Shooter Information'!C51","v":0},null,null,null,null,null,null,null,{"$f":"(D49*5)+E49-F49+(G49*10)+(H49*30)+(I49*999)+(J49*999.99)","v":0},{"$f":"IF('Shooter Information'!$E$3-('Shooter Information'!$G$3-RANK(K49,K$4:K$78,1))<0,0,'Shooter Information'!$E$3-('Shooter Information'!$G$3-RANK(K49,K$4:K$78,1)))","v":0},0]
[47,{"$f":"'Shooter Information'!B52","v":0},{"$f":"'Shooter Information'!C52","v":0},null,null,null,null,null,null,null,0,{"$f":"IF('Shooter Information'!$E$3-('Shooter Information'!$G$3-RANK(K50,K$4:K$78,1))<0,0,'Shooter Information'!$E$3-('Shooter Information'!$G$3-RANK(K50,K$4:K$78,1)))","v":0},0]
[48,{"$f":"'Shooter Information'!B53","v":0},{"$f":"'Shooter Information'!C53","v":0},null,null,null,null,null,null,null,0,{"$f":"IF('Shooter Information'!$E$3-('Shooter Information'!$G$3-RANK(K51,K$4:K$78,1))<0,0,'Shooter Information'!$E$3-('Shooter Information'!$G$3-RANK(K51,K$4:K$78,1)))","v":0},0]
[49,{"$f":"'Shooter Information'!B54","v":0},{"$f":"'Shooter Information'!C54","v":0},null,null,null,null,null,null,null,0,{"$f":"IF('Shooter Information'!$E$3-('Shooter Information'!$G$3-RANK(K52,K$4:K$78,1))<0,0,'Shooter Information'!$E$3-('Shooter Information'!$G$3-RANK(K52,K$4:K$78,1)))","v":0},0]
[50,{"$f":"'Shooter Information'!B55","v":0},{"$f":"'Shooter Information'!C55","v":0},null,null,null,null,null,null,null,0,{"$f":"IF('Shooter Information'!$E$3-('Shooter Information'!$G$3-RANK(K53,K$4:K$78,1))<0,0,'Shooter Information'!$E$3-('Shooter Information'!$G$3-RANK(K53,K$4:K$78,1)))","v":0},0]
[51,{"$f":"'Shooter Information'!B56","v":0},{"$f":"'Shooter Information'!C56","v":0},null,null,null,null,null,null,null,0,{"$f":"IF('Shooter Information'!$E$3-('Shooter Information'!$G$3-RANK(K54,K$4:K$78,1))<0,0,'Shooter Information'!$E$3-('Shooter Information'!$G$3-RANK(K54,K$4:K$78,1)))","v":0},0]
[52,{"$f":"'Shooter Information'!B57","v":0},{"$f":"'Shooter Information'!C57","v":0},null,null,null,null,null,null,null,0,{"$f":"IF('Shooter Information'!$E$3-('Shooter Information'!$G$3-RANK(K55,K$4:K$78,1))<0,0,'Shooter Information'!$E$3-('Shooter Information'!$G$3-RANK(K55,K$4:K$78,1)))","v":0},0]
[53,{"$f":"'Shooter Information'!B58","v":0},{"$f":"'Shooter Information'!C58","v":0},null,null,null,null,null,null,null,0,{"$f":"IF('Shooter Information'!$E$3-('Shooter Information'!$G$3-RANK(K56,K$4:K$78,1))<0,0,'Shooter Information'!$E$3-('Shooter Information'!$G$3-RANK(K56,K$4:K$78,1)))","v":0},0]
[54,{"$f":"'Shooter Information'!B59","v":0},{"$f":"'Shooter Information'!C59","v":0},null,null,null,null,null,null,null,0,{"$f":"IF('Shooter Information'!$E$3-('Shooter Information'!$G$3-RANK(K57,K$4:K$78,1))<0,0,'Shooter Information'!$E$3-('Shooter Information'!$G$3-RANK(K57,K$4:K$78,1)))","v":0},0]
[55,{"$f":"'Shooter Information'!B60","v":0},{"$f":"'Shooter Information'!C60","v":0},null,null,null,null,null,null,null,0,{"$f":"IF('Shooter Information'!$E$3-('Shooter Information'!$G$3-RANK(K58,K$4:K$78,1))<0,0,'Shooter Information'!$E$3-('Shooter Information'!$G$3-RANK(K58,K$4:K$78,1)))","v":0},0]
[56,{"$f":"'Shooter Information'!B61","v":0},{"$f":"'Shooter Information'!C61","v":0},null,null,null,null,null,null,null,0,{"$f":"IF('Shooter Information'!$E$3-('Shooter Information'!$G$3-RANK(K59,K$4:K$78,1))<0,0,'Shooter Information'!$E$3-('Shooter Information'!$G$3-RANK(K59,K$4:K$78,1)))","v":0},0]
[57,{"$f":"'Shooter Information'!B62","v":0},{"$f":"'Shooter Information'!C62","v":0},null,null,null,null,null,null,null,0,{"$f":"IF('Shooter Information'!$E$3-('Shooter Information'!$G$3-RANK(K60,K$4:K$78,1))<0,0,'Shooter Information'!$E$3-('Shooter Information'!$G$3-RANK(K60,K$4:K$78,1)))","v":0},0]
[58,{"$f":"'Shooter Information'!B63","v":0},{"$f":"'Shooter Information'!C63","v":0},null,null,null,null,null,null,null,0,{"$f":"IF('Shooter Information'!$E$3-('Shooter Information'!$G$3-RANK(K61,K$4:K$78,1))<0,0,'Shooter Information'!$E$3-('Shooter Information'!$G$3-RANK(K61,K$4:K$78,1)))","v":0},0]
[59,{"$f":"'Shooter Information'!B64","v":0},{"$f":"'Shooter Information'!C64","v":0},null,null,null,null,null,null,null,0,{"$f":"IF('Shooter Information'!$E$3-('Shooter Information'!$G$3-RANK(K62,K$4:K$78,1))<0,0,'Shooter Information'!$E$3-('Shooter Information'!$G$3-RANK(K62,K$4:K$78,1)))","v":0},0]
[60,{"$f":"'Shooter Information'!B65","v":0},{"$f":"'Shooter Information'!C65","v":0},null,null,null,null,null,null,null,0,{"$f":"IF('Shooter Information'!$E$3-('Shooter Information'!$G$3-RANK(K63,K$4:K$78,1))<0,0,'Shooter Information'!$E$3-('Shooter Information'!$G$3-RANK(K63,K$4:K$78,1)))","v":0},0]
[61,{"$f":"'Shooter Information'!B66","v":0},{"$f":"'Shooter Information'!C66","v":0},null,null,null,null,null,null,null,{"$f":"(D64*5)+E64-F64+(G64*10)+(H64*30)+(I64*999)+(J64*999.99)","v":0},{"$f":"IF('Shooter Information'!$E$3-('Shooter Information'!$G$3-RANK(K64,K$4:K$78,1))<0,0,'Shooter Information'!$E$3-('Shooter Information'!$G$3-RANK(K64,K$4:K$78,1)))","v":0},{"$f":"(SUM(D64+G64+H64+I64+J64))","v":0}]
[62,{"$f":"'Shooter Information'!B67","v":0},{"$f":"'Shooter Information'!C67","v":0},null,null,null,null,null,null,null,0,{"$f":"IF('Shooter Information'!$E$3-('Shooter Information'!$G$3-RANK(K65,K$4:K$78,1))<0,0,'Shooter Information'!$E$3-('Shooter Information'!$G$3-RANK(K65,K$4:K$78,1)))","v":0},0]
[63,{"$f":"'Shooter Information'!B68","v":0},{"$f":"'Shooter Information'!C68","v":0},null,null,null,null,null,null,null,0,{"$f":"IF('Shooter Information'!$E$3-('Shooter Information'!$G$3-RANK(K66,K$4:K$78,1))<0,0,'Shooter Information'!$E$3-('Shooter Information'!$G$3-RANK(K66,K$4:K$78,1)))","v":0},0]
[64,{"$f":"'Shooter Information'!B69","v":0},{"$f":"'Shooter Information'!C69","v":0},null,null,null,null,null,null,null,0,{"$f":"IF('Shooter Information'!$E$3-('Shooter Information'!$G$3-RANK(K67,K$4:K$78,1))<0,0,'Shooter Information'!$E$3-('Shooter Information'!$G$3-RANK(K67,K$4:K$78,1)))","v":0},0]
[65,{"$f":"'Shooter Information'!B70","v":0},{"$f":"'Shooter Information'!C70","v":0},null,null,null,null,null,null,null,0,{"$f":"IF('Shooter Information'!$E$3-('Shooter Information'!$G$3-RANK(K68,K$4:K$78,1))<0,0,'Shooter Information'!$E$3-('Shooter Information'!$G$3-RANK(K68,K$4:K$78,1)))","v":0},0]
[66,{"$f":"'Shooter Information'!B71","v":0},{"$f":"'Shooter Information'!C71","v":0},null,null,null,null,null,null,null,0,{"$f":"IF('Shooter Information'!$E$3-('Shooter Information'!$G$3-RANK(K69,K$4:K$78,1))<0,0,'Shooter Information'!$E$3-('Shooter Information'!$G$3-RANK(K69,K$4:K$78,1)))","v":0},0]
[67,{"$f":"'Shooter Information'!B72","v":0},{"$f":"'Shooter Information'!C72","v":0},null,null,null,null,null,null,null,0,{"$f":"IF('Shooter Information'!$E$3-('Shooter Information'!$G$3-RANK(K70,K$4:K$78,1))<0,0,'Shooter Information'!$E$3-('Shooter Information'!$G$3-RANK(K70,K$4:K$78,1)))","v":0},0]
[68,{"$f":"'Shooter Information'!B73","v":0},{"$f":"'Shooter Information'!C73","v":0},null,null,null,null,null,null,null,0,{"$f":"IF('Shooter Information'!$E$3-('Shooter Information'!$G$3-RANK(K71,K$4:K$78,1))<0,0,'Shooter Information'!$E$3-('Shooter Information'!$G$3-RANK(K71,K$4:K$78,1)))","v":0},0]
[69,{"$f":"'Shooter Information'!B74","v":0},{"$f":"'Shooter Information'!C74","v":0},null,null,null,null,null,null,null,0,{"$f":"IF('Shooter Information'!$E$3-('Shooter Information'!$G$3-RANK(K72,K$4:K$78,1))<0,0,'Shooter Information'!$E$3-('Shooter Information'!$G$3-RANK(K72,K$4:K$78,1)))","v":0},0]
[70,{"$f":"'Shooter Information'!B75","v":0},{"$f":"'Shooter Information'!C75","v":0},null,null,null,null,null,null,null,0,{"$f":"IF('Shooter Information'!$E$3-('Shooter Information'!$G$3-RANK(K73,K$4:K$78,1))<0,0,'Shooter Information'!$E$3-('Shooter Information'!$G$3-RANK(K73,K$4:K$78,1)))","v":0},0]
[71,{"$f":"'Shooter Information'!B76","v":0},{"$f":"'Shooter Information'!C76","v":0},null,null,null,null,null,null,null,0,{"$f":"IF('Shooter Information'!$E$3-('Shooter Information'!$G$3-RANK(K74,K$4:K$78,1))<0,0,'Shooter Information'!$E$3-('Shooter Information'!$G$3-RANK(K74,K$4:K$78,1)))","v":0},0]
[72,{"$f":"'Shooter Information'!B77","v":0},{"$f":"'Shooter Information'!C77","v":0},null,null,null,null,null,null,null,0,{"$f":"IF('Shooter Information'!$E$3-('Shooter Information'!$G$3-RANK(K75,K$4:K$78,1))<0,0,'Shooter Information'!$E$3-('Shooter Information'!$G$3-RANK(K75,K$4:K$78,1)))","v":0},0]
[73,{"$f":"'Shooter Information'!B78","v":0},{"$f":"'Shooter Information'!C78","v":0},null,null,null,null,null,null,null,0,{"$f":"IF('Shooter Information'!$E$3-('Shooter Information'!$G$3-RANK(K76,K$4:K$78,1))<0,0,'Shooter Information'!$E$3-('Shooter Information'!$G$3-RANK(K76,K$4:K$78,1)))","v":0},0]
[74,{"$f":"'Shooter Information'!B79","v":0},{"$f":"'Shooter Information'!C79","v":0},null,null,null,null,null,null,null,0,{"$f":"IF('Shooter Information'!$E$3-('Shooter Information'!$G$3-RANK(K77,K$4:K$78,1))<0,0,'Shooter Information'!$E$3-('Shooter Information'!$G$3-RANK(K77,K$4:K$78,1)))","v":0},0]
[75,{"$f":"'Shooter Information'!B80","v":0},{"$f":"'Shooter Information'!C80","v":0},null,null,null,null,null,null,null,0,{"$f":"IF('Shooter Information'!$E$3-('Shooter Information'!$G$3-RANK(K78,K$4:K$78,1))<0,0,'Shooter Information'!$E$3-('Shooter Information'!$G$3-RANK(K78,K$4:K$78,1)))","v":0},0]

{"sheet":"Stage 6","index":6,"n_rows":78,"n_cols":13,"rows_kept":78,"cut":false,"hidden":false,"merged":[]}
[null,"CAS SCORE SHEET"]
[null,"Stage 6"]
["Roster #","Shooter","Class","Misses","Raw Time","Bonus","10 Sec","30 Sec","DNF","DQ","Total","Rank","Penalties"]
[{"$f":"ROW()-3","v":1},{"$f":"'Shooter Information'!B6","v":"Striker"},{"$f":"'Shooter Information'!C6","v":"GF"},null,27.74,null,null,null,null,null,{"$f":"(D4*5)+E4-F4+(G4*10)+(H4*30)+(I4*999)+(J4*999.99)","v":27.74},{"$f":"IF('Shooter Information'!$E$3-('Shooter Information'!$G$3-RANK(K4,K$4:K$78,1))<0,0,'Shooter Information'!$E$3-('Shooter Information'!$G$3-RANK(K4,K$4:K$78,1)))","v":3},{"$f":"(SUM(D4+G4+H4+I4+J4))","v":0}]
[{"$f":"ROW()-3","v":2},{"$f":"'Shooter Information'!B7","v":"Lefty Spurmaker"},{"$f":"'Shooter Information'!C7","v":49},null,30.9,null,null,null,null,null,{"$f":"(D5*5)+E5-F5+(G5*10)+(H5*30)+(I5*999)+(J5*999.99)","v":30.9},{"$f":"IF('Shooter Information'!$E$3-('Shooter Information'!$G$3-RANK(K5,K$4:K$78,1))<0,0,'Shooter Information'!$E$3-('Shooter Information'!$G$3-RANK(K5,K$4:K$78,1)))","v":6},{"$f":"(SUM(D5+G5+H5+I5+J5))","v":0}]
[3,{"$f":"'Shooter Information'!B8","v":"Hotshod"},{"$f":"'Shooter Information'!C8","v":"W"},1,42.83,null,1,null,null,null,57.83,{"$f":"IF('Shooter Information'!$E$3-('Shooter Information'!$G$3-RANK(K6,K$4:K$78,1))<0,0,'Shooter Information'!$E$3-('Shooter Information'!$G$3-RANK(K6,K$4:K$78,1)))","v":14},2]
[4,{"$f":"'Shooter Information'!B9","v":"Swifty McDraw"},{"$f":"'Shooter Information'!C9","v":"SS"},null,35.46,null,null,null,null,null,35.46,{"$f":"IF('Shooter Information'!$E$3-('Shooter Information'!$G$3-RANK(K7,K$4:K$78,1))<0,0,'Shooter Information'!$E$3-('Shooter Information'!$G$3-RANK(K7,K$4:K$78,1)))","v":8},0]
[5,{"$f":"'Shooter Information'!B10","v":"Prairie City Slim"},{"$f":"'Shooter Information'!C10","v":"SS"},null,36.08,null,null,null,null,null,36.08,{"$f":"IF('Shooter Information'!$E$3-('Shooter Information'!$G$3-RANK(K8,K$4:K$78,1))<0,0,'Shooter Information'!$E$3-('Shooter Information'!$G$3-RANK(K8,K$4:K$78,1)))","v":10},0]
[6,{"$f":"'Shooter Information'!B11","v":"Enid City Kid"},{"$f":"'Shooter Information'!C11","v":"FC"},1,41.07,null,1,null,null,null,56.07,{"$f":"IF('Shooter Information'!$E$3-('Shooter Information'!$G$3-RANK(K9,K$4:K$78,1))<0,0,'Shooter Information'!$E$3-('Shooter Information'!$G$3-RANK(K9,K$4:K$78,1)))","v":13},2]
[7,{"$f":"'Shooter Information'!B12","v":"Cockroach"},{"$f":"'Shooter Information'!C12","v":"CB"},null,23.88,null,null,null,null,null,23.88,{"$f":"IF('Shooter Information'!$E$3-('Shooter Information'!$G$3-RANK(K10,K$4:K$78,1))<0,0,'Shooter Information'!$E$3-('Shooter Information'!$G$3-RANK(K10,K$4:K$78,1)))","v":2},0]
[8,{"$f":"'Shooter Information'!B13","v":"Kuba Kid"},{"$f":"'Shooter Information'!C13","v":"D"},null,30.65,null,null,null,null,null,30.65,{"$f":"IF('Shooter Information'!$E$3-('Shooter Information'!$G$3-RANK(K11,K$4:K$78,1))<0,0,'Shooter Information'!$E$3-('Shooter Information'!$G$3-RANK(K11,K$4:K$78,1)))","v":5},0]
[9,{"$f":"'Shooter Information'!B14","v":"Beartooth"},{"$f":"'Shooter Information'!C14","v":"S"},null,28.28,null,null,null,null,null,28.28,{"$f":"IF('Shooter Information'!$E$3-('Shooter Information'!$G$3-RANK(K12,K$4:K$78,1))<0,0,'Shooter Information'!$E$3-('Shooter Information'!$G$3-RANK(K12,K$4:K$78,1)))","v":4},0]
[10,{"$f":"'Shooter Information'!B15","v":"Slick Rick"},{"$f":"'Shooter Information'!C15","v":"S"},null,76.87,null,null,null,null,null,76.87,{"$f":"IF('Shooter Information'!$E$3-('Shooter Information'!$G$3-RANK(K13,K$4:K$78,1))<0,0,'Shooter Information'!$E$3-('Shooter Information'!$G$3-RANK(K13,K$4:K$78,1)))","v":15},0]
[11,{"$f":"'Shooter Information'!B16","v":"Windhorse Rider"},{"$f":"'Shooter Information'!C16","v":"GF"},null,35.96,null,null,null,null,null,35.96,{"$f":"IF('Shooter Information'!$E$3-('Shooter Information'!$G$3-RANK(K14,K$4:K$78,1))<0,0,'Shooter Information'!$E$3-('Shooter Information'!$G$3-RANK(K14,K$4:K$78,1)))","v":9},0]
[12,{"$f":"'Shooter Information'!B17","v":"Justice Jack"},{"$f":"'Shooter Information'!C17","v":"SS"},null,34.06,null,1,null,null,null,44.06,{"$f":"IF('Shooter Information'!$E$3-('Shooter Information'!$G$3-RANK(K15,K$4:K$78,1))<0,0,'Shooter Information'!$E$3-('Shooter Information'!$G$3-RANK(K15,K$4:K$78,1)))","v":12},1]
[13,{"$f":"'Shooter Information'!B18","v":"B. S. Walker"},{"$f":"'Shooter Information'!C18","v":49},null,23.75,null,null,null,null,null,23.75,{"$f":"IF('Shooter Information'!$E$3-('Shooter Information'!$G$3-RANK(K16,K$4:K$78,1))<0,0,'Shooter Information'!$E$3-('Shooter Information'!$G$3-RANK(K16,K$4:K$78,1)))","v":1},0]
[14,{"$f":"'Shooter Information'!B19","v":"Red Cavanaugh"},{"$f":"'Shooter Information'!C19","v":49},null,31.24,null,null,null,null,null,31.24,{"$f":"IF('Shooter Information'!$E$3-('Shooter Information'!$G$3-RANK(K17,K$4:K$78,1))<0,0,'Shooter Information'!$E$3-('Shooter Information'!$G$3-RANK(K17,K$4:K$78,1)))","v":7},0]
[15,{"$f":"'Shooter Information'!B20","v":"Deringer Dan"},{"$f":"'Shooter Information'!C20","v":49},null,40.36,null,null,null,null,null,40.36,{"$f":"IF('Shooter Information'!$E$3-('Shooter Information'!$G$3-RANK(K18,K$4:K$78,1))<0,0,'Shooter Information'!$E$3-('Shooter Information'!$G$3-RANK(K18,K$4:K$78,1)))","v":11},0]
[16,{"$f":"'Shooter Information'!B21","v":0},{"$f":"'Shooter Information'!C21","v":0},null,null,null,null,null,null,null,0,{"$f":"IF('Shooter Information'!$E$3-('Shooter Information'!$G$3-RANK(K19,K$4:K$78,1))<0,0,'Shooter Information'!$E$3-('Shooter Information'!$G$3-RANK(K19,K$4:K$78,1)))","v":0},0]
[17,{"$f":"'Shooter Information'!B22","v":0},{"$f":"'Shooter Information'!C22","v":0},null,null,null,null,null,null,null,0,{"$f":"IF('Shooter Information'!$E$3-('Shooter Information'!$G$3-RANK(K20,K$4:K$78,1))<0,0,'Shooter Information'!$E$3-('Shooter Information'!$G$3-RANK(K20,K$4:K$78,1)))","v":0},0]
[18,{"$f":"'Shooter Information'!B23","v":0},{"$f":"'Shooter Information'!C23","v":0},null,null,null,null,null,null,null,0,{"$f":"IF('Shooter Information'!$E$3-('Shooter Information'!$G$3-RANK(K21,K$4:K$78,1))<0,0,'Shooter Information'!$E$3-('Shooter Information'!$G$3-RANK(K21,K$4:K$78,1)))","v":0},0]
[19,{"$f":"'Shooter Information'!B24","v":0},{"$f":"'Shooter Information'!C24","v":0},null,null,null,null,null,null,null,0,{"$f":"IF('Shooter Information'!$E$3-('Shooter Information'!$G$3-RANK(K22,K$4:K$78,1))<0,0,'Shooter Information'!$E$3-('Shooter Information'!$G$3-RANK(K22,K$4:K$78,1)))","v":0},0]
[20,{"$f":"'Shooter Information'!B25","v":0},{"$f":"'Shooter Information'!C25","v":0},null,null,null,null,null,null,null,0,{"$f":"IF('Shooter Information'!$E$3-('Shooter Information'!$G$3-RANK(K23,K$4:K$78,1))<0,0,'Shooter Information'!$E$3-('Shooter Information'!$G$3-RANK(K23,K$4:K$78,1)))","v":0},0]
[21,{"$f":"'Shooter Information'!B26","v":0},{"$f":"'Shooter Information'!C26","v":0},null,null,null,null,null,null,null,0,{"$f":"IF('Shooter Information'!$E$3-('Shooter Information'!$G$3-RANK(K24,K$4:K$78,1))<0,0,'Shooter Information'!$E$3-('Shooter Information'!$G$3-RANK(K24,K$4:K$78,1)))","v":0},0]
[22,{"$f":"'Shooter Information'!B27","v":0},{"$f":"'Shooter Information'!C27","v":0},null,null,null,null,null,null,null,0,{"$f":"IF('Shooter Information'!$E$3-('Shooter Information'!$G$3-RANK(K25,K$4:K$78,1))<0,0,'Shooter Information'!$E$3-('Shooter Information'!$G$3-RANK(K25,K$4:K$78,1)))","v":0},0]
[23,{"$f":"'Shooter Information'!B28","v":0},{"$f":"'Shooter Information'!C28","v":0},null,null,null,null,null,null,null,0,{"$f":"IF('Shooter Information'!$E$3-('Shooter Information'!$G$3-RANK(K26,K$4:K$78,1))<0,0,'Shooter Information'!$E$3-('Shooter Information'!$G$3-RANK(K26,K$4:K$78,1)))","v":0},0]
[24,{"$f":"'Shooter Information'!B29","v":0},{"$f":"'Shooter Information'!C29","v":0},null,null,null,null,null,null,null,0,{"$f":"IF('Shooter Information'!$E$3-('Shooter Information'!$G$3-RANK(K27,K$4:K$78,1))<0,0,'Shooter Information'!$E$3-('Shooter Information'!$G$3-RANK(K27,K$4:K$78,1)))","v":0},0]
[25,{"$f":"'Shooter Information'!B30","v":0},{"$f":"'Shooter Information'!C30","v":0},null,null,null,null,null,null,null,0,{"$f":"IF('Shooter Information'!$E$3-('Shooter Information'!$G$3-RANK(K28,K$4:K$78,1))<0,0,'Shooter Information'!$E$3-('Shooter Information'!$G$3-RANK(K28,K$4:K$78,1)))","v":0},0]
[26,{"$f":"'Shooter Information'!B31","v":0},{"$f":"'Shooter Information'!C31","v":0},null,null,null,null,null,null,null,0,{"$f":"IF('Shooter Information'!$E$3-('Shooter Information'!$G$3-RANK(K29,K$4:K$78,1))<0,0,'Shooter Information'!$E$3-('Shooter Information'!$G$3-RANK(K29,K$4:K$78,1)))","v":0},0]
[27,{"$f":"'Shooter Information'!B32","v":0},{"$f":"'Shooter Information'!C32","v":0},null,null,null,null,null,null,null,0,{"$f":"IF('Shooter Information'!$E$3-('Shooter Information'!$G$3-RANK(K30,K$4:K$78,1))<0,0,'Shooter Information'!$E$3-('Shooter Information'!$G$3-RANK(K30,K$4:K$78,1)))","v":0},0]
[28,{"$f":"'Shooter Information'!B33","v":0},{"$f":"'Shooter Information'!C33","v":0},null,null,null,null,null,null,null,0,{"$f":"IF('Shooter Information'!$E$3-('Shooter Information'!$G$3-RANK(K31,K$4:K$78,1))<0,0,'Shooter Information'!$E$3-('Shooter Information'!$G$3-RANK(K31,K$4:K$78,1)))","v":0},0]
[29,{"$f":"'Shooter Information'!B34","v":0},{"$f":"'Shooter Information'!C34","v":0},null,null,null,null,null,null,null,0,{"$f":"IF('Shooter Information'!$E$3-('Shooter Information'!$G$3-RANK(K32,K$4:K$78,1))<0,0,'Shooter Information'!$E$3-('Shooter Information'!$G$3-RANK(K32,K$4:K$78,1)))","v":0},0]
[30,{"$f":"'Shooter Information'!B35","v":0},{"$f":"'Shooter Information'!C35","v":0},null,null,null,null,null,null,null,0,{"$f":"IF('Shooter Information'!$E$3-('Shooter Information'!$G$3-RANK(K33,K$4:K$78,1))<0,0,'Shooter Information'!$E$3-('Shooter Information'!$G$3-RANK(K33,K$4:K$78,1)))","v":0},0]
[31,{"$f":"'Shooter Information'!B36","v":0},{"$f":"'Shooter Information'!C36","v":0},null,null,null,null,null,null,null,0,{"$f":"IF('Shooter Information'!$E$3-('Shooter Information'!$G$3-RANK(K34,K$4:K$78,1))<0,0,'Shooter Information'!$E$3-('Shooter Information'!$G$3-RANK(K34,K$4:K$78,1)))","v":0},0]
[32,{"$f":"'Shooter Information'!B37","v":0},{"$f":"'Shooter Information'!C37","v":0},null,null,null,null,null,null,null,0,{"$f":"IF('Shooter Information'!$E$3-('Shooter Information'!$G$3-RANK(K35,K$4:K$78,1))<0,0,'Shooter Information'!$E$3-('Shooter Information'!$G$3-RANK(K35,K$4:K$78,1)))","v":0},0]
[33,{"$f":"'Shooter Information'!B38","v":0},{"$f":"'Shooter Information'!C38","v":0},null,null,null,null,null,null,null,0,{"$f":"IF('Shooter Information'!$E$3-('Shooter Information'!$G$3-RANK(K36,K$4:K$78,1))<0,0,'Shooter Information'!$E$3-('Shooter Information'!$G$3-RANK(K36,K$4:K$78,1)))","v":0},0]
[34,{"$f":"'Shooter Information'!B39","v":0},{"$f":"'Shooter Information'!C39","v":0},null,null,null,null,null,null,null,0,{"$f":"IF('Shooter Information'!$E$3-('Shooter Information'!$G$3-RANK(K37,K$4:K$78,1))<0,0,'Shooter Information'!$E$3-('Shooter Information'!$G$3-RANK(K37,K$4:K$78,1)))","v":0},0]
[35,{"$f":"'Shooter Information'!B40","v":0},{"$f":"'Shooter Information'!C40","v":0},null,null,null,null,null,null,null,0,{"$f":"IF('Shooter Information'!$E$3-('Shooter Information'!$G$3-RANK(K38,K$4:K$78,1))<0,0,'Shooter Information'!$E$3-('Shooter Information'!$G$3-RANK(K38,K$4:K$78,1)))","v":0},0]
[36,{"$f":"'Shooter Information'!B41","v":0},{"$f":"'Shooter Information'!C41","v":0},null,null,null,null,null,null,null,0,{"$f":"IF('Shooter Information'!$E$3-('Shooter Information'!$G$3-RANK(K39,K$4:K$78,1))<0,0,'Shooter Information'!$E$3-('Shooter Information'!$G$3-RANK(K39,K$4:K$78,1)))","v":0},0]
[37,{"$f":"'Shooter Information'!B42","v":0},{"$f":"'Shooter Information'!C42","v":0},null,null,null,null,null,null,null,0,{"$f":"IF('Shooter Information'!$E$3-('Shooter Information'!$G$3-RANK(K40,K$4:K$78,1))<0,0,'Shooter Information'!$E$3-('Shooter Information'!$G$3-RANK(K40,K$4:K$78,1)))","v":0},0]
[38,{"$f":"'Shooter Information'!B43","v":0},{"$f":"'Shooter Information'!C43","v":0},null,null,null,null,null,null,null,0,{"$f":"IF('Shooter Information'!$E$3-('Shooter Information'!$G$3-RANK(K41,K$4:K$78,1))<0,0,'Shooter Information'!$E$3-('Shooter Information'!$G$3-RANK(K41,K$4:K$78,1)))","v":0},0]
[39,{"$f":"'Shooter Information'!B44","v":0},{"$f":"'Shooter Information'!C44","v":0},null,null,null,null,null,null,null,0,{"$f":"IF('Shooter Information'!$E$3-('Shooter Information'!$G$3-RANK(K42,K$4:K$78,1))<0,0,'Shooter Information'!$E$3-('Shooter Information'!$G$3-RANK(K42,K$4:K$78,1)))","v":0},0]
[40,{"$f":"'Shooter Information'!B45","v":0},{"$f":"'Shooter Information'!C45","v":0},null,null,null,null,null,null,null,0,{"$f":"IF('Shooter Information'!$E$3-('Shooter Information'!$G$3-RANK(K43,K$4:K$78,1))<0,0,'Shooter Information'!$E$3-('Shooter Information'!$G$3-RANK(K43,K$4:K$78,1)))","v":0},0]
[41,{"$f":"'Shooter Information'!B46","v":0},{"$f":"'Shooter Information'!C46","v":0},null,null,null,null,null,null,null,0,{"$f":"IF('Shooter Information'!$E$3-('Shooter Information'!$G$3-RANK(K44,K$4:K$78,1))<0,0,'Shooter Information'!$E$3-('Shooter Information'!$G$3-RANK(K44,K$4:K$78,1)))","v":0},0]
[42,{"$f":"'Shooter Information'!B47","v":0},{"$f":"'Shooter Information'!C47","v":0},null,null,null,null,null,null,null,0,{"$f":"IF('Shooter Information'!$E$3-('Shooter Information'!$G$3-RANK(K45,K$4:K$78,1))<0,0,'Shooter Information'!$E$3-('Shooter Information'!$G$3-RANK(K45,K$4:K$78,1)))","v":0},0]
[43,{"$f":"'Shooter Information'!B48","v":0},{"$f":"'Shooter Information'!C48","v":0},null,null,null,null,null,null,null,0,{"$f":"IF('Shooter Information'!$E$3-('Shooter Information'!$G$3-RANK(K46,K$4:K$78,1))<0,0,'Shooter Information'!$E$3-('Shooter Information'!$G$3-RANK(K46,K$4:K$78,1)))","v":0},0]
[44,{"$f":"'Shooter Information'!B49","v":0},{"$f":"'Shooter Information'!C49","v":0},null,null,null,null,null,null,null,0,{"$f":"IF('Shooter Information'!$E$3-('Shooter Information'!$G$3-RANK(K47,K$4:K$78,1))<0,0,'Shooter Information'!$E$3-('Shooter Information'!$G$3-RANK(K47,K$4:K$78,1)))","v":0},0]
[45,{"$f":"'Shooter Information'!B50","v":0},{"$f":"'Shooter Information'!C50","v":0},null,null,null,null,null,null,null,0,{"$f":"IF('Shooter Information'!$E$3-('Shooter Information'!$G$3-RANK(K48,K$4:K$78,1))<0,0,'Shooter Information'!$E$3-('Shooter Information'!$G$3-RANK(K48,K$4:K$78,1)))","v":0},0]
[46,{"$f":"'Shooter Information'!B51","v":0},{"$f":"'Shooter Information'!C51","v":0},null,null,null,null,null,null,null,{"$f":"(D49*5)+E49-F49+(G49*10)+(H49*30)+(I49*999)+(J49*999.99)","v":0},{"$f":"IF('Shooter Information'!$E$3-('Shooter Information'!$G$3-RANK(K49,K$4:K$78,1))<0,0,'Shooter Information'!$E$3-('Shooter Information'!$G$3-RANK(K49,K$4:K$78,1)))","v":0},0]
[47,{"$f":"'Shooter Information'!B52","v":0},{"$f":"'Shooter Information'!C52","v":0},null,null,null,null,null,null,null,0,{"$f":"IF('Shooter Information'!$E$3-('Shooter Information'!$G$3-RANK(K50,K$4:K$78,1))<0,0,'Shooter Information'!$E$3-('Shooter Information'!$G$3-RANK(K50,K$4:K$78,1)))","v":0},0]
[48,{"$f":"'Shooter Information'!B53","v":0},{"$f":"'Shooter Information'!C53","v":0},null,null,null,null,null,null,null,0,{"$f":"IF('Shooter Information'!$E$3-('Shooter Information'!$G$3-RANK(K51,K$4:K$78,1))<0,0,'Shooter Information'!$E$3-('Shooter Information'!$G$3-RANK(K51,K$4:K$78,1)))","v":0},0]
[49,{"$f":"'Shooter Information'!B54","v":0},{"$f":"'Shooter Information'!C54","v":0},null,null,null,null,null,null,null,0,{"$f":"IF('Shooter Information'!$E$3-('Shooter Information'!$G$3-RANK(K52,K$4:K$78,1))<0,0,'Shooter Information'!$E$3-('Shooter Information'!$G$3-RANK(K52,K$4:K$78,1)))","v":0},0]
[50,{"$f":"'Shooter Information'!B55","v":0},{"$f":"'Shooter Information'!C55","v":0},null,null,null,null,null,null,null,0,{"$f":"IF('Shooter Information'!$E$3-('Shooter Information'!$G$3-RANK(K53,K$4:K$78,1))<0,0,'Shooter Information'!$E$3-('Shooter Information'!$G$3-RANK(K53,K$4:K$78,1)))","v":0},0]
[51,{"$f":"'Shooter Information'!B56","v":0},{"$f":"'Shooter Information'!C56","v":0},null,null,null,null,null,null,null,0,{"$f":"IF('Shooter Information'!$E$3-('Shooter Information'!$G$3-RANK(K54,K$4:K$78,1))<0,0,'Shooter Information'!$E$3-('Shooter Information'!$G$3-RANK(K54,K$4:K$78,1)))","v":0},0]
[52,{"$f":"'Shooter Information'!B57","v":0},{"$f":"'Shooter Information'!C57","v":0},null,null,null,null,null,null,null,0,{"$f":"IF('Shooter Information'!$E$3-('Shooter Information'!$G$3-RANK(K55,K$4:K$78,1))<0,0,'Shooter Information'!$E$3-('Shooter Information'!$G$3-RANK(K55,K$4:K$78,1)))","v":0},0]
[53,{"$f":"'Shooter Information'!B58","v":0},{"$f":"'Shooter Information'!C58","v":0},null,null,null,null,null,null,null,0,{"$f":"IF('Shooter Information'!$E$3-('Shooter Information'!$G$3-RANK(K56,K$4:K$78,1))<0,0,'Shooter Information'!$E$3-('Shooter Information'!$G$3-RANK(K56,K$4:K$78,1)))","v":0},0]
[54,{"$f":"'Shooter Information'!B59","v":0},{"$f":"'Shooter Information'!C59","v":0},null,null,null,null,null,null,null,0,{"$f":"IF('Shooter Information'!$E$3-('Shooter Information'!$G$3-RANK(K57,K$4:K$78,1))<0,0,'Shooter Information'!$E$3-('Shooter Information'!$G$3-RANK(K57,K$4:K$78,1)))","v":0},0]
[55,{"$f":"'Shooter Information'!B60","v":0},{"$f":"'Shooter Information'!C60","v":0},null,null,null,null,null,null,null,0,{"$f":"IF('Shooter Information'!$E$3-('Shooter Information'!$G$3-RANK(K58,K$4:K$78,1))<0,0,'Shooter Information'!$E$3-('Shooter Information'!$G$3-RANK(K58,K$4:K$78,1)))","v":0},0]
[56,{"$f":"'Shooter Information'!B61","v":0},{"$f":"'Shooter Information'!C61","v":0},null,null,null,null,null,null,null,0,{"$f":"IF('Shooter Information'!$E$3-('Shooter Information'!$G$3-RANK(K59,K$4:K$78,1))<0,0,'Shooter Information'!$E$3-('Shooter Information'!$G$3-RANK(K59,K$4:K$78,1)))","v":0},0]
[57,{"$f":"'Shooter Information'!B62","v":0},{"$f":"'Shooter Information'!C62","v":0},null,null,null,null,null,null,null,0,{"$f":"IF('Shooter Information'!$E$3-('Shooter Information'!$G$3-RANK(K60,K$4:K$78,1))<0,0,'Shooter Information'!$E$3-('Shooter Information'!$G$3-RANK(K60,K$4:K$78,1)))","v":0},0]
[58,{"$f":"'Shooter Information'!B63","v":0},{"$f":"'Shooter Information'!C63","v":0},null,null,null,null,null,null,null,0,{"$f":"IF('Shooter Information'!$E$3-('Shooter Information'!$G$3-RANK(K61,K$4:K$78,1))<0,0,'Shooter Information'!$E$3-('Shooter Information'!$G$3-RANK(K61,K$4:K$78,1)))","v":0},0]
[59,{"$f":"'Shooter Information'!B64","v":0},{"$f":"'Shooter Information'!C64","v":0},null,null,null,null,null,null,null,0,{"$f":"IF('Shooter Information'!$E$3-('Shooter Information'!$G$3-RANK(K62,K$4:K$78,1))<0,0,'Shooter Information'!$E$3-('Shooter Information'!$G$3-RANK(K62,K$4:K$78,1)))","v":0},0]
[60,{"$f":"'Shooter Information'!B65","v":0},{"$f":"'Shooter Information'!C65","v":0},null,null,null,null,null,null,null,0,{"$f":"IF('Shooter Information'!$E$3-('Shooter Information'!$G$3-RANK(K63,K$4:K$78,1))<0,0,'Shooter Information'!$E$3-('Shooter Information'!$G$3-RANK(K63,K$4:K$78,1)))","v":0},0]
[61,{"$f":"'Shooter Information'!B66","v":0},{"$f":"'Shooter Information'!C66","v":0},null,null,null,null,null,null,null,{"$f":"(D64*5)+E64-F64+(G64*10)+(H64*30)+(I64*999)+(J64*999.99)","v":0},{"$f":"IF('Shooter Information'!$E$3-('Shooter Information'!$G$3-RANK(K64,K$4:K$78,1))<0,0,'Shooter Information'!$E$3-('Shooter Information'!$G$3-RANK(K64,K$4:K$78,1)))","v":0},{"$f":"(SUM(D64+G64+H64+I64+J64))","v":0}]
[62,{"$f":"'Shooter Information'!B67","v":0},{"$f":"'Shooter Information'!C67","v":0},null,null,null,null,null,null,null,0,{"$f":"IF('Shooter Information'!$E$3-('Shooter Information'!$G$3-RANK(K65,K$4:K$78,1))<0,0,'Shooter Information'!$E$3-('Shooter Information'!$G$3-RANK(K65,K$4:K$78,1)))","v":0},0]
[63,{"$f":"'Shooter Information'!B68","v":0},{"$f":"'Shooter Information'!C68","v":0},null,null,null,null,null,null,null,0,{"$f":"IF('Shooter Information'!$E$3-('Shooter Information'!$G$3-RANK(K66,K$4:K$78,1))<0,0,'Shooter Information'!$E$3-('Shooter Information'!$G$3-RANK(K66,K$4:K$78,1)))","v":0},0]
[64,{"$f":"'Shooter Information'!B69","v":0},{"$f":"'Shooter Information'!C69","v":0},null,null,null,null,null,null,null,0,{"$f":"IF('Shooter Information'!$E$3-('Shooter Information'!$G$3-RANK(K67,K$4:K$78,1))<0,0,'Shooter Information'!$E$3-('Shooter Information'!$G$3-RANK(K67,K$4:K$78,1)))","v":0},0]
[65,{"$f":"'Shooter Information'!B70","v":0},{"$f":"'Shooter Information'!C70","v":0},null,null,null,null,null,null,null,0,{"$f":"IF('Shooter Information'!$E$3-('Shooter Information'!$G$3-RANK(K68,K$4:K$78,1))<0,0,'Shooter Information'!$E$3-('Shooter Information'!$G$3-RANK(K68,K$4:K$78,1)))","v":0},0]
[66,{"$f":"'Shooter Information'!B71","v":0},{"$f":"'Shooter Information'!C71","v":0},null,null,null,null,null,null,null,0,{"$f":"IF('Shooter Information'!$E$3-('Shooter Information'!$G$3-RANK(K69,K$4:K$78,1))<0,0,'Shooter Information'!$E$3-('Shooter Information'!$G$3-RANK(K69,K$4:K$78,1)))","v":0},0]
[67,{"$f":"'Shooter Information'!B72","v":0},{"$f":"'Shooter Information'!C72","v":0},null,null,null,null,null,null,null,0,{"$f":"IF('Shooter Information'!$E$3-('Shooter Information'!$G$3-RANK(K70,K$4:K$78,1))<0,0,'Shooter Information'!$E$3-('Shooter Information'!$G$3-RANK(K70,K$4:K$78,1)))","v":0},0]
[68,{"$f":"'Shooter Information'!B73","v":0},{"$f":"'Shooter Information'!C73","v":0},null,null,null,null,null,null,null,0,{"$f":"IF('Shooter Information'!$E$3-('Shooter Information'!$G$3-RANK(K71,K$4:K$78,1))<0,0,'Shooter Information'!$E$3-('Shooter Information'!$G$3-RANK(K71,K$4:K$78,1)))","v":0},0]
[69,{"$f":"'Shooter Information'!B74","v":0},{"$f":"'Shooter Information'!C74","v":0},null,null,null,null,null,null,null,0,{"$f":"IF('Shooter Information'!$E$3-('Shooter Information'!$G$3-RANK(K72,K$4:K$78,1))<0,0,'Shooter Information'!$E$3-('Shooter Information'!$G$3-RANK(K72,K$4:K$78,1)))","v":0},0]
[70,{"$f":"'Shooter Information'!B75","v":0},{"$f":"'Shooter Information'!C75","v":0},null,null,null,null,null,null,null,0,{"$f":"IF('Shooter Information'!$E$3-('Shooter Information'!$G$3-RANK(K73,K$4:K$78,1))<0,0,'Shooter Information'!$E$3-('Shooter Information'!$G$3-RANK(K73,K$4:K$78,1)))","v":0},0]
[71,{"$f":"'Shooter Information'!B76","v":0},{"$f":"'Shooter Information'!C76","v":0},null,null,null,null,null,null,null,0,{"$f":"IF('Shooter Information'!$E$3-('Shooter Information'!$G$3-RANK(K74,K$4:K$78,1))<0,0,'Shooter Information'!$E$3-('Shooter Information'!$G$3-RANK(K74,K$4:K$78,1)))","v":0},0]
[72,{"$f":"'Shooter Information'!B77","v":0},{"$f":"'Shooter Information'!C77","v":0},null,null,null,null,null,null,null,0,{"$f":"IF('Shooter Information'!$E$3-('Shooter Information'!$G$3-RANK(K75,K$4:K$78,1))<0,0,'Shooter Information'!$E$3-('Shooter Information'!$G$3-RANK(K75,K$4:K$78,1)))","v":0},0]
[73,{"$f":"'Shooter Information'!B78","v":0},{"$f":"'Shooter Information'!C78","v":0},null,null,null,null,null,null,null,0,{"$f":"IF('Shooter Information'!$E$3-('Shooter Information'!$G$3-RANK(K76,K$4:K$78,1))<0,0,'Shooter Information'!$E$3-('Shooter Information'!$G$3-RANK(K76,K$4:K$78,1)))","v":0},0]
[74,{"$f":"'Shooter Information'!B79","v":0},{"$f":"'Shooter Information'!C79","v":0},null,null,null,null,null,null,null,0,{"$f":"IF('Shooter Information'!$E$3-('Shooter Information'!$G$3-RANK(K77,K$4:K$78,1))<0,0,'Shooter Information'!$E$3-('Shooter Information'!$G$3-RANK(K77,K$4:K$78,1)))","v":0},0]
[75,{"$f":"'Shooter Information'!B80","v":0},{"$f":"'Shooter Information'!C80","v":0},null,null,null,null,null,null,null,0,{"$f":"IF('Shooter Information'!$E$3-('Shooter Information'!$G$3-RANK(K78,K$4:K$78,1))<0,0,'Shooter Information'!$E$3-('Shooter Information'!$G$3-RANK(K78,K$4:K$78,1)))","v":0},0]

{"sheet":"Stage 7","index":7,"n_rows":78,"n_cols":13,"rows_kept":78,"cut":false,"hidden":true,"merged":[]}
[null,"CAS SCORE SHEET"]
[null,"Stage 7"]
["Roster #","Shooter","Class","Misses","Raw Time","Bonus","10 Sec","30 Sec","DNF","DQ","Total","Rank","Penalties"]
[{"$f":"ROW()-3","v":1},{"$f":"'Shooter Information'!B6","v":"Striker"},{"$f":"'Shooter Information'!C6","v":"GF"},null,null,null,null,null,null,null,{"$f":"(D4*5)+E4-F4+(G4*10)+(H4*30)+(I4*999)+(J4*999.99)","v":0},{"$f":"IF('Shooter Information'!$E$3-('Shooter Information'!$G$3-RANK(K4,K$4:K$78,1))<0,0,'Shooter Information'!$E$3-('Shooter Information'!$G$3-RANK(K4,K$4:K$78,1)))","v":0},{"$f":"(SUM(D4+G4+H4+I4+J4))","v":0}]
[{"$f":"ROW()-3","v":2},{"$f":"'Shooter Information'!B7","v":"Lefty Spurmaker"},{"$f":"'Shooter Information'!C7","v":49},null,null,null,null,null,null,null,{"$f":"(D5*5)+E5-F5+(G5*10)+(H5*30)+(I5*999)+(J5*999.99)","v":0},{"$f":"IF('Shooter Information'!$E$3-('Shooter Information'!$G$3-RANK(K5,K$4:K$78,1))<0,0,'Shooter Information'!$E$3-('Shooter Information'!$G$3-RANK(K5,K$4:K$78,1)))","v":0},{"$f":"(SUM(D5+G5+H5+I5+J5))","v":0}]
[3,{"$f":"'Shooter Information'!B8","v":"Hotshod"},{"$f":"'Shooter Information'!C8","v":"W"},null,null,null,null,null,null,null,0,{"$f":"IF('Shooter Information'!$E$3-('Shooter Information'!$G$3-RANK(K6,K$4:K$78,1))<0,0,'Shooter Information'!$E$3-('Shooter Information'!$G$3-RANK(K6,K$4:K$78,1)))","v":0},0]
[4,{"$f":"'Shooter Information'!B9","v":"Swifty McDraw"},{"$f":"'Shooter Information'!C9","v":"SS"},null,null,null,null,null,null,null,0,{"$f":"IF('Shooter Information'!$E$3-('Shooter Information'!$G$3-RANK(K7,K$4:K$78,1))<0,0,'Shooter Information'!$E$3-('Shooter Information'!$G$3-RANK(K7,K$4:K$78,1)))","v":0},0]
[5,{"$f":"'Shooter Information'!B10","v":"Prairie City Slim"},{"$f":"'Shooter Information'!C10","v":"SS"},null,null,null,null,null,null,null,0,{"$f":"IF('Shooter Information'!$E$3-('Shooter Information'!$G$3-RANK(K8,K$4:K$78,1))<0,0,'Shooter Information'!$E$3-('Shooter Information'!$G$3-RANK(K8,K$4:K$78,1)))","v":0},0]
[6,{"$f":"'Shooter Information'!B11","v":"Enid City Kid"},{"$f":"'Shooter Information'!C11","v":"FC"},null,null,null,null,null,null,null,0,{"$f":"IF('Shooter Information'!$E$3-('Shooter Information'!$G$3-RANK(K9,K$4:K$78,1))<0,0,'Shooter Information'!$E$3-('Shooter Information'!$G$3-RANK(K9,K$4:K$78,1)))","v":0},0]
[7,{"$f":"'Shooter Information'!B12","v":"Cockroach"},{"$f":"'Shooter Information'!C12","v":"CB"},null,null,null,null,null,null,null,0,{"$f":"IF('Shooter Information'!$E$3-('Shooter Information'!$G$3-RANK(K10,K$4:K$78,1))<0,0,'Shooter Information'!$E$3-('Shooter Information'!$G$3-RANK(K10,K$4:K$78,1)))","v":0},0]
[8,{"$f":"'Shooter Information'!B13","v":"Kuba Kid"},{"$f":"'Shooter Information'!C13","v":"D"},null,null,null,null,null,null,null,0,{"$f":"IF('Shooter Information'!$E$3-('Shooter Information'!$G$3-RANK(K11,K$4:K$78,1))<0,0,'Shooter Information'!$E$3-('Shooter Information'!$G$3-RANK(K11,K$4:K$78,1)))","v":0},0]
[9,{"$f":"'Shooter Information'!B14","v":"Beartooth"},{"$f":"'Shooter Information'!C14","v":"S"},null,null,null,null,null,null,null,0,{"$f":"IF('Shooter Information'!$E$3-('Shooter Information'!$G$3-RANK(K12,K$4:K$78,1))<0,0,'Shooter Information'!$E$3-('Shooter Information'!$G$3-RANK(K12,K$4:K$78,1)))","v":0},0]
[10,{"$f":"'Shooter Information'!B15","v":"Slick Rick"},{"$f":"'Shooter Information'!C15","v":"S"},null,null,null,null,null,null,null,0,{"$f":"IF('Shooter Information'!$E$3-('Shooter Information'!$G$3-RANK(K13,K$4:K$78,1))<0,0,'Shooter Information'!$E$3-('Shooter Information'!$G$3-RANK(K13,K$4:K$78,1)))","v":0},0]
[11,{"$f":"'Shooter Information'!B16","v":"Windhorse Rider"},{"$f":"'Shooter Information'!C16","v":"GF"},null,null,null,null,null,null,null,0,{"$f":"IF('Shooter Information'!$E$3-('Shooter Information'!$G$3-RANK(K14,K$4:K$78,1))<0,0,'Shooter Information'!$E$3-('Shooter Information'!$G$3-RANK(K14,K$4:K$78,1)))","v":0},0]
[12,{"$f":"'Shooter Information'!B17","v":"Justice Jack"},{"$f":"'Shooter Information'!C17","v":"SS"},null,null,null,null,null,null,null,0,{"$f":"IF('Shooter Information'!$E$3-('Shooter Information'!$G$3-RANK(K15,K$4:K$78,1))<0,0,'Shooter Information'!$E$3-('Shooter Information'!$G$3-RANK(K15,K$4:K$78,1)))","v":0},0]
[13,{"$f":"'Shooter Information'!B18","v":"B. S. Walker"},{"$f":"'Shooter Information'!C18","v":49},null,null,null,null,null,null,null,0,{"$f":"IF('Shooter Information'!$E$3-('Shooter Information'!$G$3-RANK(K16,K$4:K$78,1))<0,0,'Shooter Information'!$E$3-('Shooter Information'!$G$3-RANK(K16,K$4:K$78,1)))","v":0},0]
[14,{"$f":"'Shooter Information'!B19","v":"Red Cavanaugh"},{"$f":"'Shooter Information'!C19","v":49},null,null,null,null,null,null,null,0,{"$f":"IF('Shooter Information'!$E$3-('Shooter Information'!$G$3-RANK(K17,K$4:K$78,1))<0,0,'Shooter Information'!$E$3-('Shooter Information'!$G$3-RANK(K17,K$4:K$78,1)))","v":0},0]
[15,{"$f":"'Shooter Information'!B20","v":"Deringer Dan"},{"$f":"'Shooter Information'!C20","v":49},null,null,null,null,null,null,null,0,{"$f":"IF('Shooter Information'!$E$3-('Shooter Information'!$G$3-RANK(K18,K$4:K$78,1))<0,0,'Shooter Information'!$E$3-('Shooter Information'!$G$3-RANK(K18,K$4:K$78,1)))","v":0},0]
[16,{"$f":"'Shooter Information'!B21","v":0},{"$f":"'Shooter Information'!C21","v":0},null,null,null,null,null,null,null,0,{"$f":"IF('Shooter Information'!$E$3-('Shooter Information'!$G$3-RANK(K19,K$4:K$78,1))<0,0,'Shooter Information'!$E$3-('Shooter Information'!$G$3-RANK(K19,K$4:K$78,1)))","v":0},0]
[17,{"$f":"'Shooter Information'!B22","v":0},{"$f":"'Shooter Information'!C22","v":0},null,null,null,null,null,null,null,0,{"$f":"IF('Shooter Information'!$E$3-('Shooter Information'!$G$3-RANK(K20,K$4:K$78,1))<0,0,'Shooter Information'!$E$3-('Shooter Information'!$G$3-RANK(K20,K$4:K$78,1)))","v":0},0]
[18,{"$f":"'Shooter Information'!B23","v":0},{"$f":"'Shooter Information'!C23","v":0},null,null,null,null,null,null,null,0,{"$f":"IF('Shooter Information'!$E$3-('Shooter Information'!$G$3-RANK(K21,K$4:K$78,1))<0,0,'Shooter Information'!$E$3-('Shooter Information'!$G$3-RANK(K21,K$4:K$78,1)))","v":0},0]
[19,{"$f":"'Shooter Information'!B24","v":0},{"$f":"'Shooter Information'!C24","v":0},null,null,null,null,null,null,null,0,{"$f":"IF('Shooter Information'!$E$3-('Shooter Information'!$G$3-RANK(K22,K$4:K$78,1))<0,0,'Shooter Information'!$E$3-('Shooter Information'!$G$3-RANK(K22,K$4:K$78,1)))","v":0},0]
[20,{"$f":"'Shooter Information'!B25","v":0},{"$f":"'Shooter Information'!C25","v":0},null,null,null,null,null,null,null,0,{"$f":"IF('Shooter Information'!$E$3-('Shooter Information'!$G$3-RANK(K23,K$4:K$78,1))<0,0,'Shooter Information'!$E$3-('Shooter Information'!$G$3-RANK(K23,K$4:K$78,1)))","v":0},0]
[21,{"$f":"'Shooter Information'!B26","v":0},{"$f":"'Shooter Information'!C26","v":0},null,null,null,null,null,null,null,0,{"$f":"IF('Shooter Information'!$E$3-('Shooter Information'!$G$3-RANK(K24,K$4:K$78,1))<0,0,'Shooter Information'!$E$3-('Shooter Information'!$G$3-RANK(K24,K$4:K$78,1)))","v":0},0]
[22,{"$f":"'Shooter Information'!B27","v":0},{"$f":"'Shooter Information'!C27","v":0},null,null,null,null,null,null,null,0,{"$f":"IF('Shooter Information'!$E$3-('Shooter Information'!$G$3-RANK(K25,K$4:K$78,1))<0,0,'Shooter Information'!$E$3-('Shooter Information'!$G$3-RANK(K25,K$4:K$78,1)))","v":0},0]
[23,{"$f":"'Shooter Information'!B28","v":0},{"$f":"'Shooter Information'!C28","v":0},null,null,null,null,null,null,null,0,{"$f":"IF('Shooter Information'!$E$3-('Shooter Information'!$G$3-RANK(K26,K$4:K$78,1))<0,0,'Shooter Information'!$E$3-('Shooter Information'!$G$3-RANK(K26,K$4:K$78,1)))","v":0},0]
[24,{"$f":"'Shooter Information'!B29","v":0},{"$f":"'Shooter Information'!C29","v":0},null,null,null,null,null,null,null,0,{"$f":"IF('Shooter Information'!$E$3-('Shooter Information'!$G$3-RANK(K27,K$4:K$78,1))<0,0,'Shooter Information'!$E$3-('Shooter Information'!$G$3-RANK(K27,K$4:K$78,1)))","v":0},0]
[25,{"$f":"'Shooter Information'!B30","v":0},{"$f":"'Shooter Information'!C30","v":0},null,null,null,null,null,null,null,0,{"$f":"IF('Shooter Information'!$E$3-('Shooter Information'!$G$3-RANK(K28,K$4:K$78,1))<0,0,'Shooter Information'!$E$3-('Shooter Information'!$G$3-RANK(K28,K$4:K$78,1)))","v":0},0]
[26,{"$f":"'Shooter Information'!B31","v":0},{"$f":"'Shooter Information'!C31","v":0},null,null,null,null,null,null,null,0,{"$f":"IF('Shooter Information'!$E$3-('Shooter Information'!$G$3-RANK(K29,K$4:K$78,1))<0,0,'Shooter Information'!$E$3-('Shooter Information'!$G$3-RANK(K29,K$4:K$78,1)))","v":0},0]
[27,{"$f":"'Shooter Information'!B32","v":0},{"$f":"'Shooter Information'!C32","v":0},null,null,null,null,null,null,null,0,{"$f":"IF('Shooter Information'!$E$3-('Shooter Information'!$G$3-RANK(K30,K$4:K$78,1))<0,0,'Shooter Information'!$E$3-('Shooter Information'!$G$3-RANK(K30,K$4:K$78,1)))","v":0},0]
[28,{"$f":"'Shooter Information'!B33","v":0},{"$f":"'Shooter Information'!C33","v":0},null,null,null,null,null,null,null,0,{"$f":"IF('Shooter Information'!$E$3-('Shooter Information'!$G$3-RANK(K31,K$4:K$78,1))<0,0,'Shooter Information'!$E$3-('Shooter Information'!$G$3-RANK(K31,K$4:K$78,1)))","v":0},0]
[29,{"$f":"'Shooter Information'!B34","v":0},{"$f":"'Shooter Information'!C34","v":0},null,null,null,null,null,null,null,0,{"$f":"IF('Shooter Information'!$E$3-('Shooter Information'!$G$3-RANK(K32,K$4:K$78,1))<0,0,'Shooter Information'!$E$3-('Shooter Information'!$G$3-RANK(K32,K$4:K$78,1)))","v":0},0]
[30,{"$f":"'Shooter Information'!B35","v":0},{"$f":"'Shooter Information'!C35","v":0},null,null,null,null,null,null,null,0,{"$f":"IF('Shooter Information'!$E$3-('Shooter Information'!$G$3-RANK(K33,K$4:K$78,1))<0,0,'Shooter Information'!$E$3-('Shooter Information'!$G$3-RANK(K33,K$4:K$78,1)))","v":0},0]
[31,{"$f":"'Shooter Information'!B36","v":0},{"$f":"'Shooter Information'!C36","v":0},null,null,null,null,null,null,null,0,{"$f":"IF('Shooter Information'!$E$3-('Shooter Information'!$G$3-RANK(K34,K$4:K$78,1))<0,0,'Shooter Information'!$E$3-('Shooter Information'!$G$3-RANK(K34,K$4:K$78,1)))","v":0},0]
[32,{"$f":"'Shooter Information'!B37","v":0},{"$f":"'Shooter Information'!C37","v":0},null,null,null,null,null,null,null,0,{"$f":"IF('Shooter Information'!$E$3-('Shooter Information'!$G$3-RANK(K35,K$4:K$78,1))<0,0,'Shooter Information'!$E$3-('Shooter Information'!$G$3-RANK(K35,K$4:K$78,1)))","v":0},0]
[33,{"$f":"'Shooter Information'!B38","v":0},{"$f":"'Shooter Information'!C38","v":0},null,null,null,null,null,null,null,0,{"$f":"IF('Shooter Information'!$E$3-('Shooter Information'!$G$3-RANK(K36,K$4:K$78,1))<0,0,'Shooter Information'!$E$3-('Shooter Information'!$G$3-RANK(K36,K$4:K$78,1)))","v":0},0]
[34,{"$f":"'Shooter Information'!B39","v":0},{"$f":"'Shooter Information'!C39","v":0},null,null,null,null,null,null,null,0,{"$f":"IF('Shooter Information'!$E$3-('Shooter Information'!$G$3-RANK(K37,K$4:K$78,1))<0,0,'Shooter Information'!$E$3-('Shooter Information'!$G$3-RANK(K37,K$4:K$78,1)))","v":0},0]
[35,{"$f":"'Shooter Information'!B40","v":0},{"$f":"'Shooter Information'!C40","v":0},null,null,null,null,null,null,null,0,{"$f":"IF('Shooter Information'!$E$3-('Shooter Information'!$G$3-RANK(K38,K$4:K$78,1))<0,0,'Shooter Information'!$E$3-('Shooter Information'!$G$3-RANK(K38,K$4:K$78,1)))","v":0},0]
[36,{"$f":"'Shooter Information'!B41","v":0},{"$f":"'Shooter Information'!C41","v":0},null,null,null,null,null,null,null,0,{"$f":"IF('Shooter Information'!$E$3-('Shooter Information'!$G$3-RANK(K39,K$4:K$78,1))<0,0,'Shooter Information'!$E$3-('Shooter Information'!$G$3-RANK(K39,K$4:K$78,1)))","v":0},0]
[37,{"$f":"'Shooter Information'!B42","v":0},{"$f":"'Shooter Information'!C42","v":0},null,null,null,null,null,null,null,0,{"$f":"IF('Shooter Information'!$E$3-('Shooter Information'!$G$3-RANK(K40,K$4:K$78,1))<0,0,'Shooter Information'!$E$3-('Shooter Information'!$G$3-RANK(K40,K$4:K$78,1)))","v":0},0]
[38,{"$f":"'Shooter Information'!B43","v":0},{"$f":"'Shooter Information'!C43","v":0},null,null,null,null,null,null,null,0,{"$f":"IF('Shooter Information'!$E$3-('Shooter Information'!$G$3-RANK(K41,K$4:K$78,1))<0,0,'Shooter Information'!$E$3-('Shooter Information'!$G$3-RANK(K41,K$4:K$78,1)))","v":0},0]
[39,{"$f":"'Shooter Information'!B44","v":0},{"$f":"'Shooter Information'!C44","v":0},null,null,null,null,null,null,null,0,{"$f":"IF('Shooter Information'!$E$3-('Shooter Information'!$G$3-RANK(K42,K$4:K$78,1))<0,0,'Shooter Information'!$E$3-('Shooter Information'!$G$3-RANK(K42,K$4:K$78,1)))","v":0},0]
[40,{"$f":"'Shooter Information'!B45","v":0},{"$f":"'Shooter Information'!C45","v":0},null,null,null,null,null,null,null,0,{"$f":"IF('Shooter Information'!$E$3-('Shooter Information'!$G$3-RANK(K43,K$4:K$78,1))<0,0,'Shooter Information'!$E$3-('Shooter Information'!$G$3-RANK(K43,K$4:K$78,1)))","v":0},0]
[41,{"$f":"'Shooter Information'!B46","v":0},{"$f":"'Shooter Information'!C46","v":0},null,null,null,null,null,null,null,0,{"$f":"IF('Shooter Information'!$E$3-('Shooter Information'!$G$3-RANK(K44,K$4:K$78,1))<0,0,'Shooter Information'!$E$3-('Shooter Information'!$G$3-RANK(K44,K$4:K$78,1)))","v":0},0]
[42,{"$f":"'Shooter Information'!B47","v":0},{"$f":"'Shooter Information'!C47","v":0},null,null,null,null,null,null,null,0,{"$f":"IF('Shooter Information'!$E$3-('Shooter Information'!$G$3-RANK(K45,K$4:K$78,1))<0,0,'Shooter Information'!$E$3-('Shooter Information'!$G$3-RANK(K45,K$4:K$78,1)))","v":0},0]
[43,{"$f":"'Shooter Information'!B48","v":0},{"$f":"'Shooter Information'!C48","v":0},null,null,null,null,null,null,null,0,{"$f":"IF('Shooter Information'!$E$3-('Shooter Information'!$G$3-RANK(K46,K$4:K$78,1))<0,0,'Shooter Information'!$E$3-('Shooter Information'!$G$3-RANK(K46,K$4:K$78,1)))","v":0},0]
[44,{"$f":"'Shooter Information'!B49","v":0},{"$f":"'Shooter Information'!C49","v":0},null,null,null,null,null,null,null,0,{"$f":"IF('Shooter Information'!$E$3-('Shooter Information'!$G$3-RANK(K47,K$4:K$78,1))<0,0,'Shooter Information'!$E$3-('Shooter Information'!$G$3-RANK(K47,K$4:K$78,1)))","v":0},0]
[45,{"$f":"'Shooter Information'!B50","v":0},{"$f":"'Shooter Information'!C50","v":0},null,null,null,null,null,null,null,0,{"$f":"IF('Shooter Information'!$E$3-('Shooter Information'!$G$3-RANK(K48,K$4:K$78,1))<0,0,'Shooter Information'!$E$3-('Shooter Information'!$G$3-RANK(K48,K$4:K$78,1)))","v":0},0]
[46,{"$f":"'Shooter Information'!B51","v":0},{"$f":"'Shooter Information'!C51","v":0},null,null,null,null,null,null,null,0,{"$f":"IF('Shooter Information'!$E$3-('Shooter Information'!$G$3-RANK(K49,K$4:K$78,1))<0,0,'Shooter Information'!$E$3-('Shooter Information'!$G$3-RANK(K49,K$4:K$78,1)))","v":0},0]
[47,{"$f":"'Shooter Information'!B52","v":0},{"$f":"'Shooter Information'!C52","v":0},null,null,null,null,null,null,null,0,{"$f":"IF('Shooter Information'!$E$3-('Shooter Information'!$G$3-RANK(K50,K$4:K$78,1))<0,0,'Shooter Information'!$E$3-('Shooter Information'!$G$3-RANK(K50,K$4:K$78,1)))","v":0},0]
[48,{"$f":"'Shooter Information'!B53","v":0},{"$f":"'Shooter Information'!C53","v":0},null,null,null,null,null,null,null,0,{"$f":"IF('Shooter Information'!$E$3-('Shooter Information'!$G$3-RANK(K51,K$4:K$78,1))<0,0,'Shooter Information'!$E$3-('Shooter Information'!$G$3-RANK(K51,K$4:K$78,1)))","v":0},0]
[49,{"$f":"'Shooter Information'!B54","v":0},{"$f":"'Shooter Information'!C54","v":0},null,null,null,null,null,null,null,0,{"$f":"IF('Shooter Information'!$E$3-('Shooter Information'!$G$3-RANK(K52,K$4:K$78,1))<0,0,'Shooter Information'!$E$3-('Shooter Information'!$G$3-RANK(K52,K$4:K$78,1)))","v":0},0]
[50,{"$f":"'Shooter Information'!B55","v":0},{"$f":"'Shooter Information'!C55","v":0},null,null,null,null,null,null,null,0,{"$f":"IF('Shooter Information'!$E$3-('Shooter Information'!$G$3-RANK(K53,K$4:K$78,1))<0,0,'Shooter Information'!$E$3-('Shooter Information'!$G$3-RANK(K53,K$4:K$78,1)))","v":0},0]
[51,{"$f":"'Shooter Information'!B56","v":0},{"$f":"'Shooter Information'!C56","v":0},null,null,null,null,null,null,null,0,{"$f":"IF('Shooter Information'!$E$3-('Shooter Information'!$G$3-RANK(K54,K$4:K$78,1))<0,0,'Shooter Information'!$E$3-('Shooter Information'!$G$3-RANK(K54,K$4:K$78,1)))","v":0},0]
[52,{"$f":"'Shooter Information'!B57","v":0},{"$f":"'Shooter Information'!C57","v":0},null,null,null,null,null,null,null,0,{"$f":"IF('Shooter Information'!$E$3-('Shooter Information'!$G$3-RANK(K55,K$4:K$78,1))<0,0,'Shooter Information'!$E$3-('Shooter Information'!$G$3-RANK(K55,K$4:K$78,1)))","v":0},0]
[53,{"$f":"'Shooter Information'!B58","v":0},{"$f":"'Shooter Information'!C58","v":0},null,null,null,null,null,null,null,0,{"$f":"IF('Shooter Information'!$E$3-('Shooter Information'!$G$3-RANK(K56,K$4:K$78,1))<0,0,'Shooter Information'!$E$3-('Shooter Information'!$G$3-RANK(K56,K$4:K$78,1)))","v":0},0]
[54,{"$f":"'Shooter Information'!B59","v":0},{"$f":"'Shooter Information'!C59","v":0},null,null,null,null,null,null,null,0,{"$f":"IF('Shooter Information'!$E$3-('Shooter Information'!$G$3-RANK(K57,K$4:K$78,1))<0,0,'Shooter Information'!$E$3-('Shooter Information'!$G$3-RANK(K57,K$4:K$78,1)))","v":0},0]
[55,{"$f":"'Shooter Information'!B60","v":0},{"$f":"'Shooter Information'!C60","v":0},null,null,null,null,null,null,null,0,{"$f":"IF('Shooter Information'!$E$3-('Shooter Information'!$G$3-RANK(K58,K$4:K$78,1))<0,0,'Shooter Information'!$E$3-('Shooter Information'!$G$3-RANK(K58,K$4:K$78,1)))","v":0},0]
[56,{"$f":"'Shooter Information'!B61","v":0},{"$f":"'Shooter Information'!C61","v":0},null,null,null,null,null,null,null,0,{"$f":"IF('Shooter Information'!$E$3-('Shooter Information'!$G$3-RANK(K59,K$4:K$78,1))<0,0,'Shooter Information'!$E$3-('Shooter Information'!$G$3-RANK(K59,K$4:K$78,1)))","v":0},0]
[57,{"$f":"'Shooter Information'!B62","v":0},{"$f":"'Shooter Information'!C62","v":0},null,null,null,null,null,null,null,0,{"$f":"IF('Shooter Information'!$E$3-('Shooter Information'!$G$3-RANK(K60,K$4:K$78,1))<0,0,'Shooter Information'!$E$3-('Shooter Information'!$G$3-RANK(K60,K$4:K$78,1)))","v":0},0]
[58,{"$f":"'Shooter Information'!B63","v":0},{"$f":"'Shooter Information'!C63","v":0},null,null,null,null,null,null,null,0,{"$f":"IF('Shooter Information'!$E$3-('Shooter Information'!$G$3-RANK(K61,K$4:K$78,1))<0,0,'Shooter Information'!$E$3-('Shooter Information'!$G$3-RANK(K61,K$4:K$78,1)))","v":0},0]
[59,{"$f":"'Shooter Information'!B64","v":0},{"$f":"'Shooter Information'!C64","v":0},null,null,null,null,null,null,null,0,{"$f":"IF('Shooter Information'!$E$3-('Shooter Information'!$G$3-RANK(K62,K$4:K$78,1))<0,0,'Shooter Information'!$E$3-('Shooter Information'!$G$3-RANK(K62,K$4:K$78,1)))","v":0},0]
[60,{"$f":"'Shooter Information'!B65","v":0},{"$f":"'Shooter Information'!C65","v":0},null,null,null,null,null,null,null,0,{"$f":"IF('Shooter Information'!$E$3-('Shooter Information'!$G$3-RANK(K63,K$4:K$78,1))<0,0,'Shooter Information'!$E$3-('Shooter Information'!$G$3-RANK(K63,K$4:K$78,1)))","v":0},0]
[61,{"$f":"'Shooter Information'!B66","v":0},{"$f":"'Shooter Information'!C66","v":0},null,null,null,null,null,null,null,0,{"$f":"IF('Shooter Information'!$E$3-('Shooter Information'!$G$3-RANK(K64,K$4:K$78,1))<0,0,'Shooter Information'!$E$3-('Shooter Information'!$G$3-RANK(K64,K$4:K$78,1)))","v":0},0]
[62,{"$f":"'Shooter Information'!B67","v":0},{"$f":"'Shooter Information'!C67","v":0},null,null,null,null,null,null,null,0,{"$f":"IF('Shooter Information'!$E$3-('Shooter Information'!$G$3-RANK(K65,K$4:K$78,1))<0,0,'Shooter Information'!$E$3-('Shooter Information'!$G$3-RANK(K65,K$4:K$78,1)))","v":0},0]
[63,{"$f":"'Shooter Information'!B68","v":0},{"$f":"'Shooter Information'!C68","v":0},null,null,null,null,null,null,null,0,{"$f":"IF('Shooter Information'!$E$3-('Shooter Information'!$G$3-RANK(K66,K$4:K$78,1))<0,0,'Shooter Information'!$E$3-('Shooter Information'!$G$3-RANK(K66,K$4:K$78,1)))","v":0},0]
[64,{"$f":"'Shooter Information'!B69","v":0},{"$f":"'Shooter Information'!C69","v":0},null,null,null,null,null,null,null,0,{"$f":"IF('Shooter Information'!$E$3-('Shooter Information'!$G$3-RANK(K67,K$4:K$78,1))<0,0,'Shooter Information'!$E$3-('Shooter Information'!$G$3-RANK(K67,K$4:K$78,1)))","v":0},0]
[65,{"$f":"'Shooter Information'!B70","v":0},{"$f":"'Shooter Information'!C70","v":0},null,null,null,null,null,null,null,0,{"$f":"IF('Shooter Information'!$E$3-('Shooter Information'!$G$3-RANK(K68,K$4:K$78,1))<0,0,'Shooter Information'!$E$3-('Shooter Information'!$G$3-RANK(K68,K$4:K$78,1)))","v":0},0]
[66,{"$f":"'Shooter Information'!B71","v":0},{"$f":"'Shooter Information'!C71","v":0},null,null,null,null,null,null,null,{"$f":"(D69*5)+E69-F69+(G69*10)+(H69*30)+(I69*999)+(J69*999.99)","v":0},{"$f":"IF('Shooter Information'!$E$3-('Shooter Information'!$G$3-RANK(K69,K$4:K$78,1))<0,0,'Shooter Information'!$E$3-('Shooter Information'!$G$3-RANK(K69,K$4:K$78,1)))","v":0},{"$f":"(SUM(D69+G69+H69+I69+J69))","v":0}]
[67,{"$f":"'Shooter Information'!B72","v":0},{"$f":"'Shooter Information'!C72","v":0},null,null,null,null,null,null,null,0,{"$f":"IF('Shooter Information'!$E$3-('Shooter Information'!$G$3-RANK(K70,K$4:K$78,1))<0,0,'Shooter Information'!$E$3-('Shooter Information'!$G$3-RANK(K70,K$4:K$78,1)))","v":0},0]
[68,{"$f":"'Shooter Information'!B73","v":0},{"$f":"'Shooter Information'!C73","v":0},null,null,null,null,null,null,null,0,{"$f":"IF('Shooter Information'!$E$3-('Shooter Information'!$G$3-RANK(K71,K$4:K$78,1))<0,0,'Shooter Information'!$E$3-('Shooter Information'!$G$3-RANK(K71,K$4:K$78,1)))","v":0},0]
[69,{"$f":"'Shooter Information'!B74","v":0},{"$f":"'Shooter Information'!C74","v":0},null,null,null,null,null,null,null,0,{"$f":"IF('Shooter Information'!$E$3-('Shooter Information'!$G$3-RANK(K72,K$4:K$78,1))<0,0,'Shooter Information'!$E$3-('Shooter Information'!$G$3-RANK(K72,K$4:K$78,1)))","v":0},0]
[70,{"$f":"'Shooter Information'!B75","v":0},{"$f":"'Shooter Information'!C75","v":0},null,null,null,null,null,null,null,0,{"$f":"IF('Shooter Information'!$E$3-('Shooter Information'!$G$3-RANK(K73,K$4:K$78,1))<0,0,'Shooter Information'!$E$3-('Shooter Information'!$G$3-RANK(K73,K$4:K$78,1)))","v":0},0]
[71,{"$f":"'Shooter Information'!B76","v":0},{"$f":"'Shooter Information'!C76","v":0},null,null,null,null,null,null,null,0,{"$f":"IF('Shooter Information'!$E$3-('Shooter Information'!$G$3-RANK(K74,K$4:K$78,1))<0,0,'Shooter Information'!$E$3-('Shooter Information'!$G$3-RANK(K74,K$4:K$78,1)))","v":0},0]
[72,{"$f":"'Shooter Information'!B77","v":0},{"$f":"'Shooter Information'!C77","v":0},null,null,null,null,null,null,null,0,{"$f":"IF('Shooter Information'!$E$3-('Shooter Information'!$G$3-RANK(K75,K$4:K$78,1))<0,0,'Shooter Information'!$E$3-('Shooter Information'!$G$3-RANK(K75,K$4:K$78,1)))","v":0},0]
[73,{"$f":"'Shooter Information'!B78","v":0},{"$f":"'Shooter Information'!C78","v":0},null,null,null,null,null,null,null,0,{"$f":"IF('Shooter Information'!$E$3-('Shooter Information'!$G$3-RANK(K76,K$4:K$78,1))<0,0,'Shooter Information'!$E$3-('Shooter Information'!$G$3-RANK(K76,K$4:K$78,1)))","v":0},0]
[74,{"$f":"'Shooter Information'!B79","v":0},{"$f":"'Shooter Information'!C79","v":0},null,null,null,null,null,null,null,0,{"$f":"IF('Shooter Information'!$E$3-('Shooter Information'!$G$3-RANK(K77,K$4:K$78,1))<0,0,'Shooter Information'!$E$3-('Shooter Information'!$G$3-RANK(K77,K$4:K$78,1)))","v":0},0]
[75,{"$f":"'Shooter Information'!B80","v":0},{"$f":"'Shooter Information'!C80","v":0},null,null,null,null,null,null,null,0,{"$f":"IF('Shooter Information'!$E$3-('Shooter Information'!$G$3-RANK(K78,K$4:K$78,1))<0,0,'Shooter Information'!$E$3-('Shooter Information'!$G$3-RANK(K78,K$4:K$78,1)))","v":0},0]

{"sheet":"Stage 8","index":8,"n_rows":78,"n_cols":13,"rows_kept":78,"cut":false,"hidden":true,"merged":[]}
[null,"CAS SCORE SHEET"]
[null,"Stage 8"]
["Roster #","Shooter","Class","Misses","Raw Time","Bonus","10 Sec","30 Sec","DNF","DQ","Total","Rank","Penalties"]
[{"$f":"ROW()-3","v":1},{"$f":"'Shooter Information'!B6","v":"Striker"},{"$f":"'Shooter Information'!C6","v":"GF"},null,null,null,null,null,null,null,{"$f":"(D4*5)+E4-F4+(G4*10)+(H4*30)+(I4*999)+(J4*999.99)","v":0},{"$f":"IF('Shooter Information'!$E$3-('Shooter Information'!$G$3-RANK(K4,K$4:K$78,1))<0,0,'Shooter Information'!$E$3-('Shooter Information'!$G$3-RANK(K4,K$4:K$78,1)))","v":0},{"$f":"(SUM(D4+G4+H4+I4+J4))","v":0}]
[{"$f":"ROW()-3","v":2},{"$f":"'Shooter Information'!B7","v":"Lefty Spurmaker"},{"$f":"'Shooter Information'!C7","v":49},null,null,null,null,null,null,null,{"$f":"(D5*5)+E5-F5+(G5*10)+(H5*30)+(I5*999)+(J5*999.99)","v":0},{"$f":"IF('Shooter Information'!$E$3-('Shooter Information'!$G$3-RANK(K5,K$4:K$78,1))<0,0,'Shooter Information'!$E$3-('Shooter Information'!$G$3-RANK(K5,K$4:K$78,1)))","v":0},{"$f":"(SUM(D5+G5+H5+I5+J5))","v":0}]
[3,{"$f":"'Shooter Information'!B8","v":"Hotshod"},{"$f":"'Shooter Information'!C8","v":"W"},null,null,null,null,null,null,null,0,{"$f":"IF('Shooter Information'!$E$3-('Shooter Information'!$G$3-RANK(K6,K$4:K$78,1))<0,0,'Shooter Information'!$E$3-('Shooter Information'!$G$3-RANK(K6,K$4:K$78,1)))","v":0},0]
[4,{"$f":"'Shooter Information'!B9","v":"Swifty McDraw"},{"$f":"'Shooter Information'!C9","v":"SS"},null,null,null,null,null,null,null,0,{"$f":"IF('Shooter Information'!$E$3-('Shooter Information'!$G$3-RANK(K7,K$4:K$78,1))<0,0,'Shooter Information'!$E$3-('Shooter Information'!$G$3-RANK(K7,K$4:K$78,1)))","v":0},0]
[5,{"$f":"'Shooter Information'!B10","v":"Prairie City Slim"},{"$f":"'Shooter Information'!C10","v":"SS"},null,null,null,null,null,null,null,0,{"$f":"IF('Shooter Information'!$E$3-('Shooter Information'!$G$3-RANK(K8,K$4:K$78,1))<0,0,'Shooter Information'!$E$3-('Shooter Information'!$G$3-RANK(K8,K$4:K$78,1)))","v":0},0]
[6,{"$f":"'Shooter Information'!B11","v":"Enid City Kid"},{"$f":"'Shooter Information'!C11","v":"FC"},null,null,null,null,null,null,null,0,{"$f":"IF('Shooter Information'!$E$3-('Shooter Information'!$G$3-RANK(K9,K$4:K$78,1))<0,0,'Shooter Information'!$E$3-('Shooter Information'!$G$3-RANK(K9,K$4:K$78,1)))","v":0},0]
[7,{"$f":"'Shooter Information'!B12","v":"Cockroach"},{"$f":"'Shooter Information'!C12","v":"CB"},null,null,null,null,null,null,null,0,{"$f":"IF('Shooter Information'!$E$3-('Shooter Information'!$G$3-RANK(K10,K$4:K$78,1))<0,0,'Shooter Information'!$E$3-('Shooter Information'!$G$3-RANK(K10,K$4:K$78,1)))","v":0},0]
[8,{"$f":"'Shooter Information'!B13","v":"Kuba Kid"},{"$f":"'Shooter Information'!C13","v":"D"},null,null,null,null,null,null,null,0,{"$f":"IF('Shooter Information'!$E$3-('Shooter Information'!$G$3-RANK(K11,K$4:K$78,1))<0,0,'Shooter Information'!$E$3-('Shooter Information'!$G$3-RANK(K11,K$4:K$78,1)))","v":0},0]
[9,{"$f":"'Shooter Information'!B14","v":"Beartooth"},{"$f":"'Shooter Information'!C14","v":"S"},null,null,null,null,null,null,null,0,{"$f":"IF('Shooter Information'!$E$3-('Shooter Information'!$G$3-RANK(K12,K$4:K$78,1))<0,0,'Shooter Information'!$E$3-('Shooter Information'!$G$3-RANK(K12,K$4:K$78,1)))","v":0},0]
[10,{"$f":"'Shooter Information'!B15","v":"Slick Rick"},{"$f":"'Shooter Information'!C15","v":"S"},null,null,null,null,null,null,null,0,{"$f":"IF('Shooter Information'!$E$3-('Shooter Information'!$G$3-RANK(K13,K$4:K$78,1))<0,0,'Shooter Information'!$E$3-('Shooter Information'!$G$3-RANK(K13,K$4:K$78,1)))","v":0},0]
[11,{"$f":"'Shooter Information'!B16","v":"Windhorse Rider"},{"$f":"'Shooter Information'!C16","v":"GF"},null,null,null,null,null,null,null,0,{"$f":"IF('Shooter Information'!$E$3-('Shooter Information'!$G$3-RANK(K14,K$4:K$78,1))<0,0,'Shooter Information'!$E$3-('Shooter Information'!$G$3-RANK(K14,K$4:K$78,1)))","v":0},0]
[12,{"$f":"'Shooter Information'!B17","v":"Justice Jack"},{"$f":"'Shooter Information'!C17","v":"SS"},null,null,null,null,null,null,null,0,{"$f":"IF('Shooter Information'!$E$3-('Shooter Information'!$G$3-RANK(K15,K$4:K$78,1))<0,0,'Shooter Information'!$E$3-('Shooter Information'!$G$3-RANK(K15,K$4:K$78,1)))","v":0},0]
[13,{"$f":"'Shooter Information'!B18","v":"B. S. Walker"},{"$f":"'Shooter Information'!C18","v":49},null,null,null,null,null,null,null,0,{"$f":"IF('Shooter Information'!$E$3-('Shooter Information'!$G$3-RANK(K16,K$4:K$78,1))<0,0,'Shooter Information'!$E$3-('Shooter Information'!$G$3-RANK(K16,K$4:K$78,1)))","v":0},0]
[14,{"$f":"'Shooter Information'!B19","v":"Red Cavanaugh"},{"$f":"'Shooter Information'!C19","v":49},null,null,null,null,null,null,null,0,{"$f":"IF('Shooter Information'!$E$3-('Shooter Information'!$G$3-RANK(K17,K$4:K$78,1))<0,0,'Shooter Information'!$E$3-('Shooter Information'!$G$3-RANK(K17,K$4:K$78,1)))","v":0},0]
[15,{"$f":"'Shooter Information'!B20","v":"Deringer Dan"},{"$f":"'Shooter Information'!C20","v":49},null,null,null,null,null,null,null,0,{"$f":"IF('Shooter Information'!$E$3-('Shooter Information'!$G$3-RANK(K18,K$4:K$78,1))<0,0,'Shooter Information'!$E$3-('Shooter Information'!$G$3-RANK(K18,K$4:K$78,1)))","v":0},0]
[16,{"$f":"'Shooter Information'!B21","v":0},{"$f":"'Shooter Information'!C21","v":0},null,null,null,null,null,null,null,0,{"$f":"IF('Shooter Information'!$E$3-('Shooter Information'!$G$3-RANK(K19,K$4:K$78,1))<0,0,'Shooter Information'!$E$3-('Shooter Information'!$G$3-RANK(K19,K$4:K$78,1)))","v":0},0]
[17,{"$f":"'Shooter Information'!B22","v":0},{"$f":"'Shooter Information'!C22","v":0},null,null,null,null,null,null,null,0,{"$f":"IF('Shooter Information'!$E$3-('Shooter Information'!$G$3-RANK(K20,K$4:K$78,1))<0,0,'Shooter Information'!$E$3-('Shooter Information'!$G$3-RANK(K20,K$4:K$78,1)))","v":0},0]
[18,{"$f":"'Shooter Information'!B23","v":0},{"$f":"'Shooter Information'!C23","v":0},null,null,null,null,null,null,null,0,{"$f":"IF('Shooter Information'!$E$3-('Shooter Information'!$G$3-RANK(K21,K$4:K$78,1))<0,0,'Shooter Information'!$E$3-('Shooter Information'!$G$3-RANK(K21,K$4:K$78,1)))","v":0},0]
[19,{"$f":"'Shooter Information'!B24","v":0},{"$f":"'Shooter Information'!C24","v":0},null,null,null,null,null,null,null,0,{"$f":"IF('Shooter Information'!$E$3-('Shooter Information'!$G$3-RANK(K22,K$4:K$78,1))<0,0,'Shooter Information'!$E$3-('Shooter Information'!$G$3-RANK(K22,K$4:K$78,1)))","v":0},0]
[20,{"$f":"'Shooter Information'!B25","v":0},{"$f":"'Shooter Information'!C25","v":0},null,null,null,null,null,null,null,0,{"$f":"IF('Shooter Information'!$E$3-('Shooter Information'!$G$3-RANK(K23,K$4:K$78,1))<0,0,'Shooter Information'!$E$3-('Shooter Information'!$G$3-RANK(K23,K$4:K$78,1)))","v":0},0]
[21,{"$f":"'Shooter Information'!B26","v":0},{"$f":"'Shooter Information'!C26","v":0},null,null,null,null,null,null,null,0,{"$f":"IF('Shooter Information'!$E$3-('Shooter Information'!$G$3-RANK(K24,K$4:K$78,1))<0,0,'Shooter Information'!$E$3-('Shooter Information'!$G$3-RANK(K24,K$4:K$78,1)))","v":0},0]
[22,{"$f":"'Shooter Information'!B27","v":0},{"$f":"'Shooter Information'!C27","v":0},null,null,null,null,null,null,null,0,{"$f":"IF('Shooter Information'!$E$3-('Shooter Information'!$G$3-RANK(K25,K$4:K$78,1))<0,0,'Shooter Information'!$E$3-('Shooter Information'!$G$3-RANK(K25,K$4:K$78,1)))","v":0},0]
[23,{"$f":"'Shooter Information'!B28","v":0},{"$f":"'Shooter Information'!C28","v":0},null,null,null,null,null,null,null,0,{"$f":"IF('Shooter Information'!$E$3-('Shooter Information'!$G$3-RANK(K26,K$4:K$78,1))<0,0,'Shooter Information'!$E$3-('Shooter Information'!$G$3-RANK(K26,K$4:K$78,1)))","v":0},0]
[24,{"$f":"'Shooter Information'!B29","v":0},{"$f":"'Shooter Information'!C29","v":0},null,null,null,null,null,null,null,0,{"$f":"IF('Shooter Information'!$E$3-('Shooter Information'!$G$3-RANK(K27,K$4:K$78,1))<0,0,'Shooter Information'!$E$3-('Shooter Information'!$G$3-RANK(K27,K$4:K$78,1)))","v":0},0]
[25,{"$f":"'Shooter Information'!B30","v":0},{"$f":"'Shooter Information'!C30","v":0},null,null,null,null,null,null,null,0,{"$f":"IF('Shooter Information'!$E$3-('Shooter Information'!$G$3-RANK(K28,K$4:K$78,1))<0,0,'Shooter Information'!$E$3-('Shooter Information'!$G$3-RANK(K28,K$4:K$78,1)))","v":0},0]
[26,{"$f":"'Shooter Information'!B31","v":0},{"$f":"'Shooter Information'!C31","v":0},null,null,null,null,null,null,null,0,{"$f":"IF('Shooter Information'!$E$3-('Shooter Information'!$G$3-RANK(K29,K$4:K$78,1))<0,0,'Shooter Information'!$E$3-('Shooter Information'!$G$3-RANK(K29,K$4:K$78,1)))","v":0},0]
[27,{"$f":"'Shooter Information'!B32","v":0},{"$f":"'Shooter Information'!C32","v":0},null,null,null,null,null,null,null,0,{"$f":"IF('Shooter Information'!$E$3-('Shooter Information'!$G$3-RANK(K30,K$4:K$78,1))<0,0,'Shooter Information'!$E$3-('Shooter Information'!$G$3-RANK(K30,K$4:K$78,1)))","v":0},0]
[28,{"$f":"'Shooter Information'!B33","v":0},{"$f":"'Shooter Information'!C33","v":0},null,null,null,null,null,null,null,0,{"$f":"IF('Shooter Information'!$E$3-('Shooter Information'!$G$3-RANK(K31,K$4:K$78,1))<0,0,'Shooter Information'!$E$3-('Shooter Information'!$G$3-RANK(K31,K$4:K$78,1)))","v":0},0]
[29,{"$f":"'Shooter Information'!B34","v":0},{"$f":"'Shooter Information'!C34","v":0},null,null,null,null,null,null,null,0,{"$f":"IF('Shooter Information'!$E$3-('Shooter Information'!$G$3-RANK(K32,K$4:K$78,1))<0,0,'Shooter Information'!$E$3-('Shooter Information'!$G$3-RANK(K32,K$4:K$78,1)))","v":0},0]
[30,{"$f":"'Shooter Information'!B35","v":0},{"$f":"'Shooter Information'!C35","v":0},null,null,null,null,null,null,null,0,{"$f":"IF('Shooter Information'!$E$3-('Shooter Information'!$G$3-RANK(K33,K$4:K$78,1))<0,0,'Shooter Information'!$E$3-('Shooter Information'!$G$3-RANK(K33,K$4:K$78,1)))","v":0},0]
[31,{"$f":"'Shooter Information'!B36","v":0},{"$f":"'Shooter Information'!C36","v":0},null,null,null,null,null,null,null,0,{"$f":"IF('Shooter Information'!$E$3-('Shooter Information'!$G$3-RANK(K34,K$4:K$78,1))<0,0,'Shooter Information'!$E$3-('Shooter Information'!$G$3-RANK(K34,K$4:K$78,1)))","v":0},0]
[32,{"$f":"'Shooter Information'!B37","v":0},{"$f":"'Shooter Information'!C37","v":0},null,null,null,null,null,null,null,0,{"$f":"IF('Shooter Information'!$E$3-('Shooter Information'!$G$3-RANK(K35,K$4:K$78,1))<0,0,'Shooter Information'!$E$3-('Shooter Information'!$G$3-RANK(K35,K$4:K$78,1)))","v":0},0]
[33,{"$f":"'Shooter Information'!B38","v":0},{"$f":"'Shooter Information'!C38","v":0},null,null,null,null,null,null,null,0,{"$f":"IF('Shooter Information'!$E$3-('Shooter Information'!$G$3-RANK(K36,K$4:K$78,1))<0,0,'Shooter Information'!$E$3-('Shooter Information'!$G$3-RANK(K36,K$4:K$78,1)))","v":0},0]
[34,{"$f":"'Shooter Information'!B39","v":0},{"$f":"'Shooter Information'!C39","v":0},null,null,null,null,null,null,null,0,{"$f":"IF('Shooter Information'!$E$3-('Shooter Information'!$G$3-RANK(K37,K$4:K$78,1))<0,0,'Shooter Information'!$E$3-('Shooter Information'!$G$3-RANK(K37,K$4:K$78,1)))","v":0},0]
[35,{"$f":"'Shooter Information'!B40","v":0},{"$f":"'Shooter Information'!C40","v":0},null,null,null,null,null,null,null,0,{"$f":"IF('Shooter Information'!$E$3-('Shooter Information'!$G$3-RANK(K38,K$4:K$78,1))<0,0,'Shooter Information'!$E$3-('Shooter Information'!$G$3-RANK(K38,K$4:K$78,1)))","v":0},0]
[36,{"$f":"'Shooter Information'!B41","v":0},{"$f":"'Shooter Information'!C41","v":0},null,null,null,null,null,null,null,0,{"$f":"IF('Shooter Information'!$E$3-('Shooter Information'!$G$3-RANK(K39,K$4:K$78,1))<0,0,'Shooter Information'!$E$3-('Shooter Information'!$G$3-RANK(K39,K$4:K$78,1)))","v":0},0]
[37,{"$f":"'Shooter Information'!B42","v":0},{"$f":"'Shooter Information'!C42","v":0},null,null,null,null,null,null,null,0,{"$f":"IF('Shooter Information'!$E$3-('Shooter Information'!$G$3-RANK(K40,K$4:K$78,1))<0,0,'Shooter Information'!$E$3-('Shooter Information'!$G$3-RANK(K40,K$4:K$78,1)))","v":0},0]
[38,{"$f":"'Shooter Information'!B43","v":0},{"$f":"'Shooter Information'!C43","v":0},null,null,null,null,null,null,null,0,{"$f":"IF('Shooter Information'!$E$3-('Shooter Information'!$G$3-RANK(K41,K$4:K$78,1))<0,0,'Shooter Information'!$E$3-('Shooter Information'!$G$3-RANK(K41,K$4:K$78,1)))","v":0},0]
[39,{"$f":"'Shooter Information'!B44","v":0},{"$f":"'Shooter Information'!C44","v":0},null,null,null,null,null,null,null,0,{"$f":"IF('Shooter Information'!$E$3-('Shooter Information'!$G$3-RANK(K42,K$4:K$78,1))<0,0,'Shooter Information'!$E$3-('Shooter Information'!$G$3-RANK(K42,K$4:K$78,1)))","v":0},0]
[40,{"$f":"'Shooter Information'!B45","v":0},{"$f":"'Shooter Information'!C45","v":0},null,null,null,null,null,null,null,0,{"$f":"IF('Shooter Information'!$E$3-('Shooter Information'!$G$3-RANK(K43,K$4:K$78,1))<0,0,'Shooter Information'!$E$3-('Shooter Information'!$G$3-RANK(K43,K$4:K$78,1)))","v":0},0]
[41,{"$f":"'Shooter Information'!B46","v":0},{"$f":"'Shooter Information'!C46","v":0},null,null,null,null,null,null,null,0,{"$f":"IF('Shooter Information'!$E$3-('Shooter Information'!$G$3-RANK(K44,K$4:K$78,1))<0,0,'Shooter Information'!$E$3-('Shooter Information'!$G$3-RANK(K44,K$4:K$78,1)))","v":0},0]
[42,{"$f":"'Shooter Information'!B47","v":0},{"$f":"'Shooter Information'!C47","v":0},null,null,null,null,null,null,null,0,{"$f":"IF('Shooter Information'!$E$3-('Shooter Information'!$G$3-RANK(K45,K$4:K$78,1))<0,0,'Shooter Information'!$E$3-('Shooter Information'!$G$3-RANK(K45,K$4:K$78,1)))","v":0},0]
[43,{"$f":"'Shooter Information'!B48","v":0},{"$f":"'Shooter Information'!C48","v":0},null,null,null,null,null,null,null,0,{"$f":"IF('Shooter Information'!$E$3-('Shooter Information'!$G$3-RANK(K46,K$4:K$78,1))<0,0,'Shooter Information'!$E$3-('Shooter Information'!$G$3-RANK(K46,K$4:K$78,1)))","v":0},0]
[44,{"$f":"'Shooter Information'!B49","v":0},{"$f":"'Shooter Information'!C49","v":0},null,null,null,null,null,null,null,0,{"$f":"IF('Shooter Information'!$E$3-('Shooter Information'!$G$3-RANK(K47,K$4:K$78,1))<0,0,'Shooter Information'!$E$3-('Shooter Information'!$G$3-RANK(K47,K$4:K$78,1)))","v":0},0]
[45,{"$f":"'Shooter Information'!B50","v":0},{"$f":"'Shooter Information'!C50","v":0},null,null,null,null,null,null,null,0,{"$f":"IF('Shooter Information'!$E$3-('Shooter Information'!$G$3-RANK(K48,K$4:K$78,1))<0,0,'Shooter Information'!$E$3-('Shooter Information'!$G$3-RANK(K48,K$4:K$78,1)))","v":0},0]
[46,{"$f":"'Shooter Information'!B51","v":0},{"$f":"'Shooter Information'!C51","v":0},null,null,null,null,null,null,null,0,{"$f":"IF('Shooter Information'!$E$3-('Shooter Information'!$G$3-RANK(K49,K$4:K$78,1))<0,0,'Shooter Information'!$E$3-('Shooter Information'!$G$3-RANK(K49,K$4:K$78,1)))","v":0},0]
[47,{"$f":"'Shooter Information'!B52","v":0},{"$f":"'Shooter Information'!C52","v":0},null,null,null,null,null,null,null,0,{"$f":"IF('Shooter Information'!$E$3-('Shooter Information'!$G$3-RANK(K50,K$4:K$78,1))<0,0,'Shooter Information'!$E$3-('Shooter Information'!$G$3-RANK(K50,K$4:K$78,1)))","v":0},0]
[48,{"$f":"'Shooter Information'!B53","v":0},{"$f":"'Shooter Information'!C53","v":0},null,null,null,null,null,null,null,0,{"$f":"IF('Shooter Information'!$E$3-('Shooter Information'!$G$3-RANK(K51,K$4:K$78,1))<0,0,'Shooter Information'!$E$3-('Shooter Information'!$G$3-RANK(K51,K$4:K$78,1)))","v":0},0]
[49,{"$f":"'Shooter Information'!B54","v":0},{"$f":"'Shooter Information'!C54","v":0},null,null,null,null,null,null,null,0,{"$f":"IF('Shooter Information'!$E$3-('Shooter Information'!$G$3-RANK(K52,K$4:K$78,1))<0,0,'Shooter Information'!$E$3-('Shooter Information'!$G$3-RANK(K52,K$4:K$78,1)))","v":0},0]
[50,{"$f":"'Shooter Information'!B55","v":0},{"$f":"'Shooter Information'!C55","v":0},null,null,null,null,null,null,null,0,{"$f":"IF('Shooter Information'!$E$3-('Shooter Information'!$G$3-RANK(K53,K$4:K$78,1))<0,0,'Shooter Information'!$E$3-('Shooter Information'!$G$3-RANK(K53,K$4:K$78,1)))","v":0},0]
[51,{"$f":"'Shooter Information'!B56","v":0},{"$f":"'Shooter Information'!C56","v":0},null,null,null,null,null,null,null,0,{"$f":"IF('Shooter Information'!$E$3-('Shooter Information'!$G$3-RANK(K54,K$4:K$78,1))<0,0,'Shooter Information'!$E$3-('Shooter Information'!$G$3-RANK(K54,K$4:K$78,1)))","v":0},0]
[52,{"$f":"'Shooter Information'!B57","v":0},{"$f":"'Shooter Information'!C57","v":0},null,null,null,null,null,null,null,0,{"$f":"IF('Shooter Information'!$E$3-('Shooter Information'!$G$3-RANK(K55,K$4:K$78,1))<0,0,'Shooter Information'!$E$3-('Shooter Information'!$G$3-RANK(K55,K$4:K$78,1)))","v":0},0]
[53,{"$f":"'Shooter Information'!B58","v":0},{"$f":"'Shooter Information'!C58","v":0},null,null,null,null,null,null,null,0,{"$f":"IF('Shooter Information'!$E$3-('Shooter Information'!$G$3-RANK(K56,K$4:K$78,1))<0,0,'Shooter Information'!$E$3-('Shooter Information'!$G$3-RANK(K56,K$4:K$78,1)))","v":0},0]
[54,{"$f":"'Shooter Information'!B59","v":0},{"$f":"'Shooter Information'!C59","v":0},null,null,null,null,null,null,null,0,{"$f":"IF('Shooter Information'!$E$3-('Shooter Information'!$G$3-RANK(K57,K$4:K$78,1))<0,0,'Shooter Information'!$E$3-('Shooter Information'!$G$3-RANK(K57,K$4:K$78,1)))","v":0},0]
[55,{"$f":"'Shooter Information'!B60","v":0},{"$f":"'Shooter Information'!C60","v":0},null,null,null,null,null,null,null,0,{"$f":"IF('Shooter Information'!$E$3-('Shooter Information'!$G$3-RANK(K58,K$4:K$78,1))<0,0,'Shooter Information'!$E$3-('Shooter Information'!$G$3-RANK(K58,K$4:K$78,1)))","v":0},0]
[56,{"$f":"'Shooter Information'!B61","v":0},{"$f":"'Shooter Information'!C61","v":0},null,null,null,null,null,null,null,0,{"$f":"IF('Shooter Information'!$E$3-('Shooter Information'!$G$3-RANK(K59,K$4:K$78,1))<0,0,'Shooter Information'!$E$3-('Shooter Information'!$G$3-RANK(K59,K$4:K$78,1)))","v":0},0]
[57,{"$f":"'Shooter Information'!B62","v":0},{"$f":"'Shooter Information'!C62","v":0},null,null,null,null,null,null,null,0,{"$f":"IF('Shooter Information'!$E$3-('Shooter Information'!$G$3-RANK(K60,K$4:K$78,1))<0,0,'Shooter Information'!$E$3-('Shooter Information'!$G$3-RANK(K60,K$4:K$78,1)))","v":0},0]
[58,{"$f":"'Shooter Information'!B63","v":0},{"$f":"'Shooter Information'!C63","v":0},null,null,null,null,null,null,null,0,{"$f":"IF('Shooter Information'!$E$3-('Shooter Information'!$G$3-RANK(K61,K$4:K$78,1))<0,0,'Shooter Information'!$E$3-('Shooter Information'!$G$3-RANK(K61,K$4:K$78,1)))","v":0},0]
[59,{"$f":"'Shooter Information'!B64","v":0},{"$f":"'Shooter Information'!C64","v":0},null,null,null,null,null,null,null,0,{"$f":"IF('Shooter Information'!$E$3-('Shooter Information'!$G$3-RANK(K62,K$4:K$78,1))<0,0,'Shooter Information'!$E$3-('Shooter Information'!$G$3-RANK(K62,K$4:K$78,1)))","v":0},0]
[60,{"$f":"'Shooter Information'!B65","v":0},{"$f":"'Shooter Information'!C65","v":0},null,null,null,null,null,null,null,0,{"$f":"IF('Shooter Information'!$E$3-('Shooter Information'!$G$3-RANK(K63,K$4:K$78,1))<0,0,'Shooter Information'!$E$3-('Shooter Information'!$G$3-RANK(K63,K$4:K$78,1)))","v":0},0]
[61,{"$f":"'Shooter Information'!B66","v":0},{"$f":"'Shooter Information'!C66","v":0},null,null,null,null,null,null,null,0,{"$f":"IF('Shooter Information'!$E$3-('Shooter Information'!$G$3-RANK(K64,K$4:K$78,1))<0,0,'Shooter Information'!$E$3-('Shooter Information'!$G$3-RANK(K64,K$4:K$78,1)))","v":0},0]
[62,{"$f":"'Shooter Information'!B67","v":0},{"$f":"'Shooter Information'!C67","v":0},null,null,null,null,null,null,null,0,{"$f":"IF('Shooter Information'!$E$3-('Shooter Information'!$G$3-RANK(K65,K$4:K$78,1))<0,0,'Shooter Information'!$E$3-('Shooter Information'!$G$3-RANK(K65,K$4:K$78,1)))","v":0},0]
[63,{"$f":"'Shooter Information'!B68","v":0},{"$f":"'Shooter Information'!C68","v":0},null,null,null,null,null,null,null,0,{"$f":"IF('Shooter Information'!$E$3-('Shooter Information'!$G$3-RANK(K66,K$4:K$78,1))<0,0,'Shooter Information'!$E$3-('Shooter Information'!$G$3-RANK(K66,K$4:K$78,1)))","v":0},0]
[64,{"$f":"'Shooter Information'!B69","v":0},{"$f":"'Shooter Information'!C69","v":0},null,null,null,null,null,null,null,0,{"$f":"IF('Shooter Information'!$E$3-('Shooter Information'!$G$3-RANK(K67,K$4:K$78,1))<0,0,'Shooter Information'!$E$3-('Shooter Information'!$G$3-RANK(K67,K$4:K$78,1)))","v":0},0]
[65,{"$f":"'Shooter Information'!B70","v":0},{"$f":"'Shooter Information'!C70","v":0},null,null,null,null,null,null,null,0,{"$f":"IF('Shooter Information'!$E$3-('Shooter Information'!$G$3-RANK(K68,K$4:K$78,1))<0,0,'Shooter Information'!$E$3-('Shooter Information'!$G$3-RANK(K68,K$4:K$78,1)))","v":0},0]
[66,{"$f":"'Shooter Information'!B71","v":0},{"$f":"'Shooter Information'!C71","v":0},null,null,null,null,null,null,null,{"$f":"(D69*5)+E69-F69+(G69*10)+(H69*30)+(I69*999)+(J69*999.99)","v":0},{"$f":"IF('Shooter Information'!$E$3-('Shooter Information'!$G$3-RANK(K69,K$4:K$78,1))<0,0,'Shooter Information'!$E$3-('Shooter Information'!$G$3-RANK(K69,K$4:K$78,1)))","v":0},{"$f":"(SUM(D69+G69+H69+I69+J69))","v":0}]
[67,{"$f":"'Shooter Information'!B72","v":0},{"$f":"'Shooter Information'!C72","v":0},null,null,null,null,null,null,null,0,{"$f":"IF('Shooter Information'!$E$3-('Shooter Information'!$G$3-RANK(K70,K$4:K$78,1))<0,0,'Shooter Information'!$E$3-('Shooter Information'!$G$3-RANK(K70,K$4:K$78,1)))","v":0},0]
[68,{"$f":"'Shooter Information'!B73","v":0},{"$f":"'Shooter Information'!C73","v":0},null,null,null,null,null,null,null,0,{"$f":"IF('Shooter Information'!$E$3-('Shooter Information'!$G$3-RANK(K71,K$4:K$78,1))<0,0,'Shooter Information'!$E$3-('Shooter Information'!$G$3-RANK(K71,K$4:K$78,1)))","v":0},0]
[69,{"$f":"'Shooter Information'!B74","v":0},{"$f":"'Shooter Information'!C74","v":0},null,null,null,null,null,null,null,0,{"$f":"IF('Shooter Information'!$E$3-('Shooter Information'!$G$3-RANK(K72,K$4:K$78,1))<0,0,'Shooter Information'!$E$3-('Shooter Information'!$G$3-RANK(K72,K$4:K$78,1)))","v":0},0]
[70,{"$f":"'Shooter Information'!B75","v":0},{"$f":"'Shooter Information'!C75","v":0},null,null,null,null,null,null,null,0,{"$f":"IF('Shooter Information'!$E$3-('Shooter Information'!$G$3-RANK(K73,K$4:K$78,1))<0,0,'Shooter Information'!$E$3-('Shooter Information'!$G$3-RANK(K73,K$4:K$78,1)))","v":0},0]
[71,{"$f":"'Shooter Information'!B76","v":0},{"$f":"'Shooter Information'!C76","v":0},null,null,null,null,null,null,null,0,{"$f":"IF('Shooter Information'!$E$3-('Shooter Information'!$G$3-RANK(K74,K$4:K$78,1))<0,0,'Shooter Information'!$E$3-('Shooter Information'!$G$3-RANK(K74,K$4:K$78,1)))","v":0},0]
[72,{"$f":"'Shooter Information'!B77","v":0},{"$f":"'Shooter Information'!C77","v":0},null,null,null,null,null,null,null,0,{"$f":"IF('Shooter Information'!$E$3-('Shooter Information'!$G$3-RANK(K75,K$4:K$78,1))<0,0,'Shooter Information'!$E$3-('Shooter Information'!$G$3-RANK(K75,K$4:K$78,1)))","v":0},0]
[73,{"$f":"'Shooter Information'!B78","v":0},{"$f":"'Shooter Information'!C78","v":0},null,null,null,null,null,null,null,0,{"$f":"IF('Shooter Information'!$E$3-('Shooter Information'!$G$3-RANK(K76,K$4:K$78,1))<0,0,'Shooter Information'!$E$3-('Shooter Information'!$G$3-RANK(K76,K$4:K$78,1)))","v":0},0]
[74,{"$f":"'Shooter Information'!B79","v":0},{"$f":"'Shooter Information'!C79","v":0},null,null,null,null,null,null,null,0,{"$f":"IF('Shooter Information'!$E$3-('Shooter Information'!$G$3-RANK(K77,K$4:K$78,1))<0,0,'Shooter Information'!$E$3-('Shooter Information'!$G$3-RANK(K77,K$4:K$78,1)))","v":0},0]
[75,{"$f":"'Shooter Information'!B80","v":0},{"$f":"'Shooter Information'!C80","v":0},null,null,null,null,null,null,null,0,{"$f":"IF('Shooter Information'!$E$3-('Shooter Information'!$G$3-RANK(K78,K$4:K$78,1))<0,0,'Shooter Information'!$E$3-('Shooter Information'!$G$3-RANK(K78,K$4:K$78,1)))","v":0},0]

{"sheet":"Stage 9","index":9,"n_rows":78,"n_cols":13,"rows_kept":78,"cut":false,"hidden":true,"merged":[]}
[null,"CAS SCORE SHEET"]
[null,"Stage 9"]
["Roster #","Shooter","Class","Misses","Raw Time","Bonus","10 Sec","30 Sec","DNF","DQ","Total","Rank","Penalties"]
[{"$f":"ROW()-3","v":1},{"$f":"'Shooter Information'!B6","v":"Striker"},{"$f":"'Shooter Information'!C6","v":"GF"},null,null,null,null,null,null,null,{"$f":"(D4*5)+E4-F4+(G4*10)+(H4*30)+(I4*999)+(J4*999.99)","v":0},{"$f":"IF('Shooter Information'!$E$3-('Shooter Information'!$G$3-RANK(K4,K$4:K$78,1))<0,0,'Shooter Information'!$E$3-('Shooter Information'!$G$3-RANK(K4,K$4:K$78,1)))","v":0},{"$f":"(SUM(D4+G4+H4+I4+J4))","v":0}]
[{"$f":"ROW()-3","v":2},{"$f":"'Shooter Information'!B7","v":"Lefty Spurmaker"},{"$f":"'Shooter Information'!C7","v":49},null,null,null,null,null,null,null,{"$f":"(D5*5)+E5-F5+(G5*10)+(H5*30)+(I5*999)+(J5*999.99)","v":0},{"$f":"IF('Shooter Information'!$E$3-('Shooter Information'!$G$3-RANK(K5,K$4:K$78,1))<0,0,'Shooter Information'!$E$3-('Shooter Information'!$G$3-RANK(K5,K$4:K$78,1)))","v":0},{"$f":"(SUM(D5+G5+H5+I5+J5))","v":0}]
[3,{"$f":"'Shooter Information'!B8","v":"Hotshod"},{"$f":"'Shooter Information'!C8","v":"W"},null,null,null,null,null,null,null,0,{"$f":"IF('Shooter Information'!$E$3-('Shooter Information'!$G$3-RANK(K6,K$4:K$78,1))<0,0,'Shooter Information'!$E$3-('Shooter Information'!$G$3-RANK(K6,K$4:K$78,1)))","v":0},0]
[4,{"$f":"'Shooter Information'!B9","v":"Swifty McDraw"},{"$f":"'Shooter Information'!C9","v":"SS"},null,null,null,null,null,null,null,0,{"$f":"IF('Shooter Information'!$E$3-('Shooter Information'!$G$3-RANK(K7,K$4:K$78,1))<0,0,'Shooter Information'!$E$3-('Shooter Information'!$G$3-RANK(K7,K$4:K$78,1)))","v":0},0]
[5,{"$f":"'Shooter Information'!B10","v":"Prairie City Slim"},{"$f":"'Shooter Information'!C10","v":"SS"},null,null,null,null,null,null,null,0,{"$f":"IF('Shooter Information'!$E$3-('Shooter Information'!$G$3-RANK(K8,K$4:K$78,1))<0,0,'Shooter Information'!$E$3-('Shooter Information'!$G$3-RANK(K8,K$4:K$78,1)))","v":0},0]
[6,{"$f":"'Shooter Information'!B11","v":"Enid City Kid"},{"$f":"'Shooter Information'!C11","v":"FC"},null,null,null,null,null,null,null,0,{"$f":"IF('Shooter Information'!$E$3-('Shooter Information'!$G$3-RANK(K9,K$4:K$78,1))<0,0,'Shooter Information'!$E$3-('Shooter Information'!$G$3-RANK(K9,K$4:K$78,1)))","v":0},0]
[7,{"$f":"'Shooter Information'!B12","v":"Cockroach"},{"$f":"'Shooter Information'!C12","v":"CB"},null,null,null,null,null,null,null,0,{"$f":"IF('Shooter Information'!$E$3-('Shooter Information'!$G$3-RANK(K10,K$4:K$78,1))<0,0,'Shooter Information'!$E$3-('Shooter Information'!$G$3-RANK(K10,K$4:K$78,1)))","v":0},0]
[8,{"$f":"'Shooter Information'!B13","v":"Kuba Kid"},{"$f":"'Shooter Information'!C13","v":"D"},null,null,null,null,null,null,null,0,{"$f":"IF('Shooter Information'!$E$3-('Shooter Information'!$G$3-RANK(K11,K$4:K$78,1))<0,0,'Shooter Information'!$E$3-('Shooter Information'!$G$3-RANK(K11,K$4:K$78,1)))","v":0},0]
[9,{"$f":"'Shooter Information'!B14","v":"Beartooth"},{"$f":"'Shooter Information'!C14","v":"S"},null,null,null,null,null,null,null,0,{"$f":"IF('Shooter Information'!$E$3-('Shooter Information'!$G$3-RANK(K12,K$4:K$78,1))<0,0,'Shooter Information'!$E$3-('Shooter Information'!$G$3-RANK(K12,K$4:K$78,1)))","v":0},0]
[10,{"$f":"'Shooter Information'!B15","v":"Slick Rick"},{"$f":"'Shooter Information'!C15","v":"S"},null,null,null,null,null,null,null,0,{"$f":"IF('Shooter Information'!$E$3-('Shooter Information'!$G$3-RANK(K13,K$4:K$78,1))<0,0,'Shooter Information'!$E$3-('Shooter Information'!$G$3-RANK(K13,K$4:K$78,1)))","v":0},0]
[11,{"$f":"'Shooter Information'!B16","v":"Windhorse Rider"},{"$f":"'Shooter Information'!C16","v":"GF"},null,null,null,null,null,null,null,0,{"$f":"IF('Shooter Information'!$E$3-('Shooter Information'!$G$3-RANK(K14,K$4:K$78,1))<0,0,'Shooter Information'!$E$3-('Shooter Information'!$G$3-RANK(K14,K$4:K$78,1)))","v":0},0]
[12,{"$f":"'Shooter Information'!B17","v":"Justice Jack"},{"$f":"'Shooter Information'!C17","v":"SS"},null,null,null,null,null,null,null,0,{"$f":"IF('Shooter Information'!$E$3-('Shooter Information'!$G$3-RANK(K15,K$4:K$78,1))<0,0,'Shooter Information'!$E$3-('Shooter Information'!$G$3-RANK(K15,K$4:K$78,1)))","v":0},0]
[13,{"$f":"'Shooter Information'!B18","v":"B. S. Walker"},{"$f":"'Shooter Information'!C18","v":49},null,null,null,null,null,null,null,0,{"$f":"IF('Shooter Information'!$E$3-('Shooter Information'!$G$3-RANK(K16,K$4:K$78,1))<0,0,'Shooter Information'!$E$3-('Shooter Information'!$G$3-RANK(K16,K$4:K$78,1)))","v":0},0]
[14,{"$f":"'Shooter Information'!B19","v":"Red Cavanaugh"},{"$f":"'Shooter Information'!C19","v":49},null,null,null,null,null,null,null,0,{"$f":"IF('Shooter Information'!$E$3-('Shooter Information'!$G$3-RANK(K17,K$4:K$78,1))<0,0,'Shooter Information'!$E$3-('Shooter Information'!$G$3-RANK(K17,K$4:K$78,1)))","v":0},0]
[15,{"$f":"'Shooter Information'!B20","v":"Deringer Dan"},{"$f":"'Shooter Information'!C20","v":49},null,null,null,null,null,null,null,0,{"$f":"IF('Shooter Information'!$E$3-('Shooter Information'!$G$3-RANK(K18,K$4:K$78,1))<0,0,'Shooter Information'!$E$3-('Shooter Information'!$G$3-RANK(K18,K$4:K$78,1)))","v":0},0]
[16,{"$f":"'Shooter Information'!B21","v":0},{"$f":"'Shooter Information'!C21","v":0},null,null,null,null,null,null,null,0,{"$f":"IF('Shooter Information'!$E$3-('Shooter Information'!$G$3-RANK(K19,K$4:K$78,1))<0,0,'Shooter Information'!$E$3-('Shooter Information'!$G$3-RANK(K19,K$4:K$78,1)))","v":0},0]
[17,{"$f":"'Shooter Information'!B22","v":0},{"$f":"'Shooter Information'!C22","v":0},null,null,null,null,null,null,null,0,{"$f":"IF('Shooter Information'!$E$3-('Shooter Information'!$G$3-RANK(K20,K$4:K$78,1))<0,0,'Shooter Information'!$E$3-('Shooter Information'!$G$3-RANK(K20,K$4:K$78,1)))","v":0},0]
[18,{"$f":"'Shooter Information'!B23","v":0},{"$f":"'Shooter Information'!C23","v":0},null,null,null,null,null,null,null,0,{"$f":"IF('Shooter Information'!$E$3-('Shooter Information'!$G$3-RANK(K21,K$4:K$78,1))<0,0,'Shooter Information'!$E$3-('Shooter Information'!$G$3-RANK(K21,K$4:K$78,1)))","v":0},0]
[19,{"$f":"'Shooter Information'!B24","v":0},{"$f":"'Shooter Information'!C24","v":0},null,null,null,null,null,null,null,0,{"$f":"IF('Shooter Information'!$E$3-('Shooter Information'!$G$3-RANK(K22,K$4:K$78,1))<0,0,'Shooter Information'!$E$3-('Shooter Information'!$G$3-RANK(K22,K$4:K$78,1)))","v":0},0]
[20,{"$f":"'Shooter Information'!B25","v":0},{"$f":"'Shooter Information'!C25","v":0},null,null,null,null,null,null,null,0,{"$f":"IF('Shooter Information'!$E$3-('Shooter Information'!$G$3-RANK(K23,K$4:K$78,1))<0,0,'Shooter Information'!$E$3-('Shooter Information'!$G$3-RANK(K23,K$4:K$78,1)))","v":0},0]
[21,{"$f":"'Shooter Information'!B26","v":0},{"$f":"'Shooter Information'!C26","v":0},null,null,null,null,null,null,null,0,{"$f":"IF('Shooter Information'!$E$3-('Shooter Information'!$G$3-RANK(K24,K$4:K$78,1))<0,0,'Shooter Information'!$E$3-('Shooter Information'!$G$3-RANK(K24,K$4:K$78,1)))","v":0},0]
[22,{"$f":"'Shooter Information'!B27","v":0},{"$f":"'Shooter Information'!C27","v":0},null,null,null,null,null,null,null,0,{"$f":"IF('Shooter Information'!$E$3-('Shooter Information'!$G$3-RANK(K25,K$4:K$78,1))<0,0,'Shooter Information'!$E$3-('Shooter Information'!$G$3-RANK(K25,K$4:K$78,1)))","v":0},0]
[23,{"$f":"'Shooter Information'!B28","v":0},{"$f":"'Shooter Information'!C28","v":0},null,null,null,null,null,null,null,0,{"$f":"IF('Shooter Information'!$E$3-('Shooter Information'!$G$3-RANK(K26,K$4:K$78,1))<0,0,'Shooter Information'!$E$3-('Shooter Information'!$G$3-RANK(K26,K$4:K$78,1)))","v":0},0]
[24,{"$f":"'Shooter Information'!B29","v":0},{"$f":"'Shooter Information'!C29","v":0},null,null,null,null,null,null,null,0,{"$f":"IF('Shooter Information'!$E$3-('Shooter Information'!$G$3-RANK(K27,K$4:K$78,1))<0,0,'Shooter Information'!$E$3-('Shooter Information'!$G$3-RANK(K27,K$4:K$78,1)))","v":0},0]
[25,{"$f":"'Shooter Information'!B30","v":0},{"$f":"'Shooter Information'!C30","v":0},null,null,null,null,null,null,null,0,{"$f":"IF('Shooter Information'!$E$3-('Shooter Information'!$G$3-RANK(K28,K$4:K$78,1))<0,0,'Shooter Information'!$E$3-('Shooter Information'!$G$3-RANK(K28,K$4:K$78,1)))","v":0},0]
[26,{"$f":"'Shooter Information'!B31","v":0},{"$f":"'Shooter Information'!C31","v":0},null,null,null,null,null,null,null,0,{"$f":"IF('Shooter Information'!$E$3-('Shooter Information'!$G$3-RANK(K29,K$4:K$78,1))<0,0,'Shooter Information'!$E$3-('Shooter Information'!$G$3-RANK(K29,K$4:K$78,1)))","v":0},0]
[27,{"$f":"'Shooter Information'!B32","v":0},{"$f":"'Shooter Information'!C32","v":0},null,null,null,null,null,null,null,0,{"$f":"IF('Shooter Information'!$E$3-('Shooter Information'!$G$3-RANK(K30,K$4:K$78,1))<0,0,'Shooter Information'!$E$3-('Shooter Information'!$G$3-RANK(K30,K$4:K$78,1)))","v":0},0]
[28,{"$f":"'Shooter Information'!B33","v":0},{"$f":"'Shooter Information'!C33","v":0},null,null,null,null,null,null,null,0,{"$f":"IF('Shooter Information'!$E$3-('Shooter Information'!$G$3-RANK(K31,K$4:K$78,1))<0,0,'Shooter Information'!$E$3-('Shooter Information'!$G$3-RANK(K31,K$4:K$78,1)))","v":0},0]
[29,{"$f":"'Shooter Information'!B34","v":0},{"$f":"'Shooter Information'!C34","v":0},null,null,null,null,null,null,null,0,{"$f":"IF('Shooter Information'!$E$3-('Shooter Information'!$G$3-RANK(K32,K$4:K$78,1))<0,0,'Shooter Information'!$E$3-('Shooter Information'!$G$3-RANK(K32,K$4:K$78,1)))","v":0},0]
[30,{"$f":"'Shooter Information'!B35","v":0},{"$f":"'Shooter Information'!C35","v":0},null,null,null,null,null,null,null,0,{"$f":"IF('Shooter Information'!$E$3-('Shooter Information'!$G$3-RANK(K33,K$4:K$78,1))<0,0,'Shooter Information'!$E$3-('Shooter Information'!$G$3-RANK(K33,K$4:K$78,1)))","v":0},0]
[31,{"$f":"'Shooter Information'!B36","v":0},{"$f":"'Shooter Information'!C36","v":0},null,null,null,null,null,null,null,0,{"$f":"IF('Shooter Information'!$E$3-('Shooter Information'!$G$3-RANK(K34,K$4:K$78,1))<0,0,'Shooter Information'!$E$3-('Shooter Information'!$G$3-RANK(K34,K$4:K$78,1)))","v":0},0]
[32,{"$f":"'Shooter Information'!B37","v":0},{"$f":"'Shooter Information'!C37","v":0},null,null,null,null,null,null,null,0,{"$f":"IF('Shooter Information'!$E$3-('Shooter Information'!$G$3-RANK(K35,K$4:K$78,1))<0,0,'Shooter Information'!$E$3-('Shooter Information'!$G$3-RANK(K35,K$4:K$78,1)))","v":0},0]
[33,{"$f":"'Shooter Information'!B38","v":0},{"$f":"'Shooter Information'!C38","v":0},null,null,null,null,null,null,null,0,{"$f":"IF('Shooter Information'!$E$3-('Shooter Information'!$G$3-RANK(K36,K$4:K$78,1))<0,0,'Shooter Information'!$E$3-('Shooter Information'!$G$3-RANK(K36,K$4:K$78,1)))","v":0},0]
[34,{"$f":"'Shooter Information'!B39","v":0},{"$f":"'Shooter Information'!C39","v":0},null,null,null,null,null,null,null,0,{"$f":"IF('Shooter Information'!$E$3-('Shooter Information'!$G$3-RANK(K37,K$4:K$78,1))<0,0,'Shooter Information'!$E$3-('Shooter Information'!$G$3-RANK(K37,K$4:K$78,1)))","v":0},0]
[35,{"$f":"'Shooter Information'!B40","v":0},{"$f":"'Shooter Information'!C40","v":0},null,null,null,null,null,null,null,0,{"$f":"IF('Shooter Information'!$E$3-('Shooter Information'!$G$3-RANK(K38,K$4:K$78,1))<0,0,'Shooter Information'!$E$3-('Shooter Information'!$G$3-RANK(K38,K$4:K$78,1)))","v":0},0]
[36,{"$f":"'Shooter Information'!B41","v":0},{"$f":"'Shooter Information'!C41","v":0},null,null,null,null,null,null,null,0,{"$f":"IF('Shooter Information'!$E$3-('Shooter Information'!$G$3-RANK(K39,K$4:K$78,1))<0,0,'Shooter Information'!$E$3-('Shooter Information'!$G$3-RANK(K39,K$4:K$78,1)))","v":0},0]
[37,{"$f":"'Shooter Information'!B42","v":0},{"$f":"'Shooter Information'!C42","v":0},null,null,null,null,null,null,null,0,{"$f":"IF('Shooter Information'!$E$3-('Shooter Information'!$G$3-RANK(K40,K$4:K$78,1))<0,0,'Shooter Information'!$E$3-('Shooter Information'!$G$3-RANK(K40,K$4:K$78,1)))","v":0},0]
[38,{"$f":"'Shooter Information'!B43","v":0},{"$f":"'Shooter Information'!C43","v":0},null,null,null,null,null,null,null,0,{"$f":"IF('Shooter Information'!$E$3-('Shooter Information'!$G$3-RANK(K41,K$4:K$78,1))<0,0,'Shooter Information'!$E$3-('Shooter Information'!$G$3-RANK(K41,K$4:K$78,1)))","v":0},0]
[39,{"$f":"'Shooter Information'!B44","v":0},{"$f":"'Shooter Information'!C44","v":0},null,null,null,null,null,null,null,0,{"$f":"IF('Shooter Information'!$E$3-('Shooter Information'!$G$3-RANK(K42,K$4:K$78,1))<0,0,'Shooter Information'!$E$3-('Shooter Information'!$G$3-RANK(K42,K$4:K$78,1)))","v":0},0]
[40,{"$f":"'Shooter Information'!B45","v":0},{"$f":"'Shooter Information'!C45","v":0},null,null,null,null,null,null,null,0,{"$f":"IF('Shooter Information'!$E$3-('Shooter Information'!$G$3-RANK(K43,K$4:K$78,1))<0,0,'Shooter Information'!$E$3-('Shooter Information'!$G$3-RANK(K43,K$4:K$78,1)))","v":0},0]
[41,{"$f":"'Shooter Information'!B46","v":0},{"$f":"'Shooter Information'!C46","v":0},null,null,null,null,null,null,null,0,{"$f":"IF('Shooter Information'!$E$3-('Shooter Information'!$G$3-RANK(K44,K$4:K$78,1))<0,0,'Shooter Information'!$E$3-('Shooter Information'!$G$3-RANK(K44,K$4:K$78,1)))","v":0},0]
[42,{"$f":"'Shooter Information'!B47","v":0},{"$f":"'Shooter Information'!C47","v":0},null,null,null,null,null,null,null,0,{"$f":"IF('Shooter Information'!$E$3-('Shooter Information'!$G$3-RANK(K45,K$4:K$78,1))<0,0,'Shooter Information'!$E$3-('Shooter Information'!$G$3-RANK(K45,K$4:K$78,1)))","v":0},0]
[43,{"$f":"'Shooter Information'!B48","v":0},{"$f":"'Shooter Information'!C48","v":0},null,null,null,null,null,null,null,0,{"$f":"IF('Shooter Information'!$E$3-('Shooter Information'!$G$3-RANK(K46,K$4:K$78,1))<0,0,'Shooter Information'!$E$3-('Shooter Information'!$G$3-RANK(K46,K$4:K$78,1)))","v":0},0]
[44,{"$f":"'Shooter Information'!B49","v":0},{"$f":"'Shooter Information'!C49","v":0},null,null,null,null,null,null,null,0,{"$f":"IF('Shooter Information'!$E$3-('Shooter Information'!$G$3-RANK(K47,K$4:K$78,1))<0,0,'Shooter Information'!$E$3-('Shooter Information'!$G$3-RANK(K47,K$4:K$78,1)))","v":0},0]
[45,{"$f":"'Shooter Information'!B50","v":0},{"$f":"'Shooter Information'!C50","v":0},null,null,null,null,null,null,null,0,{"$f":"IF('Shooter Information'!$E$3-('Shooter Information'!$G$3-RANK(K48,K$4:K$78,1))<0,0,'Shooter Information'!$E$3-('Shooter Information'!$G$3-RANK(K48,K$4:K$78,1)))","v":0},0]
[46,{"$f":"'Shooter Information'!B51","v":0},{"$f":"'Shooter Information'!C51","v":0},null,null,null,null,null,null,null,0,{"$f":"IF('Shooter Information'!$E$3-('Shooter Information'!$G$3-RANK(K49,K$4:K$78,1))<0,0,'Shooter Information'!$E$3-('Shooter Information'!$G$3-RANK(K49,K$4:K$78,1)))","v":0},0]
[47,{"$f":"'Shooter Information'!B52","v":0},{"$f":"'Shooter Information'!C52","v":0},null,null,null,null,null,null,null,0,{"$f":"IF('Shooter Information'!$E$3-('Shooter Information'!$G$3-RANK(K50,K$4:K$78,1))<0,0,'Shooter Information'!$E$3-('Shooter Information'!$G$3-RANK(K50,K$4:K$78,1)))","v":0},0]
[48,{"$f":"'Shooter Information'!B53","v":0},{"$f":"'Shooter Information'!C53","v":0},null,null,null,null,null,null,null,0,{"$f":"IF('Shooter Information'!$E$3-('Shooter Information'!$G$3-RANK(K51,K$4:K$78,1))<0,0,'Shooter Information'!$E$3-('Shooter Information'!$G$3-RANK(K51,K$4:K$78,1)))","v":0},0]
[49,{"$f":"'Shooter Information'!B54","v":0},{"$f":"'Shooter Information'!C54","v":0},null,null,null,null,null,null,null,0,{"$f":"IF('Shooter Information'!$E$3-('Shooter Information'!$G$3-RANK(K52,K$4:K$78,1))<0,0,'Shooter Information'!$E$3-('Shooter Information'!$G$3-RANK(K52,K$4:K$78,1)))","v":0},0]
[50,{"$f":"'Shooter Information'!B55","v":0},{"$f":"'Shooter Information'!C55","v":0},null,null,null,null,null,null,null,0,{"$f":"IF('Shooter Information'!$E$3-('Shooter Information'!$G$3-RANK(K53,K$4:K$78,1))<0,0,'Shooter Information'!$E$3-('Shooter Information'!$G$3-RANK(K53,K$4:K$78,1)))","v":0},0]
[51,{"$f":"'Shooter Information'!B56","v":0},{"$f":"'Shooter Information'!C56","v":0},null,null,null,null,null,null,null,0,{"$f":"IF('Shooter Information'!$E$3-('Shooter Information'!$G$3-RANK(K54,K$4:K$78,1))<0,0,'Shooter Information'!$E$3-('Shooter Information'!$G$3-RANK(K54,K$4:K$78,1)))","v":0},0]
[52,{"$f":"'Shooter Information'!B57","v":0},{"$f":"'Shooter Information'!C57","v":0},null,null,null,null,null,null,null,0,{"$f":"IF('Shooter Information'!$E$3-('Shooter Information'!$G$3-RANK(K55,K$4:K$78,1))<0,0,'Shooter Information'!$E$3-('Shooter Information'!$G$3-RANK(K55,K$4:K$78,1)))","v":0},0]
[53,{"$f":"'Shooter Information'!B58","v":0},{"$f":"'Shooter Information'!C58","v":0},null,null,null,null,null,null,null,0,{"$f":"IF('Shooter Information'!$E$3-('Shooter Information'!$G$3-RANK(K56,K$4:K$78,1))<0,0,'Shooter Information'!$E$3-('Shooter Information'!$G$3-RANK(K56,K$4:K$78,1)))","v":0},0]
[54,{"$f":"'Shooter Information'!B59","v":0},{"$f":"'Shooter Information'!C59","v":0},null,null,null,null,null,null,null,0,{"$f":"IF('Shooter Information'!$E$3-('Shooter Information'!$G$3-RANK(K57,K$4:K$78,1))<0,0,'Shooter Information'!$E$3-('Shooter Information'!$G$3-RANK(K57,K$4:K$78,1)))","v":0},0]
[55,{"$f":"'Shooter Information'!B60","v":0},{"$f":"'Shooter Information'!C60","v":0},null,null,null,null,null,null,null,0,{"$f":"IF('Shooter Information'!$E$3-('Shooter Information'!$G$3-RANK(K58,K$4:K$78,1))<0,0,'Shooter Information'!$E$3-('Shooter Information'!$G$3-RANK(K58,K$4:K$78,1)))","v":0},0]
[56,{"$f":"'Shooter Information'!B61","v":0},{"$f":"'Shooter Information'!C61","v":0},null,null,null,null,null,null,null,0,{"$f":"IF('Shooter Information'!$E$3-('Shooter Information'!$G$3-RANK(K59,K$4:K$78,1))<0,0,'Shooter Information'!$E$3-('Shooter Information'!$G$3-RANK(K59,K$4:K$78,1)))","v":0},0]
[57,{"$f":"'Shooter Information'!B62","v":0},{"$f":"'Shooter Information'!C62","v":0},null,null,null,null,null,null,null,0,{"$f":"IF('Shooter Information'!$E$3-('Shooter Information'!$G$3-RANK(K60,K$4:K$78,1))<0,0,'Shooter Information'!$E$3-('Shooter Information'!$G$3-RANK(K60,K$4:K$78,1)))","v":0},0]
[58,{"$f":"'Shooter Information'!B63","v":0},{"$f":"'Shooter Information'!C63","v":0},null,null,null,null,null,null,null,0,{"$f":"IF('Shooter Information'!$E$3-('Shooter Information'!$G$3-RANK(K61,K$4:K$78,1))<0,0,'Shooter Information'!$E$3-('Shooter Information'!$G$3-RANK(K61,K$4:K$78,1)))","v":0},0]
[59,{"$f":"'Shooter Information'!B64","v":0},{"$f":"'Shooter Information'!C64","v":0},null,null,null,null,null,null,null,0,{"$f":"IF('Shooter Information'!$E$3-('Shooter Information'!$G$3-RANK(K62,K$4:K$78,1))<0,0,'Shooter Information'!$E$3-('Shooter Information'!$G$3-RANK(K62,K$4:K$78,1)))","v":0},0]
[60,{"$f":"'Shooter Information'!B65","v":0},{"$f":"'Shooter Information'!C65","v":0},null,null,null,null,null,null,null,0,{"$f":"IF('Shooter Information'!$E$3-('Shooter Information'!$G$3-RANK(K63,K$4:K$78,1))<0,0,'Shooter Information'!$E$3-('Shooter Information'!$G$3-RANK(K63,K$4:K$78,1)))","v":0},0]
[61,{"$f":"'Shooter Information'!B66","v":0},{"$f":"'Shooter Information'!C66","v":0},null,null,null,null,null,null,null,0,{"$f":"IF('Shooter Information'!$E$3-('Shooter Information'!$G$3-RANK(K64,K$4:K$78,1))<0,0,'Shooter Information'!$E$3-('Shooter Information'!$G$3-RANK(K64,K$4:K$78,1)))","v":0},0]
[62,{"$f":"'Shooter Information'!B67","v":0},{"$f":"'Shooter Information'!C67","v":0},null,null,null,null,null,null,null,0,{"$f":"IF('Shooter Information'!$E$3-('Shooter Information'!$G$3-RANK(K65,K$4:K$78,1))<0,0,'Shooter Information'!$E$3-('Shooter Information'!$G$3-RANK(K65,K$4:K$78,1)))","v":0},0]
[63,{"$f":"'Shooter Information'!B68","v":0},{"$f":"'Shooter Information'!C68","v":0},null,null,null,null,null,null,null,0,{"$f":"IF('Shooter Information'!$E$3-('Shooter Information'!$G$3-RANK(K66,K$4:K$78,1))<0,0,'Shooter Information'!$E$3-('Shooter Information'!$G$3-RANK(K66,K$4:K$78,1)))","v":0},0]
[64,{"$f":"'Shooter Information'!B69","v":0},{"$f":"'Shooter Information'!C69","v":0},null,null,null,null,null,null,null,0,{"$f":"IF('Shooter Information'!$E$3-('Shooter Information'!$G$3-RANK(K67,K$4:K$78,1))<0,0,'Shooter Information'!$E$3-('Shooter Information'!$G$3-RANK(K67,K$4:K$78,1)))","v":0},0]
[65,{"$f":"'Shooter Information'!B70","v":0},{"$f":"'Shooter Information'!C70","v":0},null,null,null,null,null,null,null,0,{"$f":"IF('Shooter Information'!$E$3-('Shooter Information'!$G$3-RANK(K68,K$4:K$78,1))<0,0,'Shooter Information'!$E$3-('Shooter Information'!$G$3-RANK(K68,K$4:K$78,1)))","v":0},0]
[66,{"$f":"'Shooter Information'!B71","v":0},{"$f":"'Shooter Information'!C71","v":0},null,null,null,null,null,null,null,{"$f":"(D69*5)+E69-F69+(G69*10)+(H69*30)+(I69*999)+(J69*999.99)","v":0},{"$f":"IF('Shooter Information'!$E$3-('Shooter Information'!$G$3-RANK(K69,K$4:K$78,1))<0,0,'Shooter Information'!$E$3-('Shooter Information'!$G$3-RANK(K69,K$4:K$78,1)))","v":0},{"$f":"(SUM(D69+G69+H69+I69+J69))","v":0}]
[67,{"$f":"'Shooter Information'!B72","v":0},{"$f":"'Shooter Information'!C72","v":0},null,null,null,null,null,null,null,0,{"$f":"IF('Shooter Information'!$E$3-('Shooter Information'!$G$3-RANK(K70,K$4:K$78,1))<0,0,'Shooter Information'!$E$3-('Shooter Information'!$G$3-RANK(K70,K$4:K$78,1)))","v":0},0]
[68,{"$f":"'Shooter Information'!B73","v":0},{"$f":"'Shooter Information'!C73","v":0},null,null,null,null,null,null,null,0,{"$f":"IF('Shooter Information'!$E$3-('Shooter Information'!$G$3-RANK(K71,K$4:K$78,1))<0,0,'Shooter Information'!$E$3-('Shooter Information'!$G$3-RANK(K71,K$4:K$78,1)))","v":0},0]
[69,{"$f":"'Shooter Information'!B74","v":0},{"$f":"'Shooter Information'!C74","v":0},null,null,null,null,null,null,null,0,{"$f":"IF('Shooter Information'!$E$3-('Shooter Information'!$G$3-RANK(K72,K$4:K$78,1))<0,0,'Shooter Information'!$E$3-('Shooter Information'!$G$3-RANK(K72,K$4:K$78,1)))","v":0},0]
[70,{"$f":"'Shooter Information'!B75","v":0},{"$f":"'Shooter Information'!C75","v":0},null,null,null,null,null,null,null,0,{"$f":"IF('Shooter Information'!$E$3-('Shooter Information'!$G$3-RANK(K73,K$4:K$78,1))<0,0,'Shooter Information'!$E$3-('Shooter Information'!$G$3-RANK(K73,K$4:K$78,1)))","v":0},0]
[71,{"$f":"'Shooter Information'!B76","v":0},{"$f":"'Shooter Information'!C76","v":0},null,null,null,null,null,null,null,0,{"$f":"IF('Shooter Information'!$E$3-('Shooter Information'!$G$3-RANK(K74,K$4:K$78,1))<0,0,'Shooter Information'!$E$3-('Shooter Information'!$G$3-RANK(K74,K$4:K$78,1)))","v":0},0]
[72,{"$f":"'Shooter Information'!B77","v":0},{"$f":"'Shooter Information'!C77","v":0},null,null,null,null,null,null,null,0,{"$f":"IF('Shooter Information'!$E$3-('Shooter Information'!$G$3-RANK(K75,K$4:K$78,1))<0,0,'Shooter Information'!$E$3-('Shooter Information'!$G$3-RANK(K75,K$4:K$78,1)))","v":0},0]
[73,{"$f":"'Shooter Information'!B78","v":0},{"$f":"'Shooter Information'!C78","v":0},null,null,null,null,null,null,null,0,{"$f":"IF('Shooter Information'!$E$3-('Shooter Information'!$G$3-RANK(K76,K$4:K$78,1))<0,0,'Shooter Information'!$E$3-('Shooter Information'!$G$3-RANK(K76,K$4:K$78,1)))","v":0},0]
[74,{"$f":"'Shooter Information'!B79","v":0},{"$f":"'Shooter Information'!C79","v":0},null,null,null,null,null,null,null,0,{"$f":"IF('Shooter Information'!$E$3-('Shooter Information'!$G$3-RANK(K77,K$4:K$78,1))<0,0,'Shooter Information'!$E$3-('Shooter Information'!$G$3-RANK(K77,K$4:K$78,1)))","v":0},0]
[75,{"$f":"'Shooter Information'!B80","v":0},{"$f":"'Shooter Information'!C80","v":0},null,null,null,null,null,null,null,0,{"$f":"IF('Shooter Information'!$E$3-('Shooter Information'!$G$3-RANK(K78,K$4:K$78,1))<0,0,'Shooter Information'!$E$3-('Shooter Information'!$G$3-RANK(K78,K$4:K$78,1)))","v":0},0]

{"sheet":"Stage 10","index":10,"n_rows":78,"n_cols":13,"rows_kept":78,"cut":false,"hidden":true,"merged":[]}
[null,"CAS SCORE SHEET"]
[null,"Stage 10"]
["Roster #","Shooter","Class","Misses","Raw Time","Bonus","10 Sec","30 Sec","DNF","DQ","Total","Rank","Penalties"]
[{"$f":"ROW()-3","v":1},{"$f":"'Shooter Information'!B6","v":"Striker"},{"$f":"'Shooter Information'!C6","v":"GF"},null,null,null,null,null,null,null,{"$f":"(D4*5)+E4-F4+(G4*10)+(H4*30)+(I4*999)+(J4*999.99)","v":0},{"$f":"IF('Shooter Information'!$E$3-('Shooter Information'!$G$3-RANK(K4,K$4:K$78,1))<0,0,'Shooter Information'!$E$3-('Shooter Information'!$G$3-RANK(K4,K$4:K$78,1)))","v":0},{"$f":"(SUM(D4+G4+H4+I4+J4))","v":0}]
[{"$f":"ROW()-3","v":2},{"$f":"'Shooter Information'!B7","v":"Lefty Spurmaker"},{"$f":"'Shooter Information'!C7","v":49},null,null,null,null,null,null,null,{"$f":"(D5*5)+E5-F5+(G5*10)+(H5*30)+(I5*999)+(J5*999.99)","v":0},{"$f":"IF('Shooter Information'!$E$3-('Shooter Information'!$G$3-RANK(K5,K$4:K$78,1))<0,0,'Shooter Information'!$E$3-('Shooter Information'!$G$3-RANK(K5,K$4:K$78,1)))","v":0},{"$f":"(SUM(D5+G5+H5+I5+J5))","v":0}]
[3,{"$f":"'Shooter Information'!B8","v":"Hotshod"},{"$f":"'Shooter Information'!C8","v":"W"},null,null,null,null,null,null,null,0,{"$f":"IF('Shooter Information'!$E$3-('Shooter Information'!$G$3-RANK(K6,K$4:K$78,1))<0,0,'Shooter Information'!$E$3-('Shooter Information'!$G$3-RANK(K6,K$4:K$78,1)))","v":0},0]
[4,{"$f":"'Shooter Information'!B9","v":"Swifty McDraw"},{"$f":"'Shooter Information'!C9","v":"SS"},null,null,null,null,null,null,null,0,{"$f":"IF('Shooter Information'!$E$3-('Shooter Information'!$G$3-RANK(K7,K$4:K$78,1))<0,0,'Shooter Information'!$E$3-('Shooter Information'!$G$3-RANK(K7,K$4:K$78,1)))","v":0},0]
[5,{"$f":"'Shooter Information'!B10","v":"Prairie City Slim"},{"$f":"'Shooter Information'!C10","v":"SS"},null,null,null,null,null,null,null,0,{"$f":"IF('Shooter Information'!$E$3-('Shooter Information'!$G$3-RANK(K8,K$4:K$78,1))<0,0,'Shooter Information'!$E$3-('Shooter Information'!$G$3-RANK(K8,K$4:K$78,1)))","v":0},0]
[6,{"$f":"'Shooter Information'!B11","v":"Enid City Kid"},{"$f":"'Shooter Information'!C11","v":"FC"},null,null,null,null,null,null,null,0,{"$f":"IF('Shooter Information'!$E$3-('Shooter Information'!$G$3-RANK(K9,K$4:K$78,1))<0,0,'Shooter Information'!$E$3-('Shooter Information'!$G$3-RANK(K9,K$4:K$78,1)))","v":0},0]
[7,{"$f":"'Shooter Information'!B12","v":"Cockroach"},{"$f":"'Shooter Information'!C12","v":"CB"},null,null,null,null,null,null,null,0,{"$f":"IF('Shooter Information'!$E$3-('Shooter Information'!$G$3-RANK(K10,K$4:K$78,1))<0,0,'Shooter Information'!$E$3-('Shooter Information'!$G$3-RANK(K10,K$4:K$78,1)))","v":0},0]
[8,{"$f":"'Shooter Information'!B13","v":"Kuba Kid"},{"$f":"'Shooter Information'!C13","v":"D"},null,null,null,null,null,null,null,0,{"$f":"IF('Shooter Information'!$E$3-('Shooter Information'!$G$3-RANK(K11,K$4:K$78,1))<0,0,'Shooter Information'!$E$3-('Shooter Information'!$G$3-RANK(K11,K$4:K$78,1)))","v":0},0]
[9,{"$f":"'Shooter Information'!B14","v":"Beartooth"},{"$f":"'Shooter Information'!C14","v":"S"},null,null,null,null,null,null,null,0,{"$f":"IF('Shooter Information'!$E$3-('Shooter Information'!$G$3-RANK(K12,K$4:K$78,1))<0,0,'Shooter Information'!$E$3-('Shooter Information'!$G$3-RANK(K12,K$4:K$78,1)))","v":0},0]
[10,{"$f":"'Shooter Information'!B15","v":"Slick Rick"},{"$f":"'Shooter Information'!C15","v":"S"},null,null,null,null,null,null,null,0,{"$f":"IF('Shooter Information'!$E$3-('Shooter Information'!$G$3-RANK(K13,K$4:K$78,1))<0,0,'Shooter Information'!$E$3-('Shooter Information'!$G$3-RANK(K13,K$4:K$78,1)))","v":0},0]
[11,{"$f":"'Shooter Information'!B16","v":"Windhorse Rider"},{"$f":"'Shooter Information'!C16","v":"GF"},null,null,null,null,null,null,null,0,{"$f":"IF('Shooter Information'!$E$3-('Shooter Information'!$G$3-RANK(K14,K$4:K$78,1))<0,0,'Shooter Information'!$E$3-('Shooter Information'!$G$3-RANK(K14,K$4:K$78,1)))","v":0},0]
[12,{"$f":"'Shooter Information'!B17","v":"Justice Jack"},{"$f":"'Shooter Information'!C17","v":"SS"},null,null,null,null,null,null,null,0,{"$f":"IF('Shooter Information'!$E$3-('Shooter Information'!$G$3-RANK(K15,K$4:K$78,1))<0,0,'Shooter Information'!$E$3-('Shooter Information'!$G$3-RANK(K15,K$4:K$78,1)))","v":0},0]
[13,{"$f":"'Shooter Information'!B18","v":"B. S. Walker"},{"$f":"'Shooter Information'!C18","v":49},null,null,null,null,null,null,null,0,{"$f":"IF('Shooter Information'!$E$3-('Shooter Information'!$G$3-RANK(K16,K$4:K$78,1))<0,0,'Shooter Information'!$E$3-('Shooter Information'!$G$3-RANK(K16,K$4:K$78,1)))","v":0},0]
[14,{"$f":"'Shooter Information'!B19","v":"Red Cavanaugh"},{"$f":"'Shooter Information'!C19","v":49},null,null,null,null,null,null,null,0,{"$f":"IF('Shooter Information'!$E$3-('Shooter Information'!$G$3-RANK(K17,K$4:K$78,1))<0,0,'Shooter Information'!$E$3-('Shooter Information'!$G$3-RANK(K17,K$4:K$78,1)))","v":0},0]
[15,{"$f":"'Shooter Information'!B20","v":"Deringer Dan"},{"$f":"'Shooter Information'!C20","v":49},null,null,null,null,null,null,null,0,{"$f":"IF('Shooter Information'!$E$3-('Shooter Information'!$G$3-RANK(K18,K$4:K$78,1))<0,0,'Shooter Information'!$E$3-('Shooter Information'!$G$3-RANK(K18,K$4:K$78,1)))","v":0},0]
[16,{"$f":"'Shooter Information'!B21","v":0},{"$f":"'Shooter Information'!C21","v":0},null,null,null,null,null,null,null,0,{"$f":"IF('Shooter Information'!$E$3-('Shooter Information'!$G$3-RANK(K19,K$4:K$78,1))<0,0,'Shooter Information'!$E$3-('Shooter Information'!$G$3-RANK(K19,K$4:K$78,1)))","v":0},0]
[17,{"$f":"'Shooter Information'!B22","v":0},{"$f":"'Shooter Information'!C22","v":0},null,null,null,null,null,null,null,0,{"$f":"IF('Shooter Information'!$E$3-('Shooter Information'!$G$3-RANK(K20,K$4:K$78,1))<0,0,'Shooter Information'!$E$3-('Shooter Information'!$G$3-RANK(K20,K$4:K$78,1)))","v":0},0]
[18,{"$f":"'Shooter Information'!B23","v":0},{"$f":"'Shooter Information'!C23","v":0},null,null,null,null,null,null,null,0,{"$f":"IF('Shooter Information'!$E$3-('Shooter Information'!$G$3-RANK(K21,K$4:K$78,1))<0,0,'Shooter Information'!$E$3-('Shooter Information'!$G$3-RANK(K21,K$4:K$78,1)))","v":0},0]
[19,{"$f":"'Shooter Information'!B24","v":0},{"$f":"'Shooter Information'!C24","v":0},null,null,null,null,null,null,null,0,{"$f":"IF('Shooter Information'!$E$3-('Shooter Information'!$G$3-RANK(K22,K$4:K$78,1))<0,0,'Shooter Information'!$E$3-('Shooter Information'!$G$3-RANK(K22,K$4:K$78,1)))","v":0},0]
[20,{"$f":"'Shooter Information'!B25","v":0},{"$f":"'Shooter Information'!C25","v":0},null,null,null,null,null,null,null,0,{"$f":"IF('Shooter Information'!$E$3-('Shooter Information'!$G$3-RANK(K23,K$4:K$78,1))<0,0,'Shooter Information'!$E$3-('Shooter Information'!$G$3-RANK(K23,K$4:K$78,1)))","v":0},0]
[21,{"$f":"'Shooter Information'!B26","v":0},{"$f":"'Shooter Information'!C26","v":0},null,null,null,null,null,null,null,0,{"$f":"IF('Shooter Information'!$E$3-('Shooter Information'!$G$3-RANK(K24,K$4:K$78,1))<0,0,'Shooter Information'!$E$3-('Shooter Information'!$G$3-RANK(K24,K$4:K$78,1)))","v":0},0]
[22,{"$f":"'Shooter Information'!B27","v":0},{"$f":"'Shooter Information'!C27","v":0},null,null,null,null,null,null,null,0,{"$f":"IF('Shooter Information'!$E$3-('Shooter Information'!$G$3-RANK(K25,K$4:K$78,1))<0,0,'Shooter Information'!$E$3-('Shooter Information'!$G$3-RANK(K25,K$4:K$78,1)))","v":0},0]
[23,{"$f":"'Shooter Information'!B28","v":0},{"$f":"'Shooter Information'!C28","v":0},null,null,null,null,null,null,null,0,{"$f":"IF('Shooter Information'!$E$3-('Shooter Information'!$G$3-RANK(K26,K$4:K$78,1))<0,0,'Shooter Information'!$E$3-('Shooter Information'!$G$3-RANK(K26,K$4:K$78,1)))","v":0},0]
[24,{"$f":"'Shooter Information'!B29","v":0},{"$f":"'Shooter Information'!C29","v":0},null,null,null,null,null,null,null,0,{"$f":"IF('Shooter Information'!$E$3-('Shooter Information'!$G$3-RANK(K27,K$4:K$78,1))<0,0,'Shooter Information'!$E$3-('Shooter Information'!$G$3-RANK(K27,K$4:K$78,1)))","v":0},0]
[25,{"$f":"'Shooter Information'!B30","v":0},{"$f":"'Shooter Information'!C30","v":0},null,null,null,null,null,null,null,0,{"$f":"IF('Shooter Information'!$E$3-('Shooter Information'!$G$3-RANK(K28,K$4:K$78,1))<0,0,'Shooter Information'!$E$3-('Shooter Information'!$G$3-RANK(K28,K$4:K$78,1)))","v":0},0]
[26,{"$f":"'Shooter Information'!B31","v":0},{"$f":"'Shooter Information'!C31","v":0},null,null,null,null,null,null,null,0,{"$f":"IF('Shooter Information'!$E$3-('Shooter Information'!$G$3-RANK(K29,K$4:K$78,1))<0,0,'Shooter Information'!$E$3-('Shooter Information'!$G$3-RANK(K29,K$4:K$78,1)))","v":0},0]
[27,{"$f":"'Shooter Information'!B32","v":0},{"$f":"'Shooter Information'!C32","v":0},null,null,null,null,null,null,null,0,{"$f":"IF('Shooter Information'!$E$3-('Shooter Information'!$G$3-RANK(K30,K$4:K$78,1))<0,0,'Shooter Information'!$E$3-('Shooter Information'!$G$3-RANK(K30,K$4:K$78,1)))","v":0},0]
[28,{"$f":"'Shooter Information'!B33","v":0},{"$f":"'Shooter Information'!C33","v":0},null,null,null,null,null,null,null,0,{"$f":"IF('Shooter Information'!$E$3-('Shooter Information'!$G$3-RANK(K31,K$4:K$78,1))<0,0,'Shooter Information'!$E$3-('Shooter Information'!$G$3-RANK(K31,K$4:K$78,1)))","v":0},0]
[29,{"$f":"'Shooter Information'!B34","v":0},{"$f":"'Shooter Information'!C34","v":0},null,null,null,null,null,null,null,0,{"$f":"IF('Shooter Information'!$E$3-('Shooter Information'!$G$3-RANK(K32,K$4:K$78,1))<0,0,'Shooter Information'!$E$3-('Shooter Information'!$G$3-RANK(K32,K$4:K$78,1)))","v":0},0]
[30,{"$f":"'Shooter Information'!B35","v":0},{"$f":"'Shooter Information'!C35","v":0},null,null,null,null,null,null,null,0,{"$f":"IF('Shooter Information'!$E$3-('Shooter Information'!$G$3-RANK(K33,K$4:K$78,1))<0,0,'Shooter Information'!$E$3-('Shooter Information'!$G$3-RANK(K33,K$4:K$78,1)))","v":0},0]
[31,{"$f":"'Shooter Information'!B36","v":0},{"$f":"'Shooter Information'!C36","v":0},null,null,null,null,null,null,null,0,{"$f":"IF('Shooter Information'!$E$3-('Shooter Information'!$G$3-RANK(K34,K$4:K$78,1))<0,0,'Shooter Information'!$E$3-('Shooter Information'!$G$3-RANK(K34,K$4:K$78,1)))","v":0},0]
[32,{"$f":"'Shooter Information'!B37","v":0},{"$f":"'Shooter Information'!C37","v":0},null,null,null,null,null,null,null,0,{"$f":"IF('Shooter Information'!$E$3-('Shooter Information'!$G$3-RANK(K35,K$4:K$78,1))<0,0,'Shooter Information'!$E$3-('Shooter Information'!$G$3-RANK(K35,K$4:K$78,1)))","v":0},0]
[33,{"$f":"'Shooter Information'!B38","v":0},{"$f":"'Shooter Information'!C38","v":0},null,null,null,null,null,null,null,0,{"$f":"IF('Shooter Information'!$E$3-('Shooter Information'!$G$3-RANK(K36,K$4:K$78,1))<0,0,'Shooter Information'!$E$3-('Shooter Information'!$G$3-RANK(K36,K$4:K$78,1)))","v":0},0]
[34,{"$f":"'Shooter Information'!B39","v":0},{"$f":"'Shooter Information'!C39","v":0},null,null,null,null,null,null,null,0,{"$f":"IF('Shooter Information'!$E$3-('Shooter Information'!$G$3-RANK(K37,K$4:K$78,1))<0,0,'Shooter Information'!$E$3-('Shooter Information'!$G$3-RANK(K37,K$4:K$78,1)))","v":0},0]
[35,{"$f":"'Shooter Information'!B40","v":0},{"$f":"'Shooter Information'!C40","v":0},null,null,null,null,null,null,null,0,{"$f":"IF('Shooter Information'!$E$3-('Shooter Information'!$G$3-RANK(K38,K$4:K$78,1))<0,0,'Shooter Information'!$E$3-('Shooter Information'!$G$3-RANK(K38,K$4:K$78,1)))","v":0},0]
[36,{"$f":"'Shooter Information'!B41","v":0},{"$f":"'Shooter Information'!C41","v":0},null,null,null,null,null,null,null,0,{"$f":"IF('Shooter Information'!$E$3-('Shooter Information'!$G$3-RANK(K39,K$4:K$78,1))<0,0,'Shooter Information'!$E$3-('Shooter Information'!$G$3-RANK(K39,K$4:K$78,1)))","v":0},0]
[37,{"$f":"'Shooter Information'!B42","v":0},{"$f":"'Shooter Information'!C42","v":0},null,null,null,null,null,null,null,0,{"$f":"IF('Shooter Information'!$E$3-('Shooter Information'!$G$3-RANK(K40,K$4:K$78,1))<0,0,'Shooter Information'!$E$3-('Shooter Information'!$G$3-RANK(K40,K$4:K$78,1)))","v":0},0]
[38,{"$f":"'Shooter Information'!B43","v":0},{"$f":"'Shooter Information'!C43","v":0},null,null,null,null,null,null,null,0,{"$f":"IF('Shooter Information'!$E$3-('Shooter Information'!$G$3-RANK(K41,K$4:K$78,1))<0,0,'Shooter Information'!$E$3-('Shooter Information'!$G$3-RANK(K41,K$4:K$78,1)))","v":0},0]
[39,{"$f":"'Shooter Information'!B44","v":0},{"$f":"'Shooter Information'!C44","v":0},null,null,null,null,null,null,null,0,{"$f":"IF('Shooter Information'!$E$3-('Shooter Information'!$G$3-RANK(K42,K$4:K$78,1))<0,0,'Shooter Information'!$E$3-('Shooter Information'!$G$3-RANK(K42,K$4:K$78,1)))","v":0},0]
[40,{"$f":"'Shooter Information'!B45","v":0},{"$f":"'Shooter Information'!C45","v":0},null,null,null,null,null,null,null,0,{"$f":"IF('Shooter Information'!$E$3-('Shooter Information'!$G$3-RANK(K43,K$4:K$78,1))<0,0,'Shooter Information'!$E$3-('Shooter Information'!$G$3-RANK(K43,K$4:K$78,1)))","v":0},0]
[41,{"$f":"'Shooter Information'!B46","v":0},{"$f":"'Shooter Information'!C46","v":0},null,null,null,null,null,null,null,0,{"$f":"IF('Shooter Information'!$E$3-('Shooter Information'!$G$3-RANK(K44,K$4:K$78,1))<0,0,'Shooter Information'!$E$3-('Shooter Information'!$G$3-RANK(K44,K$4:K$78,1)))","v":0},0]
[42,{"$f":"'Shooter Information'!B47","v":0},{"$f":"'Shooter Information'!C47","v":0},null,null,null,null,null,null,null,0,{"$f":"IF('Shooter Information'!$E$3-('Shooter Information'!$G$3-RANK(K45,K$4:K$78,1))<0,0,'Shooter Information'!$E$3-('Shooter Information'!$G$3-RANK(K45,K$4:K$78,1)))","v":0},0]
[43,{"$f":"'Shooter Information'!B48","v":0},{"$f":"'Shooter Information'!C48","v":0},null,null,null,null,null,null,null,0,{"$f":"IF('Shooter Information'!$E$3-('Shooter Information'!$G$3-RANK(K46,K$4:K$78,1))<0,0,'Shooter Information'!$E$3-('Shooter Information'!$G$3-RANK(K46,K$4:K$78,1)))","v":0},0]
[44,{"$f":"'Shooter Information'!B49","v":0},{"$f":"'Shooter Information'!C49","v":0},null,null,null,null,null,null,null,0,{"$f":"IF('Shooter Information'!$E$3-('Shooter Information'!$G$3-RANK(K47,K$4:K$78,1))<0,0,'Shooter Information'!$E$3-('Shooter Information'!$G$3-RANK(K47,K$4:K$78,1)))","v":0},0]
[45,{"$f":"'Shooter Information'!B50","v":0},{"$f":"'Shooter Information'!C50","v":0},null,null,null,null,null,null,null,0,{"$f":"IF('Shooter Information'!$E$3-('Shooter Information'!$G$3-RANK(K48,K$4:K$78,1))<0,0,'Shooter Information'!$E$3-('Shooter Information'!$G$3-RANK(K48,K$4:K$78,1)))","v":0},0]
[46,{"$f":"'Shooter Information'!B51","v":0},{"$f":"'Shooter Information'!C51","v":0},null,null,null,null,null,null,null,0,{"$f":"IF('Shooter Information'!$E$3-('Shooter Information'!$G$3-RANK(K49,K$4:K$78,1))<0,0,'Shooter Information'!$E$3-('Shooter Information'!$G$3-RANK(K49,K$4:K$78,1)))","v":0},0]
[47,{"$f":"'Shooter Information'!B52","v":0},{"$f":"'Shooter Information'!C52","v":0},null,null,null,null,null,null,null,0,{"$f":"IF('Shooter Information'!$E$3-('Shooter Information'!$G$3-RANK(K50,K$4:K$78,1))<0,0,'Shooter Information'!$E$3-('Shooter Information'!$G$3-RANK(K50,K$4:K$78,1)))","v":0},0]
[48,{"$f":"'Shooter Information'!B53","v":0},{"$f":"'Shooter Information'!C53","v":0},null,null,null,null,null,null,null,0,{"$f":"IF('Shooter Information'!$E$3-('Shooter Information'!$G$3-RANK(K51,K$4:K$78,1))<0,0,'Shooter Information'!$E$3-('Shooter Information'!$G$3-RANK(K51,K$4:K$78,1)))","v":0},0]
[49,{"$f":"'Shooter Information'!B54","v":0},{"$f":"'Shooter Information'!C54","v":0},null,null,null,null,null,null,null,0,{"$f":"IF('Shooter Information'!$E$3-('Shooter Information'!$G$3-RANK(K52,K$4:K$78,1))<0,0,'Shooter Information'!$E$3-('Shooter Information'!$G$3-RANK(K52,K$4:K$78,1)))","v":0},0]
[50,{"$f":"'Shooter Information'!B55","v":0},{"$f":"'Shooter Information'!C55","v":0},null,null,null,null,null,null,null,0,{"$f":"IF('Shooter Information'!$E$3-('Shooter Information'!$G$3-RANK(K53,K$4:K$78,1))<0,0,'Shooter Information'!$E$3-('Shooter Information'!$G$3-RANK(K53,K$4:K$78,1)))","v":0},0]
[51,{"$f":"'Shooter Information'!B56","v":0},{"$f":"'Shooter Information'!C56","v":0},null,null,null,null,null,null,null,0,{"$f":"IF('Shooter Information'!$E$3-('Shooter Information'!$G$3-RANK(K54,K$4:K$78,1))<0,0,'Shooter Information'!$E$3-('Shooter Information'!$G$3-RANK(K54,K$4:K$78,1)))","v":0},0]
[52,{"$f":"'Shooter Information'!B57","v":0},{"$f":"'Shooter Information'!C57","v":0},null,null,null,null,null,null,null,0,{"$f":"IF('Shooter Information'!$E$3-('Shooter Information'!$G$3-RANK(K55,K$4:K$78,1))<0,0,'Shooter Information'!$E$3-('Shooter Information'!$G$3-RANK(K55,K$4:K$78,1)))","v":0},0]
[53,{"$f":"'Shooter Information'!B58","v":0},{"$f":"'Shooter Information'!C58","v":0},null,null,null,null,null,null,null,0,{"$f":"IF('Shooter Information'!$E$3-('Shooter Information'!$G$3-RANK(K56,K$4:K$78,1))<0,0,'Shooter Information'!$E$3-('Shooter Information'!$G$3-RANK(K56,K$4:K$78,1)))","v":0},0]
[54,{"$f":"'Shooter Information'!B59","v":0},{"$f":"'Shooter Information'!C59","v":0},null,null,null,null,null,null,null,0,{"$f":"IF('Shooter Information'!$E$3-('Shooter Information'!$G$3-RANK(K57,K$4:K$78,1))<0,0,'Shooter Information'!$E$3-('Shooter Information'!$G$3-RANK(K57,K$4:K$78,1)))","v":0},0]
[55,{"$f":"'Shooter Information'!B60","v":0},{"$f":"'Shooter Information'!C60","v":0},null,null,null,null,null,null,null,0,{"$f":"IF('Shooter Information'!$E$3-('Shooter Information'!$G$3-RANK(K58,K$4:K$78,1))<0,0,'Shooter Information'!$E$3-('Shooter Information'!$G$3-RANK(K58,K$4:K$78,1)))","v":0},0]
[56,{"$f":"'Shooter Information'!B61","v":0},{"$f":"'Shooter Information'!C61","v":0},null,null,null,null,null,null,null,0,{"$f":"IF('Shooter Information'!$E$3-('Shooter Information'!$G$3-RANK(K59,K$4:K$78,1))<0,0,'Shooter Information'!$E$3-('Shooter Information'!$G$3-RANK(K59,K$4:K$78,1)))","v":0},0]
[57,{"$f":"'Shooter Information'!B62","v":0},{"$f":"'Shooter Information'!C62","v":0},null,null,null,null,null,null,null,0,{"$f":"IF('Shooter Information'!$E$3-('Shooter Information'!$G$3-RANK(K60,K$4:K$78,1))<0,0,'Shooter Information'!$E$3-('Shooter Information'!$G$3-RANK(K60,K$4:K$78,1)))","v":0},0]
[58,{"$f":"'Shooter Information'!B63","v":0},{"$f":"'Shooter Information'!C63","v":0},null,null,null,null,null,null,null,0,{"$f":"IF('Shooter Information'!$E$3-('Shooter Information'!$G$3-RANK(K61,K$4:K$78,1))<0,0,'Shooter Information'!$E$3-('Shooter Information'!$G$3-RANK(K61,K$4:K$78,1)))","v":0},0]
[59,{"$f":"'Shooter Information'!B64","v":0},{"$f":"'Shooter Information'!C64","v":0},null,null,null,null,null,null,null,0,{"$f":"IF('Shooter Information'!$E$3-('Shooter Information'!$G$3-RANK(K62,K$4:K$78,1))<0,0,'Shooter Information'!$E$3-('Shooter Information'!$G$3-RANK(K62,K$4:K$78,1)))","v":0},0]
[60,{"$f":"'Shooter Information'!B65","v":0},{"$f":"'Shooter Information'!C65","v":0},null,null,null,null,null,null,null,0,{"$f":"IF('Shooter Information'!$E$3-('Shooter Information'!$G$3-RANK(K63,K$4:K$78,1))<0,0,'Shooter Information'!$E$3-('Shooter Information'!$G$3-RANK(K63,K$4:K$78,1)))","v":0},0]
[61,{"$f":"'Shooter Information'!B66","v":0},{"$f":"'Shooter Information'!C66","v":0},null,null,null,null,null,null,null,0,{"$f":"IF('Shooter Information'!$E$3-('Shooter Information'!$G$3-RANK(K64,K$4:K$78,1))<0,0,'Shooter Information'!$E$3-('Shooter Information'!$G$3-RANK(K64,K$4:K$78,1)))","v":0},0]
[62,{"$f":"'Shooter Information'!B67","v":0},{"$f":"'Shooter Information'!C67","v":0},null,null,null,null,null,null,null,0,{"$f":"IF('Shooter Information'!$E$3-('Shooter Information'!$G$3-RANK(K65,K$4:K$78,1))<0,0,'Shooter Information'!$E$3-('Shooter Information'!$G$3-RANK(K65,K$4:K$78,1)))","v":0},0]
[63,{"$f":"'Shooter Information'!B68","v":0},{"$f":"'Shooter Information'!C68","v":0},null,null,null,null,null,null,null,0,{"$f":"IF('Shooter Information'!$E$3-('Shooter Information'!$G$3-RANK(K66,K$4:K$78,1))<0,0,'Shooter Information'!$E$3-('Shooter Information'!$G$3-RANK(K66,K$4:K$78,1)))","v":0},0]
[64,{"$f":"'Shooter Information'!B69","v":0},{"$f":"'Shooter Information'!C69","v":0},null,null,null,null,null,null,null,0,{"$f":"IF('Shooter Information'!$E$3-('Shooter Information'!$G$3-RANK(K67,K$4:K$78,1))<0,0,'Shooter Information'!$E$3-('Shooter Information'!$G$3-RANK(K67,K$4:K$78,1)))","v":0},0]
[65,{"$f":"'Shooter Information'!B70","v":0},{"$f":"'Shooter Information'!C70","v":0},null,null,null,null,null,null,null,0,{"$f":"IF('Shooter Information'!$E$3-('Shooter Information'!$G$3-RANK(K68,K$4:K$78,1))<0,0,'Shooter Information'!$E$3-('Shooter Information'!$G$3-RANK(K68,K$4:K$78,1)))","v":0},0]
[66,{"$f":"'Shooter Information'!B71","v":0},{"$f":"'Shooter Information'!C71","v":0},null,null,null,null,null,null,null,{"$f":"(D69*5)+E69-F69+(G69*10)+(H69*30)+(I69*999)+(J69*999.99)","v":0},{"$f":"IF('Shooter Information'!$E$3-('Shooter Information'!$G$3-RANK(K69,K$4:K$78,1))<0,0,'Shooter Information'!$E$3-('Shooter Information'!$G$3-RANK(K69,K$4:K$78,1)))","v":0},{"$f":"(SUM(D69+G69+H69+I69+J69))","v":0}]
[67,{"$f":"'Shooter Information'!B72","v":0},{"$f":"'Shooter Information'!C72","v":0},null,null,null,null,null,null,null,0,{"$f":"IF('Shooter Information'!$E$3-('Shooter Information'!$G$3-RANK(K70,K$4:K$78,1))<0,0,'Shooter Information'!$E$3-('Shooter Information'!$G$3-RANK(K70,K$4:K$78,1)))","v":0},0]
[68,{"$f":"'Shooter Information'!B73","v":0},{"$f":"'Shooter Information'!C73","v":0},null,null,null,null,null,null,null,0,{"$f":"IF('Shooter Information'!$E$3-('Shooter Information'!$G$3-RANK(K71,K$4:K$78,1))<0,0,'Shooter Information'!$E$3-('Shooter Information'!$G$3-RANK(K71,K$4:K$78,1)))","v":0},0]
[69,{"$f":"'Shooter Information'!B74","v":0},{"$f":"'Shooter Information'!C74","v":0},null,null,null,null,null,null,null,0,{"$f":"IF('Shooter Information'!$E$3-('Shooter Information'!$G$3-RANK(K72,K$4:K$78,1))<0,0,'Shooter Information'!$E$3-('Shooter Information'!$G$3-RANK(K72,K$4:K$78,1)))","v":0},0]
[70,{"$f":"'Shooter Information'!B75","v":0},{"$f":"'Shooter Information'!C75","v":0},null,null,null,null,null,null,null,0,{"$f":"IF('Shooter Information'!$E$3-('Shooter Information'!$G$3-RANK(K73,K$4:K$78,1))<0,0,'Shooter Information'!$E$3-('Shooter Information'!$G$3-RANK(K73,K$4:K$78,1)))","v":0},0]
[71,{"$f":"'Shooter Information'!B76","v":0},{"$f":"'Shooter Information'!C76","v":0},null,null,null,null,null,null,null,0,{"$f":"IF('Shooter Information'!$E$3-('Shooter Information'!$G$3-RANK(K74,K$4:K$78,1))<0,0,'Shooter Information'!$E$3-('Shooter Information'!$G$3-RANK(K74,K$4:K$78,1)))","v":0},0]
[72,{"$f":"'Shooter Information'!B77","v":0},{"$f":"'Shooter Information'!C77","v":0},null,null,null,null,null,null,null,0,{"$f":"IF('Shooter Information'!$E$3-('Shooter Information'!$G$3-RANK(K75,K$4:K$78,1))<0,0,'Shooter Information'!$E$3-('Shooter Information'!$G$3-RANK(K75,K$4:K$78,1)))","v":0},0]
[73,{"$f":"'Shooter Information'!B78","v":0},{"$f":"'Shooter Information'!C78","v":0},null,null,null,null,null,null,null,0,{"$f":"IF('Shooter Information'!$E$3-('Shooter Information'!$G$3-RANK(K76,K$4:K$78,1))<0,0,'Shooter Information'!$E$3-('Shooter Information'!$G$3-RANK(K76,K$4:K$78,1)))","v":0},0]
[74,{"$f":"'Shooter Information'!B79","v":0},{"$f":"'Shooter Information'!C79","v":0},null,null,null,null,null,null,null,0,{"$f":"IF('Shooter Information'!$E$3-('Shooter Information'!$G$3-RANK(K77,K$4:K$78,1))<0,0,'Shooter Information'!$E$3-('Shooter Information'!$G$3-RANK(K77,K$4:K$78,1)))","v":0},0]
[75,{"$f":"'Shooter Information'!B80","v":0},{"$f":"'Shooter Information'!C80","v":0},null,null,null,null,null,null,null,0,{"$f":"IF('Shooter Information'!$E$3-('Shooter Information'!$G$3-RANK(K78,K$4:K$78,1))<0,0,'Shooter Information'!$E$3-('Shooter Information'!$G$3-RANK(K78,K$4:K$78,1)))","v":0},0]

{"sheet":"Stage 11","index":11,"n_rows":78,"n_cols":13,"rows_kept":78,"cut":false,"hidden":true,"merged":[]}
[null,"CAS SCORE SHEET"]
[null,"Stage 11"]
["Roster #","Shooter","Class","Misses","Raw Time","Bonus","10 Sec","30 Sec","DNF","DQ","Total","Rank","Penalties"]
[{"$f":"ROW()-3","v":1},{"$f":"'Shooter Information'!B6","v":"Striker"},{"$f":"'Shooter Information'!C6","v":"GF"},null,null,null,null,null,null,null,{"$f":"(D4*5)+E4-F4+(G4*10)+(H4*30)+(I4*999)+(J4*999.99)","v":0},{"$f":"IF('Shooter Information'!$E$3-('Shooter Information'!$G$3-RANK(K4,K$4:K$78,1))<0,0,'Shooter Information'!$E$3-('Shooter Information'!$G$3-RANK(K4,K$4:K$78,1)))","v":0},{"$f":"(SUM(D4+G4+H4+I4+J4))","v":0}]
[{"$f":"ROW()-3","v":2},{"$f":"'Shooter Information'!B7","v":"Lefty Spurmaker"},{"$f":"'Shooter Information'!C7","v":49},null,null,null,null,null,null,null,{"$f":"(D5*5)+E5-F5+(G5*10)+(H5*30)+(I5*999)+(J5*999.99)","v":0},{"$f":"IF('Shooter Information'!$E$3-('Shooter Information'!$G$3-RANK(K5,K$4:K$78,1))<0,0,'Shooter Information'!$E$3-('Shooter Information'!$G$3-RANK(K5,K$4:K$78,1)))","v":0},{"$f":"(SUM(D5+G5+H5+I5+J5))","v":0}]
[3,{"$f":"'Shooter Information'!B8","v":"Hotshod"},{"$f":"'Shooter Information'!C8","v":"W"},null,null,null,null,null,null,null,0,{"$f":"IF('Shooter Information'!$E$3-('Shooter Information'!$G$3-RANK(K6,K$4:K$78,1))<0,0,'Shooter Information'!$E$3-('Shooter Information'!$G$3-RANK(K6,K$4:K$78,1)))","v":0},0]
[4,{"$f":"'Shooter Information'!B9","v":"Swifty McDraw"},{"$f":"'Shooter Information'!C9","v":"SS"},null,null,null,null,null,null,null,0,{"$f":"IF('Shooter Information'!$E$3-('Shooter Information'!$G$3-RANK(K7,K$4:K$78,1))<0,0,'Shooter Information'!$E$3-('Shooter Information'!$G$3-RANK(K7,K$4:K$78,1)))","v":0},0]
[5,{"$f":"'Shooter Information'!B10","v":"Prairie City Slim"},{"$f":"'Shooter Information'!C10","v":"SS"},null,null,null,null,null,null,null,0,{"$f":"IF('Shooter Information'!$E$3-('Shooter Information'!$G$3-RANK(K8,K$4:K$78,1))<0,0,'Shooter Information'!$E$3-('Shooter Information'!$G$3-RANK(K8,K$4:K$78,1)))","v":0},0]
[6,{"$f":"'Shooter Information'!B11","v":"Enid City Kid"},{"$f":"'Shooter Information'!C11","v":"FC"},null,null,null,null,null,null,null,0,{"$f":"IF('Shooter Information'!$E$3-('Shooter Information'!$G$3-RANK(K9,K$4:K$78,1))<0,0,'Shooter Information'!$E$3-('Shooter Information'!$G$3-RANK(K9,K$4:K$78,1)))","v":0},0]
[7,{"$f":"'Shooter Information'!B12","v":"Cockroach"},{"$f":"'Shooter Information'!C12","v":"CB"},null,null,null,null,null,null,null,0,{"$f":"IF('Shooter Information'!$E$3-('Shooter Information'!$G$3-RANK(K10,K$4:K$78,1))<0,0,'Shooter Information'!$E$3-('Shooter Information'!$G$3-RANK(K10,K$4:K$78,1)))","v":0},0]
[8,{"$f":"'Shooter Information'!B13","v":"Kuba Kid"},{"$f":"'Shooter Information'!C13","v":"D"},null,null,null,null,null,null,null,0,{"$f":"IF('Shooter Information'!$E$3-('Shooter Information'!$G$3-RANK(K11,K$4:K$78,1))<0,0,'Shooter Information'!$E$3-('Shooter Information'!$G$3-RANK(K11,K$4:K$78,1)))","v":0},0]
[9,{"$f":"'Shooter Information'!B14","v":"Beartooth"},{"$f":"'Shooter Information'!C14","v":"S"},null,null,null,null,null,null,null,0,{"$f":"IF('Shooter Information'!$E$3-('Shooter Information'!$G$3-RANK(K12,K$4:K$78,1))<0,0,'Shooter Information'!$E$3-('Shooter Information'!$G$3-RANK(K12,K$4:K$78,1)))","v":0},0]
[10,{"$f":"'Shooter Information'!B15","v":"Slick Rick"},{"$f":"'Shooter Information'!C15","v":"S"},null,null,null,null,null,null,null,0,{"$f":"IF('Shooter Information'!$E$3-('Shooter Information'!$G$3-RANK(K13,K$4:K$78,1))<0,0,'Shooter Information'!$E$3-('Shooter Information'!$G$3-RANK(K13,K$4:K$78,1)))","v":0},0]
[11,{"$f":"'Shooter Information'!B16","v":"Windhorse Rider"},{"$f":"'Shooter Information'!C16","v":"GF"},null,null,null,null,null,null,null,0,{"$f":"IF('Shooter Information'!$E$3-('Shooter Information'!$G$3-RANK(K14,K$4:K$78,1))<0,0,'Shooter Information'!$E$3-('Shooter Information'!$G$3-RANK(K14,K$4:K$78,1)))","v":0},0]
[12,{"$f":"'Shooter Information'!B17","v":"Justice Jack"},{"$f":"'Shooter Information'!C17","v":"SS"},null,null,null,null,null,null,null,0,{"$f":"IF('Shooter Information'!$E$3-('Shooter Information'!$G$3-RANK(K15,K$4:K$78,1))<0,0,'Shooter Information'!$E$3-('Shooter Information'!$G$3-RANK(K15,K$4:K$78,1)))","v":0},0]
[13,{"$f":"'Shooter Information'!B18","v":"B. S. Walker"},{"$f":"'Shooter Information'!C18","v":49},null,null,null,null,null,null,null,0,{"$f":"IF('Shooter Information'!$E$3-('Shooter Information'!$G$3-RANK(K16,K$4:K$78,1))<0,0,'Shooter Information'!$E$3-('Shooter Information'!$G$3-RANK(K16,K$4:K$78,1)))","v":0},0]
[14,{"$f":"'Shooter Information'!B19","v":"Red Cavanaugh"},{"$f":"'Shooter Information'!C19","v":49},null,null,null,null,null,null,null,0,{"$f":"IF('Shooter Information'!$E$3-('Shooter Information'!$G$3-RANK(K17,K$4:K$78,1))<0,0,'Shooter Information'!$E$3-('Shooter Information'!$G$3-RANK(K17,K$4:K$78,1)))","v":0},0]
[15,{"$f":"'Shooter Information'!B20","v":"Deringer Dan"},{"$f":"'Shooter Information'!C20","v":49},null,null,null,null,null,null,null,0,{"$f":"IF('Shooter Information'!$E$3-('Shooter Information'!$G$3-RANK(K18,K$4:K$78,1))<0,0,'Shooter Information'!$E$3-('Shooter Information'!$G$3-RANK(K18,K$4:K$78,1)))","v":0},0]
[16,{"$f":"'Shooter Information'!B21","v":0},{"$f":"'Shooter Information'!C21","v":0},null,null,null,null,null,null,null,0,{"$f":"IF('Shooter Information'!$E$3-('Shooter Information'!$G$3-RANK(K19,K$4:K$78,1))<0,0,'Shooter Information'!$E$3-('Shooter Information'!$G$3-RANK(K19,K$4:K$78,1)))","v":0},0]
[17,{"$f":"'Shooter Information'!B22","v":0},{"$f":"'Shooter Information'!C22","v":0},null,null,null,null,null,null,null,0,{"$f":"IF('Shooter Information'!$E$3-('Shooter Information'!$G$3-RANK(K20,K$4:K$78,1))<0,0,'Shooter Information'!$E$3-('Shooter Information'!$G$3-RANK(K20,K$4:K$78,1)))","v":0},0]
[18,{"$f":"'Shooter Information'!B23","v":0},{"$f":"'Shooter Information'!C23","v":0},null,null,null,null,null,null,null,0,{"$f":"IF('Shooter Information'!$E$3-('Shooter Information'!$G$3-RANK(K21,K$4:K$78,1))<0,0,'Shooter Information'!$E$3-('Shooter Information'!$G$3-RANK(K21,K$4:K$78,1)))","v":0},0]
[19,{"$f":"'Shooter Information'!B24","v":0},{"$f":"'Shooter Information'!C24","v":0},null,null,null,null,null,null,null,0,{"$f":"IF('Shooter Information'!$E$3-('Shooter Information'!$G$3-RANK(K22,K$4:K$78,1))<0,0,'Shooter Information'!$E$3-('Shooter Information'!$G$3-RANK(K22,K$4:K$78,1)))","v":0},0]
[20,{"$f":"'Shooter Information'!B25","v":0},{"$f":"'Shooter Information'!C25","v":0},null,null,null,null,null,null,null,0,{"$f":"IF('Shooter Information'!$E$3-('Shooter Information'!$G$3-RANK(K23,K$4:K$78,1))<0,0,'Shooter Information'!$E$3-('Shooter Information'!$G$3-RANK(K23,K$4:K$78,1)))","v":0},0]
[21,{"$f":"'Shooter Information'!B26","v":0},{"$f":"'Shooter Information'!C26","v":0},null,null,null,null,null,null,null,0,{"$f":"IF('Shooter Information'!$E$3-('Shooter Information'!$G$3-RANK(K24,K$4:K$78,1))<0,0,'Shooter Information'!$E$3-('Shooter Information'!$G$3-RANK(K24,K$4:K$78,1)))","v":0},0]
[22,{"$f":"'Shooter Information'!B27","v":0},{"$f":"'Shooter Information'!C27","v":0},null,null,null,null,null,null,null,0,{"$f":"IF('Shooter Information'!$E$3-('Shooter Information'!$G$3-RANK(K25,K$4:K$78,1))<0,0,'Shooter Information'!$E$3-('Shooter Information'!$G$3-RANK(K25,K$4:K$78,1)))","v":0},0]
[23,{"$f":"'Shooter Information'!B28","v":0},{"$f":"'Shooter Information'!C28","v":0},null,null,null,null,null,null,null,0,{"$f":"IF('Shooter Information'!$E$3-('Shooter Information'!$G$3-RANK(K26,K$4:K$78,1))<0,0,'Shooter Information'!$E$3-('Shooter Information'!$G$3-RANK(K26,K$4:K$78,1)))","v":0},0]
[24,{"$f":"'Shooter Information'!B29","v":0},{"$f":"'Shooter Information'!C29","v":0},null,null,null,null,null,null,null,0,{"$f":"IF('Shooter Information'!$E$3-('Shooter Information'!$G$3-RANK(K27,K$4:K$78,1))<0,0,'Shooter Information'!$E$3-('Shooter Information'!$G$3-RANK(K27,K$4:K$78,1)))","v":0},0]
[25,{"$f":"'Shooter Information'!B30","v":0},{"$f":"'Shooter Information'!C30","v":0},null,null,null,null,null,null,null,0,{"$f":"IF('Shooter Information'!$E$3-('Shooter Information'!$G$3-RANK(K28,K$4:K$78,1))<0,0,'Shooter Information'!$E$3-('Shooter Information'!$G$3-RANK(K28,K$4:K$78,1)))","v":0},0]
[26,{"$f":"'Shooter Information'!B31","v":0},{"$f":"'Shooter Information'!C31","v":0},null,null,null,null,null,null,null,0,{"$f":"IF('Shooter Information'!$E$3-('Shooter Information'!$G$3-RANK(K29,K$4:K$78,1))<0,0,'Shooter Information'!$E$3-('Shooter Information'!$G$3-RANK(K29,K$4:K$78,1)))","v":0},0]
[27,{"$f":"'Shooter Information'!B32","v":0},{"$f":"'Shooter Information'!C32","v":0},null,null,null,null,null,null,null,0,{"$f":"IF('Shooter Information'!$E$3-('Shooter Information'!$G$3-RANK(K30,K$4:K$78,1))<0,0,'Shooter Information'!$E$3-('Shooter Information'!$G$3-RANK(K30,K$4:K$78,1)))","v":0},0]
[28,{"$f":"'Shooter Information'!B33","v":0},{"$f":"'Shooter Information'!C33","v":0},null,null,null,null,null,null,null,0,{"$f":"IF('Shooter Information'!$E$3-('Shooter Information'!$G$3-RANK(K31,K$4:K$78,1))<0,0,'Shooter Information'!$E$3-('Shooter Information'!$G$3-RANK(K31,K$4:K$78,1)))","v":0},0]
[29,{"$f":"'Shooter Information'!B34","v":0},{"$f":"'Shooter Information'!C34","v":0},null,null,null,null,null,null,null,0,{"$f":"IF('Shooter Information'!$E$3-('Shooter Information'!$G$3-RANK(K32,K$4:K$78,1))<0,0,'Shooter Information'!$E$3-('Shooter Information'!$G$3-RANK(K32,K$4:K$78,1)))","v":0},0]
[30,{"$f":"'Shooter Information'!B35","v":0},{"$f":"'Shooter Information'!C35","v":0},null,null,null,null,null,null,null,0,{"$f":"IF('Shooter Information'!$E$3-('Shooter Information'!$G$3-RANK(K33,K$4:K$78,1))<0,0,'Shooter Information'!$E$3-('Shooter Information'!$G$3-RANK(K33,K$4:K$78,1)))","v":0},0]
[31,{"$f":"'Shooter Information'!B36","v":0},{"$f":"'Shooter Information'!C36","v":0},null,null,null,null,null,null,null,0,{"$f":"IF('Shooter Information'!$E$3-('Shooter Information'!$G$3-RANK(K34,K$4:K$78,1))<0,0,'Shooter Information'!$E$3-('Shooter Information'!$G$3-RANK(K34,K$4:K$78,1)))","v":0},0]
[32,{"$f":"'Shooter Information'!B37","v":0},{"$f":"'Shooter Information'!C37","v":0},null,null,null,null,null,null,null,0,{"$f":"IF('Shooter Information'!$E$3-('Shooter Information'!$G$3-RANK(K35,K$4:K$78,1))<0,0,'Shooter Information'!$E$3-('Shooter Information'!$G$3-RANK(K35,K$4:K$78,1)))","v":0},0]
[33,{"$f":"'Shooter Information'!B38","v":0},{"$f":"'Shooter Information'!C38","v":0},null,null,null,null,null,null,null,0,{"$f":"IF('Shooter Information'!$E$3-('Shooter Information'!$G$3-RANK(K36,K$4:K$78,1))<0,0,'Shooter Information'!$E$3-('Shooter Information'!$G$3-RANK(K36,K$4:K$78,1)))","v":0},0]
[34,{"$f":"'Shooter Information'!B39","v":0},{"$f":"'Shooter Information'!C39","v":0},null,null,null,null,null,null,null,0,{"$f":"IF('Shooter Information'!$E$3-('Shooter Information'!$G$3-RANK(K37,K$4:K$78,1))<0,0,'Shooter Information'!$E$3-('Shooter Information'!$G$3-RANK(K37,K$4:K$78,1)))","v":0},0]
[35,{"$f":"'Shooter Information'!B40","v":0},{"$f":"'Shooter Information'!C40","v":0},null,null,null,null,null,null,null,0,{"$f":"IF('Shooter Information'!$E$3-('Shooter Information'!$G$3-RANK(K38,K$4:K$78,1))<0,0,'Shooter Information'!$E$3-('Shooter Information'!$G$3-RANK(K38,K$4:K$78,1)))","v":0},0]
[36,{"$f":"'Shooter Information'!B41","v":0},{"$f":"'Shooter Information'!C41","v":0},null,null,null,null,null,null,null,0,{"$f":"IF('Shooter Information'!$E$3-('Shooter Information'!$G$3-RANK(K39,K$4:K$78,1))<0,0,'Shooter Information'!$E$3-('Shooter Information'!$G$3-RANK(K39,K$4:K$78,1)))","v":0},0]
[37,{"$f":"'Shooter Information'!B42","v":0},{"$f":"'Shooter Information'!C42","v":0},null,null,null,null,null,null,null,0,{"$f":"IF('Shooter Information'!$E$3-('Shooter Information'!$G$3-RANK(K40,K$4:K$78,1))<0,0,'Shooter Information'!$E$3-('Shooter Information'!$G$3-RANK(K40,K$4:K$78,1)))","v":0},0]
[38,{"$f":"'Shooter Information'!B43","v":0},{"$f":"'Shooter Information'!C43","v":0},null,null,null,null,null,null,null,0,{"$f":"IF('Shooter Information'!$E$3-('Shooter Information'!$G$3-RANK(K41,K$4:K$78,1))<0,0,'Shooter Information'!$E$3-('Shooter Information'!$G$3-RANK(K41,K$4:K$78,1)))","v":0},0]
[39,{"$f":"'Shooter Information'!B44","v":0},{"$f":"'Shooter Information'!C44","v":0},null,null,null,null,null,null,null,0,{"$f":"IF('Shooter Information'!$E$3-('Shooter Information'!$G$3-RANK(K42,K$4:K$78,1))<0,0,'Shooter Information'!$E$3-('Shooter Information'!$G$3-RANK(K42,K$4:K$78,1)))","v":0},0]
[40,{"$f":"'Shooter Information'!B45","v":0},{"$f":"'Shooter Information'!C45","v":0},null,null,null,null,null,null,null,0,{"$f":"IF('Shooter Information'!$E$3-('Shooter Information'!$G$3-RANK(K43,K$4:K$78,1))<0,0,'Shooter Information'!$E$3-('Shooter Information'!$G$3-RANK(K43,K$4:K$78,1)))","v":0},0]
[41,{"$f":"'Shooter Information'!B46","v":0},{"$f":"'Shooter Information'!C46","v":0},null,null,null,null,null,null,null,0,{"$f":"IF('Shooter Information'!$E$3-('Shooter Information'!$G$3-RANK(K44,K$4:K$78,1))<0,0,'Shooter Information'!$E$3-('Shooter Information'!$G$3-RANK(K44,K$4:K$78,1)))","v":0},0]
[42,{"$f":"'Shooter Information'!B47","v":0},{"$f":"'Shooter Information'!C47","v":0},null,null,null,null,null,null,null,0,{"$f":"IF('Shooter Information'!$E$3-('Shooter Information'!$G$3-RANK(K45,K$4:K$78,1))<0,0,'Shooter Information'!$E$3-('Shooter Information'!$G$3-RANK(K45,K$4:K$78,1)))","v":0},0]
[43,{"$f":"'Shooter Information'!B48","v":0},{"$f":"'Shooter Information'!C48","v":0},null,null,null,null,null,null,null,0,{"$f":"IF('Shooter Information'!$E$3-('Shooter Information'!$G$3-RANK(K46,K$4:K$78,1))<0,0,'Shooter Information'!$E$3-('Shooter Information'!$G$3-RANK(K46,K$4:K$78,1)))","v":0},0]
[44,{"$f":"'Shooter Information'!B49","v":0},{"$f":"'Shooter Information'!C49","v":0},null,null,null,null,null,null,null,0,{"$f":"IF('Shooter Information'!$E$3-('Shooter Information'!$G$3-RANK(K47,K$4:K$78,1))<0,0,'Shooter Information'!$E$3-('Shooter Information'!$G$3-RANK(K47,K$4:K$78,1)))","v":0},0]
[45,{"$f":"'Shooter Information'!B50","v":0},{"$f":"'Shooter Information'!C50","v":0},null,null,null,null,null,null,null,0,{"$f":"IF('Shooter Information'!$E$3-('Shooter Information'!$G$3-RANK(K48,K$4:K$78,1))<0,0,'Shooter Information'!$E$3-('Shooter Information'!$G$3-RANK(K48,K$4:K$78,1)))","v":0},0]
[46,{"$f":"'Shooter Information'!B51","v":0},{"$f":"'Shooter Information'!C51","v":0},null,null,null,null,null,null,null,0,{"$f":"IF('Shooter Information'!$E$3-('Shooter Information'!$G$3-RANK(K49,K$4:K$78,1))<0,0,'Shooter Information'!$E$3-('Shooter Information'!$G$3-RANK(K49,K$4:K$78,1)))","v":0},0]
[47,{"$f":"'Shooter Information'!B52","v":0},{"$f":"'Shooter Information'!C52","v":0},null,null,null,null,null,null,null,0,{"$f":"IF('Shooter Information'!$E$3-('Shooter Information'!$G$3-RANK(K50,K$4:K$78,1))<0,0,'Shooter Information'!$E$3-('Shooter Information'!$G$3-RANK(K50,K$4:K$78,1)))","v":0},0]
[48,{"$f":"'Shooter Information'!B53","v":0},{"$f":"'Shooter Information'!C53","v":0},null,null,null,null,null,null,null,0,{"$f":"IF('Shooter Information'!$E$3-('Shooter Information'!$G$3-RANK(K51,K$4:K$78,1))<0,0,'Shooter Information'!$E$3-('Shooter Information'!$G$3-RANK(K51,K$4:K$78,1)))","v":0},0]
[49,{"$f":"'Shooter Information'!B54","v":0},{"$f":"'Shooter Information'!C54","v":0},null,null,null,null,null,null,null,0,{"$f":"IF('Shooter Information'!$E$3-('Shooter Information'!$G$3-RANK(K52,K$4:K$78,1))<0,0,'Shooter Information'!$E$3-('Shooter Information'!$G$3-RANK(K52,K$4:K$78,1)))","v":0},0]
[50,{"$f":"'Shooter Information'!B55","v":0},{"$f":"'Shooter Information'!C55","v":0},null,null,null,null,null,null,null,0,{"$f":"IF('Shooter Information'!$E$3-('Shooter Information'!$G$3-RANK(K53,K$4:K$78,1))<0,0,'Shooter Information'!$E$3-('Shooter Information'!$G$3-RANK(K53,K$4:K$78,1)))","v":0},0]
[51,{"$f":"'Shooter Information'!B56","v":0},{"$f":"'Shooter Information'!C56","v":0},null,null,null,null,null,null,null,0,{"$f":"IF('Shooter Information'!$E$3-('Shooter Information'!$G$3-RANK(K54,K$4:K$78,1))<0,0,'Shooter Information'!$E$3-('Shooter Information'!$G$3-RANK(K54,K$4:K$78,1)))","v":0},0]
[52,{"$f":"'Shooter Information'!B57","v":0},{"$f":"'Shooter Information'!C57","v":0},null,null,null,null,null,null,null,0,{"$f":"IF('Shooter Information'!$E$3-('Shooter Information'!$G$3-RANK(K55,K$4:K$78,1))<0,0,'Shooter Information'!$E$3-('Shooter Information'!$G$3-RANK(K55,K$4:K$78,1)))","v":0},0]
[53,{"$f":"'Shooter Information'!B58","v":0},{"$f":"'Shooter Information'!C58","v":0},null,null,null,null,null,null,null,0,{"$f":"IF('Shooter Information'!$E$3-('Shooter Information'!$G$3-RANK(K56,K$4:K$78,1))<0,0,'Shooter Information'!$E$3-('Shooter Information'!$G$3-RANK(K56,K$4:K$78,1)))","v":0},0]
[54,{"$f":"'Shooter Information'!B59","v":0},{"$f":"'Shooter Information'!C59","v":0},null,null,null,null,null,null,null,0,{"$f":"IF('Shooter Information'!$E$3-('Shooter Information'!$G$3-RANK(K57,K$4:K$78,1))<0,0,'Shooter Information'!$E$3-('Shooter Information'!$G$3-RANK(K57,K$4:K$78,1)))","v":0},0]
[55,{"$f":"'Shooter Information'!B60","v":0},{"$f":"'Shooter Information'!C60","v":0},null,null,null,null,null,null,null,0,{"$f":"IF('Shooter Information'!$E$3-('Shooter Information'!$G$3-RANK(K58,K$4:K$78,1))<0,0,'Shooter Information'!$E$3-('Shooter Information'!$G$3-RANK(K58,K$4:K$78,1)))","v":0},0]
[56,{"$f":"'Shooter Information'!B61","v":0},{"$f":"'Shooter Information'!C61","v":0},null,null,null,null,null,null,null,0,{"$f":"IF('Shooter Information'!$E$3-('Shooter Information'!$G$3-RANK(K59,K$4:K$78,1))<0,0,'Shooter Information'!$E$3-('Shooter Information'!$G$3-RANK(K59,K$4:K$78,1)))","v":0},0]
[57,{"$f":"'Shooter Information'!B62","v":0},{"$f":"'Shooter Information'!C62","v":0},null,null,null,null,null,null,null,0,{"$f":"IF('Shooter Information'!$E$3-('Shooter Information'!$G$3-RANK(K60,K$4:K$78,1))<0,0,'Shooter Information'!$E$3-('Shooter Information'!$G$3-RANK(K60,K$4:K$78,1)))","v":0},0]
[58,{"$f":"'Shooter Information'!B63","v":0},{"$f":"'Shooter Information'!C63","v":0},null,null,null,null,null,null,null,0,{"$f":"IF('Shooter Information'!$E$3-('Shooter Information'!$G$3-RANK(K61,K$4:K$78,1))<0,0,'Shooter Information'!$E$3-('Shooter Information'!$G$3-RANK(K61,K$4:K$78,1)))","v":0},0]
[59,{"$f":"'Shooter Information'!B64","v":0},{"$f":"'Shooter Information'!C64","v":0},null,null,null,null,null,null,null,0,{"$f":"IF('Shooter Information'!$E$3-('Shooter Information'!$G$3-RANK(K62,K$4:K$78,1))<0,0,'Shooter Information'!$E$3-('Shooter Information'!$G$3-RANK(K62,K$4:K$78,1)))","v":0},0]
[60,{"$f":"'Shooter Information'!B65","v":0},{"$f":"'Shooter Information'!C65","v":0},null,null,null,null,null,null,null,0,{"$f":"IF('Shooter Information'!$E$3-('Shooter Information'!$G$3-RANK(K63,K$4:K$78,1))<0,0,'Shooter Information'!$E$3-('Shooter Information'!$G$3-RANK(K63,K$4:K$78,1)))","v":0},0]
[61,{"$f":"'Shooter Information'!B66","v":0},{"$f":"'Shooter Information'!C66","v":0},null,null,null,null,null,null,null,0,{"$f":"IF('Shooter Information'!$E$3-('Shooter Information'!$G$3-RANK(K64,K$4:K$78,1))<0,0,'Shooter Information'!$E$3-('Shooter Information'!$G$3-RANK(K64,K$4:K$78,1)))","v":0},0]
[62,{"$f":"'Shooter Information'!B67","v":0},{"$f":"'Shooter Information'!C67","v":0},null,null,null,null,null,null,null,0,{"$f":"IF('Shooter Information'!$E$3-('Shooter Information'!$G$3-RANK(K65,K$4:K$78,1))<0,0,'Shooter Information'!$E$3-('Shooter Information'!$G$3-RANK(K65,K$4:K$78,1)))","v":0},0]
[63,{"$f":"'Shooter Information'!B68","v":0},{"$f":"'Shooter Information'!C68","v":0},null,null,null,null,null,null,null,0,{"$f":"IF('Shooter Information'!$E$3-('Shooter Information'!$G$3-RANK(K66,K$4:K$78,1))<0,0,'Shooter Information'!$E$3-('Shooter Information'!$G$3-RANK(K66,K$4:K$78,1)))","v":0},0]
[64,{"$f":"'Shooter Information'!B69","v":0},{"$f":"'Shooter Information'!C69","v":0},null,null,null,null,null,null,null,0,{"$f":"IF('Shooter Information'!$E$3-('Shooter Information'!$G$3-RANK(K67,K$4:K$78,1))<0,0,'Shooter Information'!$E$3-('Shooter Information'!$G$3-RANK(K67,K$4:K$78,1)))","v":0},0]
[65,{"$f":"'Shooter Information'!B70","v":0},{"$f":"'Shooter Information'!C70","v":0},null,null,null,null,null,null,null,0,{"$f":"IF('Shooter Information'!$E$3-('Shooter Information'!$G$3-RANK(K68,K$4:K$78,1))<0,0,'Shooter Information'!$E$3-('Shooter Information'!$G$3-RANK(K68,K$4:K$78,1)))","v":0},0]
[66,{"$f":"'Shooter Information'!B71","v":0},{"$f":"'Shooter Information'!C71","v":0},null,null,null,null,null,null,null,{"$f":"(D69*5)+E69-F69+(G69*10)+(H69*30)+(I69*999)+(J69*999.99)","v":0},{"$f":"IF('Shooter Information'!$E$3-('Shooter Information'!$G$3-RANK(K69,K$4:K$78,1))<0,0,'Shooter Information'!$E$3-('Shooter Information'!$G$3-RANK(K69,K$4:K$78,1)))","v":0},{"$f":"(SUM(D69+G69+H69+I69+J69))","v":0}]
[67,{"$f":"'Shooter Information'!B72","v":0},{"$f":"'Shooter Information'!C72","v":0},null,null,null,null,null,null,null,0,{"$f":"IF('Shooter Information'!$E$3-('Shooter Information'!$G$3-RANK(K70,K$4:K$78,1))<0,0,'Shooter Information'!$E$3-('Shooter Information'!$G$3-RANK(K70,K$4:K$78,1)))","v":0},0]
[68,{"$f":"'Shooter Information'!B73","v":0},{"$f":"'Shooter Information'!C73","v":0},null,null,null,null,null,null,null,0,{"$f":"IF('Shooter Information'!$E$3-('Shooter Information'!$G$3-RANK(K71,K$4:K$78,1))<0,0,'Shooter Information'!$E$3-('Shooter Information'!$G$3-RANK(K71,K$4:K$78,1)))","v":0},0]
[69,{"$f":"'Shooter Information'!B74","v":0},{"$f":"'Shooter Information'!C74","v":0},null,null,null,null,null,null,null,0,{"$f":"IF('Shooter Information'!$E$3-('Shooter Information'!$G$3-RANK(K72,K$4:K$78,1))<0,0,'Shooter Information'!$E$3-('Shooter Information'!$G$3-RANK(K72,K$4:K$78,1)))","v":0},0]
[70,{"$f":"'Shooter Information'!B75","v":0},{"$f":"'Shooter Information'!C75","v":0},null,null,null,null,null,null,null,0,{"$f":"IF('Shooter Information'!$E$3-('Shooter Information'!$G$3-RANK(K73,K$4:K$78,1))<0,0,'Shooter Information'!$E$3-('Shooter Information'!$G$3-RANK(K73,K$4:K$78,1)))","v":0},0]
[71,{"$f":"'Shooter Information'!B76","v":0},{"$f":"'Shooter Information'!C76","v":0},null,null,null,null,null,null,null,0,{"$f":"IF('Shooter Information'!$E$3-('Shooter Information'!$G$3-RANK(K74,K$4:K$78,1))<0,0,'Shooter Information'!$E$3-('Shooter Information'!$G$3-RANK(K74,K$4:K$78,1)))","v":0},0]
[72,{"$f":"'Shooter Information'!B77","v":0},{"$f":"'Shooter Information'!C77","v":0},null,null,null,null,null,null,null,0,{"$f":"IF('Shooter Information'!$E$3-('Shooter Information'!$G$3-RANK(K75,K$4:K$78,1))<0,0,'Shooter Information'!$E$3-('Shooter Information'!$G$3-RANK(K75,K$4:K$78,1)))","v":0},0]
[73,{"$f":"'Shooter Information'!B78","v":0},{"$f":"'Shooter Information'!C78","v":0},null,null,null,null,null,null,null,0,{"$f":"IF('Shooter Information'!$E$3-('Shooter Information'!$G$3-RANK(K76,K$4:K$78,1))<0,0,'Shooter Information'!$E$3-('Shooter Information'!$G$3-RANK(K76,K$4:K$78,1)))","v":0},0]
[74,{"$f":"'Shooter Information'!B79","v":0},{"$f":"'Shooter Information'!C79","v":0},null,null,null,null,null,null,null,0,{"$f":"IF('Shooter Information'!$E$3-('Shooter Information'!$G$3-RANK(K77,K$4:K$78,1))<0,0,'Shooter Information'!$E$3-('Shooter Information'!$G$3-RANK(K77,K$4:K$78,1)))","v":0},0]
[75,{"$f":"'Shooter Information'!B80","v":0},{"$f":"'Shooter Information'!C80","v":0},null,null,null,null,null,null,null,0,{"$f":"IF('Shooter Information'!$E$3-('Shooter Information'!$G$3-RANK(K78,K$4:K$78,1))<0,0,'Shooter Information'!$E$3-('Shooter Information'!$G$3-RANK(K78,K$4:K$78,1)))","v":0},0]

{"sheet":"Stage 12","index":12,"n_rows":78,"n_cols":13,"rows_kept":78,"cut":false,"hidden":true,"merged":[]}
[null,"CAS SCORE SHEET"]
[null,"Stage 12"]
["Roster #","Shooter","Class","Misses","Raw Time","Bonus","10 Sec","30 Sec","DNF","DQ","Total","Rank","Penalties"]
[{"$f":"ROW()-3","v":1},{"$f":"'Shooter Information'!B6","v":"Striker"},{"$f":"'Shooter Information'!C6","v":"GF"},null,null,null,null,null,null,null,{"$f":"(D4*5)+E4-F4+(G4*10)+(H4*30)+(I4*999)+(J4*999.99)","v":0},{"$f":"IF('Shooter Information'!$E$3-('Shooter Information'!$G$3-RANK(K4,K$4:K$78,1))<0,0,'Shooter Information'!$E$3-('Shooter Information'!$G$3-RANK(K4,K$4:K$78,1)))","v":0},{"$f":"(SUM(D4+G4+H4+I4+J4))","v":0}]
[{"$f":"ROW()-3","v":2},{"$f":"'Shooter Information'!B7","v":"Lefty Spurmaker"},{"$f":"'Shooter Information'!C7","v":49},null,null,null,null,null,null,null,{"$f":"(D5*5)+E5-F5+(G5*10)+(H5*30)+(I5*999)+(J5*999.99)","v":0},{"$f":"IF('Shooter Information'!$E$3-('Shooter Information'!$G$3-RANK(K5,K$4:K$78,1))<0,0,'Shooter Information'!$E$3-('Shooter Information'!$G$3-RANK(K5,K$4:K$78,1)))","v":0},{"$f":"(SUM(D5+G5+H5+I5+J5))","v":0}]
[3,{"$f":"'Shooter Information'!B8","v":"Hotshod"},{"$f":"'Shooter Information'!C8","v":"W"},null,null,null,null,null,null,null,0,{"$f":"IF('Shooter Information'!$E$3-('Shooter Information'!$G$3-RANK(K6,K$4:K$78,1))<0,0,'Shooter Information'!$E$3-('Shooter Information'!$G$3-RANK(K6,K$4:K$78,1)))","v":0},0]
[4,{"$f":"'Shooter Information'!B9","v":"Swifty McDraw"},{"$f":"'Shooter Information'!C9","v":"SS"},null,null,null,null,null,null,null,0,{"$f":"IF('Shooter Information'!$E$3-('Shooter Information'!$G$3-RANK(K7,K$4:K$78,1))<0,0,'Shooter Information'!$E$3-('Shooter Information'!$G$3-RANK(K7,K$4:K$78,1)))","v":0},0]
[5,{"$f":"'Shooter Information'!B10","v":"Prairie City Slim"},{"$f":"'Shooter Information'!C10","v":"SS"},null,null,null,null,null,null,null,0,{"$f":"IF('Shooter Information'!$E$3-('Shooter Information'!$G$3-RANK(K8,K$4:K$78,1))<0,0,'Shooter Information'!$E$3-('Shooter Information'!$G$3-RANK(K8,K$4:K$78,1)))","v":0},0]
[6,{"$f":"'Shooter Information'!B11","v":"Enid City Kid"},{"$f":"'Shooter Information'!C11","v":"FC"},null,null,null,null,null,null,null,0,{"$f":"IF('Shooter Information'!$E$3-('Shooter Information'!$G$3-RANK(K9,K$4:K$78,1))<0,0,'Shooter Information'!$E$3-('Shooter Information'!$G$3-RANK(K9,K$4:K$78,1)))","v":0},0]
[7,{"$f":"'Shooter Information'!B12","v":"Cockroach"},{"$f":"'Shooter Information'!C12","v":"CB"},null,null,null,null,null,null,null,0,{"$f":"IF('Shooter Information'!$E$3-('Shooter Information'!$G$3-RANK(K10,K$4:K$78,1))<0,0,'Shooter Information'!$E$3-('Shooter Information'!$G$3-RANK(K10,K$4:K$78,1)))","v":0},0]
[8,{"$f":"'Shooter Information'!B13","v":"Kuba Kid"},{"$f":"'Shooter Information'!C13","v":"D"},null,null,null,null,null,null,null,0,{"$f":"IF('Shooter Information'!$E$3-('Shooter Information'!$G$3-RANK(K11,K$4:K$78,1))<0,0,'Shooter Information'!$E$3-('Shooter Information'!$G$3-RANK(K11,K$4:K$78,1)))","v":0},0]
[9,{"$f":"'Shooter Information'!B14","v":"Beartooth"},{"$f":"'Shooter Information'!C14","v":"S"},null,null,null,null,null,null,null,0,{"$f":"IF('Shooter Information'!$E$3-('Shooter Information'!$G$3-RANK(K12,K$4:K$78,1))<0,0,'Shooter Information'!$E$3-('Shooter Information'!$G$3-RANK(K12,K$4:K$78,1)))","v":0},0]
[10,{"$f":"'Shooter Information'!B15","v":"Slick Rick"},{"$f":"'Shooter Information'!C15","v":"S"},null,null,null,null,null,null,null,0,{"$f":"IF('Shooter Information'!$E$3-('Shooter Information'!$G$3-RANK(K13,K$4:K$78,1))<0,0,'Shooter Information'!$E$3-('Shooter Information'!$G$3-RANK(K13,K$4:K$78,1)))","v":0},0]
[11,{"$f":"'Shooter Information'!B16","v":"Windhorse Rider"},{"$f":"'Shooter Information'!C16","v":"GF"},null,null,null,null,null,null,null,0,{"$f":"IF('Shooter Information'!$E$3-('Shooter Information'!$G$3-RANK(K14,K$4:K$78,1))<0,0,'Shooter Information'!$E$3-('Shooter Information'!$G$3-RANK(K14,K$4:K$78,1)))","v":0},0]
[12,{"$f":"'Shooter Information'!B17","v":"Justice Jack"},{"$f":"'Shooter Information'!C17","v":"SS"},null,null,null,null,null,null,null,0,{"$f":"IF('Shooter Information'!$E$3-('Shooter Information'!$G$3-RANK(K15,K$4:K$78,1))<0,0,'Shooter Information'!$E$3-('Shooter Information'!$G$3-RANK(K15,K$4:K$78,1)))","v":0},0]
[13,{"$f":"'Shooter Information'!B18","v":"B. S. Walker"},{"$f":"'Shooter Information'!C18","v":49},null,null,null,null,null,null,null,0,{"$f":"IF('Shooter Information'!$E$3-('Shooter Information'!$G$3-RANK(K16,K$4:K$78,1))<0,0,'Shooter Information'!$E$3-('Shooter Information'!$G$3-RANK(K16,K$4:K$78,1)))","v":0},0]
[14,{"$f":"'Shooter Information'!B19","v":"Red Cavanaugh"},{"$f":"'Shooter Information'!C19","v":49},null,null,null,null,null,null,null,0,{"$f":"IF('Shooter Information'!$E$3-('Shooter Information'!$G$3-RANK(K17,K$4:K$78,1))<0,0,'Shooter Information'!$E$3-('Shooter Information'!$G$3-RANK(K17,K$4:K$78,1)))","v":0},0]
[15,{"$f":"'Shooter Information'!B20","v":"Deringer Dan"},{"$f":"'Shooter Information'!C20","v":49},null,null,null,null,null,null,null,0,{"$f":"IF('Shooter Information'!$E$3-('Shooter Information'!$G$3-RANK(K18,K$4:K$78,1))<0,0,'Shooter Information'!$E$3-('Shooter Information'!$G$3-RANK(K18,K$4:K$78,1)))","v":0},0]
[16,{"$f":"'Shooter Information'!B21","v":0},{"$f":"'Shooter Information'!C21","v":0},null,null,null,null,null,null,null,0,{"$f":"IF('Shooter Information'!$E$3-('Shooter Information'!$G$3-RANK(K19,K$4:K$78,1))<0,0,'Shooter Information'!$E$3-('Shooter Information'!$G$3-RANK(K19,K$4:K$78,1)))","v":0},0]
[17,{"$f":"'Shooter Information'!B22","v":0},{"$f":"'Shooter Information'!C22","v":0},null,null,null,null,null,null,null,0,{"$f":"IF('Shooter Information'!$E$3-('Shooter Information'!$G$3-RANK(K20,K$4:K$78,1))<0,0,'Shooter Information'!$E$3-('Shooter Information'!$G$3-RANK(K20,K$4:K$78,1)))","v":0},0]
[18,{"$f":"'Shooter Information'!B23","v":0},{"$f":"'Shooter Information'!C23","v":0},null,null,null,null,null,null,null,0,{"$f":"IF('Shooter Information'!$E$3-('Shooter Information'!$G$3-RANK(K21,K$4:K$78,1))<0,0,'Shooter Information'!$E$3-('Shooter Information'!$G$3-RANK(K21,K$4:K$78,1)))","v":0},0]
[19,{"$f":"'Shooter Information'!B24","v":0},{"$f":"'Shooter Information'!C24","v":0},null,null,null,null,null,null,null,0,{"$f":"IF('Shooter Information'!$E$3-('Shooter Information'!$G$3-RANK(K22,K$4:K$78,1))<0,0,'Shooter Information'!$E$3-('Shooter Information'!$G$3-RANK(K22,K$4:K$78,1)))","v":0},0]
[20,{"$f":"'Shooter Information'!B25","v":0},{"$f":"'Shooter Information'!C25","v":0},null,null,null,null,null,null,null,0,{"$f":"IF('Shooter Information'!$E$3-('Shooter Information'!$G$3-RANK(K23,K$4:K$78,1))<0,0,'Shooter Information'!$E$3-('Shooter Information'!$G$3-RANK(K23,K$4:K$78,1)))","v":0},0]
[21,{"$f":"'Shooter Information'!B26","v":0},{"$f":"'Shooter Information'!C26","v":0},null,null,null,null,null,null,null,0,{"$f":"IF('Shooter Information'!$E$3-('Shooter Information'!$G$3-RANK(K24,K$4:K$78,1))<0,0,'Shooter Information'!$E$3-('Shooter Information'!$G$3-RANK(K24,K$4:K$78,1)))","v":0},0]
[22,{"$f":"'Shooter Information'!B27","v":0},{"$f":"'Shooter Information'!C27","v":0},null,null,null,null,null,null,null,0,{"$f":"IF('Shooter Information'!$E$3-('Shooter Information'!$G$3-RANK(K25,K$4:K$78,1))<0,0,'Shooter Information'!$E$3-('Shooter Information'!$G$3-RANK(K25,K$4:K$78,1)))","v":0},0]
[23,{"$f":"'Shooter Information'!B28","v":0},{"$f":"'Shooter Information'!C28","v":0},null,null,null,null,null,null,null,0,{"$f":"IF('Shooter Information'!$E$3-('Shooter Information'!$G$3-RANK(K26,K$4:K$78,1))<0,0,'Shooter Information'!$E$3-('Shooter Information'!$G$3-RANK(K26,K$4:K$78,1)))","v":0},0]
[24,{"$f":"'Shooter Information'!B29","v":0},{"$f":"'Shooter Information'!C29","v":0},null,null,null,null,null,null,null,0,{"$f":"IF('Shooter Information'!$E$3-('Shooter Information'!$G$3-RANK(K27,K$4:K$78,1))<0,0,'Shooter Information'!$E$3-('Shooter Information'!$G$3-RANK(K27,K$4:K$78,1)))","v":0},0]
[25,{"$f":"'Shooter Information'!B30","v":0},{"$f":"'Shooter Information'!C30","v":0},null,null,null,null,null,null,null,0,{"$f":"IF('Shooter Information'!$E$3-('Shooter Information'!$G$3-RANK(K28,K$4:K$78,1))<0,0,'Shooter Information'!$E$3-('Shooter Information'!$G$3-RANK(K28,K$4:K$78,1)))","v":0},0]
[26,{"$f":"'Shooter Information'!B31","v":0},{"$f":"'Shooter Information'!C31","v":0},null,null,null,null,null,null,null,0,{"$f":"IF('Shooter Information'!$E$3-('Shooter Information'!$G$3-RANK(K29,K$4:K$78,1))<0,0,'Shooter Information'!$E$3-('Shooter Information'!$G$3-RANK(K29,K$4:K$78,1)))","v":0},0]
[27,{"$f":"'Shooter Information'!B32","v":0},{"$f":"'Shooter Information'!C32","v":0},null,null,null,null,null,null,null,0,{"$f":"IF('Shooter Information'!$E$3-('Shooter Information'!$G$3-RANK(K30,K$4:K$78,1))<0,0,'Shooter Information'!$E$3-('Shooter Information'!$G$3-RANK(K30,K$4:K$78,1)))","v":0},0]
[28,{"$f":"'Shooter Information'!B33","v":0},{"$f":"'Shooter Information'!C33","v":0},null,null,null,null,null,null,null,0,{"$f":"IF('Shooter Information'!$E$3-('Shooter Information'!$G$3-RANK(K31,K$4:K$78,1))<0,0,'Shooter Information'!$E$3-('Shooter Information'!$G$3-RANK(K31,K$4:K$78,1)))","v":0},0]
[29,{"$f":"'Shooter Information'!B34","v":0},{"$f":"'Shooter Information'!C34","v":0},null,null,null,null,null,null,null,0,{"$f":"IF('Shooter Information'!$E$3-('Shooter Information'!$G$3-RANK(K32,K$4:K$78,1))<0,0,'Shooter Information'!$E$3-('Shooter Information'!$G$3-RANK(K32,K$4:K$78,1)))","v":0},0]
[30,{"$f":"'Shooter Information'!B35","v":0},{"$f":"'Shooter Information'!C35","v":0},null,null,null,null,null,null,null,0,{"$f":"IF('Shooter Information'!$E$3-('Shooter Information'!$G$3-RANK(K33,K$4:K$78,1))<0,0,'Shooter Information'!$E$3-('Shooter Information'!$G$3-RANK(K33,K$4:K$78,1)))","v":0},0]
[31,{"$f":"'Shooter Information'!B36","v":0},{"$f":"'Shooter Information'!C36","v":0},null,null,null,null,null,null,null,0,{"$f":"IF('Shooter Information'!$E$3-('Shooter Information'!$G$3-RANK(K34,K$4:K$78,1))<0,0,'Shooter Information'!$E$3-('Shooter Information'!$G$3-RANK(K34,K$4:K$78,1)))","v":0},0]
[32,{"$f":"'Shooter Information'!B37","v":0},{"$f":"'Shooter Information'!C37","v":0},null,null,null,null,null,null,null,0,{"$f":"IF('Shooter Information'!$E$3-('Shooter Information'!$G$3-RANK(K35,K$4:K$78,1))<0,0,'Shooter Information'!$E$3-('Shooter Information'!$G$3-RANK(K35,K$4:K$78,1)))","v":0},0]
[33,{"$f":"'Shooter Information'!B38","v":0},{"$f":"'Shooter Information'!C38","v":0},null,null,null,null,null,null,null,0,{"$f":"IF('Shooter Information'!$E$3-('Shooter Information'!$G$3-RANK(K36,K$4:K$78,1))<0,0,'Shooter Information'!$E$3-('Shooter Information'!$G$3-RANK(K36,K$4:K$78,1)))","v":0},0]
[34,{"$f":"'Shooter Information'!B39","v":0},{"$f":"'Shooter Information'!C39","v":0},null,null,null,null,null,null,null,0,{"$f":"IF('Shooter Information'!$E$3-('Shooter Information'!$G$3-RANK(K37,K$4:K$78,1))<0,0,'Shooter Information'!$E$3-('Shooter Information'!$G$3-RANK(K37,K$4:K$78,1)))","v":0},0]
[35,{"$f":"'Shooter Information'!B40","v":0},{"$f":"'Shooter Information'!C40","v":0},null,null,null,null,null,null,null,0,{"$f":"IF('Shooter Information'!$E$3-('Shooter Information'!$G$3-RANK(K38,K$4:K$78,1))<0,0,'Shooter Information'!$E$3-('Shooter Information'!$G$3-RANK(K38,K$4:K$78,1)))","v":0},0]
[36,{"$f":"'Shooter Information'!B41","v":0},{"$f":"'Shooter Information'!C41","v":0},null,null,null,null,null,null,null,0,{"$f":"IF('Shooter Information'!$E$3-('Shooter Information'!$G$3-RANK(K39,K$4:K$78,1))<0,0,'Shooter Information'!$E$3-('Shooter Information'!$G$3-RANK(K39,K$4:K$78,1)))","v":0},0]
[37,{"$f":"'Shooter Information'!B42","v":0},{"$f":"'Shooter Information'!C42","v":0},null,null,null,null,null,null,null,0,{"$f":"IF('Shooter Information'!$E$3-('Shooter Information'!$G$3-RANK(K40,K$4:K$78,1))<0,0,'Shooter Information'!$E$3-('Shooter Information'!$G$3-RANK(K40,K$4:K$78,1)))","v":0},0]
[38,{"$f":"'Shooter Information'!B43","v":0},{"$f":"'Shooter Information'!C43","v":0},null,null,null,null,null,null,null,0,{"$f":"IF('Shooter Information'!$E$3-('Shooter Information'!$G$3-RANK(K41,K$4:K$78,1))<0,0,'Shooter Information'!$E$3-('Shooter Information'!$G$3-RANK(K41,K$4:K$78,1)))","v":0},0]
[39,{"$f":"'Shooter Information'!B44","v":0},{"$f":"'Shooter Information'!C44","v":0},null,null,null,null,null,null,null,0,{"$f":"IF('Shooter Information'!$E$3-('Shooter Information'!$G$3-RANK(K42,K$4:K$78,1))<0,0,'Shooter Information'!$E$3-('Shooter Information'!$G$3-RANK(K42,K$4:K$78,1)))","v":0},0]
[40,{"$f":"'Shooter Information'!B45","v":0},{"$f":"'Shooter Information'!C45","v":0},null,null,null,null,null,null,null,0,{"$f":"IF('Shooter Information'!$E$3-('Shooter Information'!$G$3-RANK(K43,K$4:K$78,1))<0,0,'Shooter Information'!$E$3-('Shooter Information'!$G$3-RANK(K43,K$4:K$78,1)))","v":0},0]
[41,{"$f":"'Shooter Information'!B46","v":0},{"$f":"'Shooter Information'!C46","v":0},null,null,null,null,null,null,null,0,{"$f":"IF('Shooter Information'!$E$3-('Shooter Information'!$G$3-RANK(K44,K$4:K$78,1))<0,0,'Shooter Information'!$E$3-('Shooter Information'!$G$3-RANK(K44,K$4:K$78,1)))","v":0},0]
[42,{"$f":"'Shooter Information'!B47","v":0},{"$f":"'Shooter Information'!C47","v":0},null,null,null,null,null,null,null,0,{"$f":"IF('Shooter Information'!$E$3-('Shooter Information'!$G$3-RANK(K45,K$4:K$78,1))<0,0,'Shooter Information'!$E$3-('Shooter Information'!$G$3-RANK(K45,K$4:K$78,1)))","v":0},0]
[43,{"$f":"'Shooter Information'!B48","v":0},{"$f":"'Shooter Information'!C48","v":0},null,null,null,null,null,null,null,0,{"$f":"IF('Shooter Information'!$E$3-('Shooter Information'!$G$3-RANK(K46,K$4:K$78,1))<0,0,'Shooter Information'!$E$3-('Shooter Information'!$G$3-RANK(K46,K$4:K$78,1)))","v":0},0]
[44,{"$f":"'Shooter Information'!B49","v":0},{"$f":"'Shooter Information'!C49","v":0},null,null,null,null,null,null,null,0,{"$f":"IF('Shooter Information'!$E$3-('Shooter Information'!$G$3-RANK(K47,K$4:K$78,1))<0,0,'Shooter Information'!$E$3-('Shooter Information'!$G$3-RANK(K47,K$4:K$78,1)))","v":0},0]
[45,{"$f":"'Shooter Information'!B50","v":0},{"$f":"'Shooter Information'!C50","v":0},null,null,null,null,null,null,null,0,{"$f":"IF('Shooter Information'!$E$3-('Shooter Information'!$G$3-RANK(K48,K$4:K$78,1))<0,0,'Shooter Information'!$E$3-('Shooter Information'!$G$3-RANK(K48,K$4:K$78,1)))","v":0},0]
[46,{"$f":"'Shooter Information'!B51","v":0},{"$f":"'Shooter Information'!C51","v":0},null,null,null,null,null,null,null,0,{"$f":"IF('Shooter Information'!$E$3-('Shooter Information'!$G$3-RANK(K49,K$4:K$78,1))<0,0,'Shooter Information'!$E$3-('Shooter Information'!$G$3-RANK(K49,K$4:K$78,1)))","v":0},0]
[47,{"$f":"'Shooter Information'!B52","v":0},{"$f":"'Shooter Information'!C52","v":0},null,null,null,null,null,null,null,0,{"$f":"IF('Shooter Information'!$E$3-('Shooter Information'!$G$3-RANK(K50,K$4:K$78,1))<0,0,'Shooter Information'!$E$3-('Shooter Information'!$G$3-RANK(K50,K$4:K$78,1)))","v":0},0]
[48,{"$f":"'Shooter Information'!B53","v":0},{"$f":"'Shooter Information'!C53","v":0},null,null,null,null,null,null,null,0,{"$f":"IF('Shooter Information'!$E$3-('Shooter Information'!$G$3-RANK(K51,K$4:K$78,1))<0,0,'Shooter Information'!$E$3-('Shooter Information'!$G$3-RANK(K51,K$4:K$78,1)))","v":0},0]
[49,{"$f":"'Shooter Information'!B54","v":0},{"$f":"'Shooter Information'!C54","v":0},null,null,null,null,null,null,null,0,{"$f":"IF('Shooter Information'!$E$3-('Shooter Information'!$G$3-RANK(K52,K$4:K$78,1))<0,0,'Shooter Information'!$E$3-('Shooter Information'!$G$3-RANK(K52,K$4:K$78,1)))","v":0},0]
[50,{"$f":"'Shooter Information'!B55","v":0},{"$f":"'Shooter Information'!C55","v":0},null,null,null,null,null,null,null,0,{"$f":"IF('Shooter Information'!$E$3-('Shooter Information'!$G$3-RANK(K53,K$4:K$78,1))<0,0,'Shooter Information'!$E$3-('Shooter Information'!$G$3-RANK(K53,K$4:K$78,1)))","v":0},0]
[51,{"$f":"'Shooter Information'!B56","v":0},{"$f":"'Shooter Information'!C56","v":0},null,null,null,null,null,null,null,0,{"$f":"IF('Shooter Information'!$E$3-('Shooter Information'!$G$3-RANK(K54,K$4:K$78,1))<0,0,'Shooter Information'!$E$3-('Shooter Information'!$G$3-RANK(K54,K$4:K$78,1)))","v":0},0]
[52,{"$f":"'Shooter Information'!B57","v":0},{"$f":"'Shooter Information'!C57","v":0},null,null,null,null,null,null,null,0,{"$f":"IF('Shooter Information'!$E$3-('Shooter Information'!$G$3-RANK(K55,K$4:K$78,1))<0,0,'Shooter Information'!$E$3-('Shooter Information'!$G$3-RANK(K55,K$4:K$78,1)))","v":0},0]
[53,{"$f":"'Shooter Information'!B58","v":0},{"$f":"'Shooter Information'!C58","v":0},null,null,null,null,null,null,null,0,{"$f":"IF('Shooter Information'!$E$3-('Shooter Information'!$G$3-RANK(K56,K$4:K$78,1))<0,0,'Shooter Information'!$E$3-('Shooter Information'!$G$3-RANK(K56,K$4:K$78,1)))","v":0},0]
[54,{"$f":"'Shooter Information'!B59","v":0},{"$f":"'Shooter Information'!C59","v":0},null,null,null,null,null,null,null,0,{"$f":"IF('Shooter Information'!$E$3-('Shooter Information'!$G$3-RANK(K57,K$4:K$78,1))<0,0,'Shooter Information'!$E$3-('Shooter Information'!$G$3-RANK(K57,K$4:K$78,1)))","v":0},0]
[55,{"$f":"'Shooter Information'!B60","v":0},{"$f":"'Shooter Information'!C60","v":0},null,null,null,null,null,null,null,0,{"$f":"IF('Shooter Information'!$E$3-('Shooter Information'!$G$3-RANK(K58,K$4:K$78,1))<0,0,'Shooter Information'!$E$3-('Shooter Information'!$G$3-RANK(K58,K$4:K$78,1)))","v":0},0]
[56,{"$f":"'Shooter Information'!B61","v":0},{"$f":"'Shooter Information'!C61","v":0},null,null,null,null,null,null,null,0,{"$f":"IF('Shooter Information'!$E$3-('Shooter Information'!$G$3-RANK(K59,K$4:K$78,1))<0,0,'Shooter Information'!$E$3-('Shooter Information'!$G$3-RANK(K59,K$4:K$78,1)))","v":0},0]
[57,{"$f":"'Shooter Information'!B62","v":0},{"$f":"'Shooter Information'!C62","v":0},null,null,null,null,null,null,null,0,{"$f":"IF('Shooter Information'!$E$3-('Shooter Information'!$G$3-RANK(K60,K$4:K$78,1))<0,0,'Shooter Information'!$E$3-('Shooter Information'!$G$3-RANK(K60,K$4:K$78,1)))","v":0},0]
[58,{"$f":"'Shooter Information'!B63","v":0},{"$f":"'Shooter Information'!C63","v":0},null,null,null,null,null,null,null,0,{"$f":"IF('Shooter Information'!$E$3-('Shooter Information'!$G$3-RANK(K61,K$4:K$78,1))<0,0,'Shooter Information'!$E$3-('Shooter Information'!$G$3-RANK(K61,K$4:K$78,1)))","v":0},0]
[59,{"$f":"'Shooter Information'!B64","v":0},{"$f":"'Shooter Information'!C64","v":0},null,null,null,null,null,null,null,0,{"$f":"IF('Shooter Information'!$E$3-('Shooter Information'!$G$3-RANK(K62,K$4:K$78,1))<0,0,'Shooter Information'!$E$3-('Shooter Information'!$G$3-RANK(K62,K$4:K$78,1)))","v":0},0]
[60,{"$f":"'Shooter Information'!B65","v":0},{"$f":"'Shooter Information'!C65","v":0},null,null,null,null,null,null,null,0,{"$f":"IF('Shooter Information'!$E$3-('Shooter Information'!$G$3-RANK(K63,K$4:K$78,1))<0,0,'Shooter Information'!$E$3-('Shooter Information'!$G$3-RANK(K63,K$4:K$78,1)))","v":0},0]
[61,{"$f":"'Shooter Information'!B66","v":0},{"$f":"'Shooter Information'!C66","v":0},null,null,null,null,null,null,null,0,{"$f":"IF('Shooter Information'!$E$3-('Shooter Information'!$G$3-RANK(K64,K$4:K$78,1))<0,0,'Shooter Information'!$E$3-('Shooter Information'!$G$3-RANK(K64,K$4:K$78,1)))","v":0},0]
[62,{"$f":"'Shooter Information'!B67","v":0},{"$f":"'Shooter Information'!C67","v":0},null,null,null,null,null,null,null,0,{"$f":"IF('Shooter Information'!$E$3-('Shooter Information'!$G$3-RANK(K65,K$4:K$78,1))<0,0,'Shooter Information'!$E$3-('Shooter Information'!$G$3-RANK(K65,K$4:K$78,1)))","v":0},0]
[63,{"$f":"'Shooter Information'!B68","v":0},{"$f":"'Shooter Information'!C68","v":0},null,null,null,null,null,null,null,0,{"$f":"IF('Shooter Information'!$E$3-('Shooter Information'!$G$3-RANK(K66,K$4:K$78,1))<0,0,'Shooter Information'!$E$3-('Shooter Information'!$G$3-RANK(K66,K$4:K$78,1)))","v":0},0]
[64,{"$f":"'Shooter Information'!B69","v":0},{"$f":"'Shooter Information'!C69","v":0},null,null,null,null,null,null,null,0,{"$f":"IF('Shooter Information'!$E$3-('Shooter Information'!$G$3-RANK(K67,K$4:K$78,1))<0,0,'Shooter Information'!$E$3-('Shooter Information'!$G$3-RANK(K67,K$4:K$78,1)))","v":0},0]
[65,{"$f":"'Shooter Information'!B70","v":0},{"$f":"'Shooter Information'!C70","v":0},null,null,null,null,null,null,null,0,{"$f":"IF('Shooter Information'!$E$3-('Shooter Information'!$G$3-RANK(K68,K$4:K$78,1))<0,0,'Shooter Information'!$E$3-('Shooter Information'!$G$3-RANK(K68,K$4:K$78,1)))","v":0},0]
[66,{"$f":"'Shooter Information'!B71","v":0},{"$f":"'Shooter Information'!C71","v":0},null,null,null,null,null,null,null,{"$f":"(D69*5)+E69-F69+(G69*10)+(H69*30)+(I69*999)+(J69*999.99)","v":0},{"$f":"IF('Shooter Information'!$E$3-('Shooter Information'!$G$3-RANK(K69,K$4:K$78,1))<0,0,'Shooter Information'!$E$3-('Shooter Information'!$G$3-RANK(K69,K$4:K$78,1)))","v":0},{"$f":"(SUM(D69+G69+H69+I69+J69))","v":0}]
[67,{"$f":"'Shooter Information'!B72","v":0},{"$f":"'Shooter Information'!C72","v":0},null,null,null,null,null,null,null,0,{"$f":"IF('Shooter Information'!$E$3-('Shooter Information'!$G$3-RANK(K70,K$4:K$78,1))<0,0,'Shooter Information'!$E$3-('Shooter Information'!$G$3-RANK(K70,K$4:K$78,1)))","v":0},0]
[68,{"$f":"'Shooter Information'!B73","v":0},{"$f":"'Shooter Information'!C73","v":0},null,null,null,null,null,null,null,0,{"$f":"IF('Shooter Information'!$E$3-('Shooter Information'!$G$3-RANK(K71,K$4:K$78,1))<0,0,'Shooter Information'!$E$3-('Shooter Information'!$G$3-RANK(K71,K$4:K$78,1)))","v":0},0]
[69,{"$f":"'Shooter Information'!B74","v":0},{"$f":"'Shooter Information'!C74","v":0},null,null,null,null,null,null,null,0,{"$f":"IF('Shooter Information'!$E$3-('Shooter Information'!$G$3-RANK(K72,K$4:K$78,1))<0,0,'Shooter Information'!$E$3-('Shooter Information'!$G$3-RANK(K72,K$4:K$78,1)))","v":0},0]
[70,{"$f":"'Shooter Information'!B75","v":0},{"$f":"'Shooter Information'!C75","v":0},null,null,null,null,null,null,null,0,{"$f":"IF('Shooter Information'!$E$3-('Shooter Information'!$G$3-RANK(K73,K$4:K$78,1))<0,0,'Shooter Information'!$E$3-('Shooter Information'!$G$3-RANK(K73,K$4:K$78,1)))","v":0},0]
[71,{"$f":"'Shooter Information'!B76","v":0},{"$f":"'Shooter Information'!C76","v":0},null,null,null,null,null,null,null,0,{"$f":"IF('Shooter Information'!$E$3-('Shooter Information'!$G$3-RANK(K74,K$4:K$78,1))<0,0,'Shooter Information'!$E$3-('Shooter Information'!$G$3-RANK(K74,K$4:K$78,1)))","v":0},0]
[72,{"$f":"'Shooter Information'!B77","v":0},{"$f":"'Shooter Information'!C77","v":0},null,null,null,null,null,null,null,0,{"$f":"IF('Shooter Information'!$E$3-('Shooter Information'!$G$3-RANK(K75,K$4:K$78,1))<0,0,'Shooter Information'!$E$3-('Shooter Information'!$G$3-RANK(K75,K$4:K$78,1)))","v":0},0]
[73,{"$f":"'Shooter Information'!B78","v":0},{"$f":"'Shooter Information'!C78","v":0},null,null,null,null,null,null,null,0,{"$f":"IF('Shooter Information'!$E$3-('Shooter Information'!$G$3-RANK(K76,K$4:K$78,1))<0,0,'Shooter Information'!$E$3-('Shooter Information'!$G$3-RANK(K76,K$4:K$78,1)))","v":0},0]
[74,{"$f":"'Shooter Information'!B79","v":0},{"$f":"'Shooter Information'!C79","v":0},null,null,null,null,null,null,null,0,{"$f":"IF('Shooter Information'!$E$3-('Shooter Information'!$G$3-RANK(K77,K$4:K$78,1))<0,0,'Shooter Information'!$E$3-('Shooter Information'!$G$3-RANK(K77,K$4:K$78,1)))","v":0},0]
[75,{"$f":"'Shooter Information'!B80","v":0},{"$f":"'Shooter Information'!C80","v":0},null,null,null,null,null,null,null,0,{"$f":"IF('Shooter Information'!$E$3-('Shooter Information'!$G$3-RANK(K78,K$4:K$78,1))<0,0,'Shooter Information'!$E$3-('Shooter Information'!$G$3-RANK(K78,K$4:K$78,1)))","v":0},0]

{"sheet":"Score Summary","index":13,"n_rows":79,"n_cols":37,"rows_kept":79,"cut":false,"hidden":false,"merged":[]}
[{"$f":"'Shooter Information'!$E$1","v":"Cavalier  Cowboys"}]
["Score Summary Sheet - (Sort:Rank/Time)"]
[{"$f":"'Shooter Information'!E2","v":"Sunday December 1st, 2013"}]
["Overall Finish","Shooter","Class","Class Finish","Stage 1","Rank 1","Stage 2","Rank 2","Stage 3","Rank 3","Stage 4","Rank 4","Stage 5","Rank 5","Stage 6","Rank 6","Stage 7","Rank 7","Stage 8","Rank 8","Stage 9","Rank 9","Stage 10","Rank 10","Stage 11","Rank 11","Stage 12","Rank 12","Grand Total","Rank Total","CAD","Award Eligible","Time Sort","Rank Sort","Class Sort","Orig Row Sort","Total DNF's"]
[{"$f":"IF(AF5=\"Yes\",IF('Shooter Information'!$C$2=\"R\",(SUMPRODUCT(--(AD5>$AD$5:$AD$79),--(\"Yes\"=$AF$5:$AF$79))+1),(SUMPRODUCT(--(AC5>$AC$5:$AC$79),--(\"Yes\"=$AF$5:$AF$79))+1)),0)","v":1},{"$f":"'Shooter Information'!B18","v":"B. S. Walker"},{"$f":"'Shooter Information'!C18","v":49},{"$f":"IF(AF5=\"Yes\",IF('Shooter Information'!$C$2=\"R\",(SUMPRODUCT(--(C5=$C$5:$C$79),--(AD5>$AD$5:$AD$79),--(\"Yes\"=$AF$5:$AF$79))+1),(SUMPRODUCT(--(C5=$C$5:$C$79),--(AC5>$AC$5:$AC$79),--(\"Yes\"=$AF$5:$AF$79))+1)),0)","v":1},{"$f":"+'Stage 1'!K16","v":36.54},{"$f":"+'Stage 1'!L16","v":9},{"$f":"+'Stage 2'!K16","v":25.89},{"$f":"+'Stage 2'!L16","v":1},{"$f":"+'Stage 3'!K16","v":30.93},{"$f":"+'Stage 3'!L16","v":1},{"$f":"+'Stage 4'!K16","v":25.47},{"$f":"+'Stage 4'!L16","v":1},{"$f":"+'Stage 5'!K16","v":26.81},{"$f":"+'Stage 5'!L16","v":2},{"$f":"+'Stage 6'!K16","v":23.75},{"$f":"+'Stage 6'!L16","v":1},{"$f":"+'Stage 7'!K16","v":0},{"$f":"+'Stage 7'!L16","v":0},{"$f":"+'Stage 8'!K16","v":0},{"$f":"+'Stage 8'!L16","v":0},{"$f":"+'Stage 9'!K16","v":0},{"$f":"+'Stage 9'!L16","v":0},{"$f":"+'Stage 10'!K16","v":0},{"$f":"+'Stage 10'!L16","v":0},{"$f":"+'Stage 11'!K16","v":0},{"$f":"+'Stage 11'!L16","v":0},{"$f":"+'Stage 12'!K16","v":0},{"$f":"+'Stage 12'!L16","v":0},{"$f":"+E5+G5+I5+K5+M5+O5+Q5+S5+U5+W5+Y5+AA5","v":169.39},{"$f":"+F5+H5+J5+L5+N5+P5+R5+T5+V5+X5+Z5+AB5","v":15},{"$f":"IF(ISBLANK('Shooter Information'!B18),,IF(SUM('Stage 1'!M16,'Stage 2'!M16,'Stage 3'!M16,'Stage 4'!M16,'Stage 5'!M16,'Stage 6'!M16,'Stage 7'!M16,'Stage 8'!M16,'Stage 9'!M16,'Stage 10'!M16,'Stage 11'!M16,'Stage 12'!M16)=0,\"Yes\",\"No\"))","v":"Yes"},{"$f":"IF(ISBLANK('Shooter Information'!B18),,IF(AK5>=2,\"No\",\"Yes\"))","v":"Yes"},{"$f":"IF(AC5=0,99999,AC5)","v":169.39},{"$f":"IF(AD5=0,99999,AD5)","v":15},{"$f":"IF(ISBLANK('Shooter Information'!C18),\"ZZZZZZZZZZ\",C5)","v":49},{"$f":"CELL(\"row\",'Shooter Information'!B18)","v":18},{"$f":"SUM('Stage 1'!I16,'Stage 2'!I16,'Stage 3'!I16,'Stage 4'!I16,'Stage 5'!I16,'Stage 6'!I16,'Stage 7'!I16,'Stage 8'!I16,'Stage 9'!I16,'Stage 10'!I16,'Stage 11'!I16,'Stage 12'!I16)","v":0}]
[{"$f":"IF(AF6=\"Yes\",IF('Shooter Information'!$C$2=\"R\",(SUMPRODUCT(--(AD6>$AD$5:$AD$79),--(\"Yes\"=$AF$5:$AF$79))+1),(SUMPRODUCT(--(AC6>$AC$5:$AC$79),--(\"Yes\"=$AF$5:$AF$79))+1)),0)","v":2},{"$f":"'Shooter Information'!B7","v":"Lefty Spurmaker"},{"$f":"'Shooter Information'!C7","v":49},{"$f":"IF(AF6=\"Yes\",IF('Shooter Information'!$C$2=\"R\",(SUMPRODUCT(--(C6=$C$5:$C$79),--(AD6>$AD$5:$AD$79),--(\"Yes\"=$AF$5:$AF$79))+1),(SUMPRODUCT(--(C6=$C$5:$C$79),--(AC6>$AC$5:$AC$79),--(\"Yes\"=$AF$5:$AF$79))+1)),0)","v":2},{"$f":"+'Stage 1'!K5","v":25.84},{"$f":"+'Stage 1'!L5","v":1},{"$f":"+'Stage 2'!K5","v":28.46},{"$f":"+'Stage 2'!L5","v":2},{"$f":"+'Stage 3'!K5","v":33.659999999999997},{"$f":"+'Stage 3'!L5","v":2},{"$f":"+'Stage 4'!K5","v":33.9},{"$f":"+'Stage 4'!L5","v":5},{"$f":"+'Stage 5'!K5","v":30.98},{"$f":"+'Stage 5'!L5","v":6},{"$f":"+'Stage 6'!K5","v":30.9},{"$f":"+'Stage 6'!L5","v":6},{"$f":"+'Stage 7'!K5","v":0},{"$f":"+'Stage 7'!L5","v":0},{"$f":"+'Stage 8'!K5","v":0},{"$f":"+'Stage 8'!L5","v":0},{"$f":"+'Stage 9'!K5","v":0},{"$f":"+'Stage 9'!L5","v":0},{"$f":"+'Stage 10'!K5","v":0},{"$f":"+'Stage 10'!L5","v":0},{"$f":"+'Stage 11'!K5","v":0},{"$f":"+'Stage 11'!L5","v":0},{"$f":"+'Stage 12'!K5","v":0},{"$f":"+'Stage 12'!L5","v":0},183.73999999999998,22,{"$f":"IF(ISBLANK('Shooter Information'!B7),,IF(SUM('Stage 1'!M5,'Stage 2'!M5,'Stage 3'!M5,'Stage 4'!M5,'Stage 5'!M5,'Stage 6'!M5,'Stage 7'!M5,'Stage 8'!M5,'Stage 9'!M5,'Stage 10'!M5,'Stage 11'!M5,'Stage 12'!M5)=0,\"Yes\",\"No\"))","v":"No"},{"$f":"IF(ISBLANK('Shooter Information'!B7),,IF(AK6>=2,\"No\",\"Yes\"))","v":"Yes"},183.73999999999998,22,{"$f":"IF(ISBLANK('Shooter Information'!C7),\"ZZZZZZZZZZ\",C6)","v":49},{"$f":"CELL(\"row\",'Shooter Information'!B7)","v":7},{"$f":"SUM('Stage 1'!I5,'Stage 2'!I5,'Stage 3'!I5,'Stage 4'!I5,'Stage 5'!I5,'Stage 6'!I5,'Stage 7'!I5,'Stage 8'!I5,'Stage 9'!I5,'Stage 10'!I5,'Stage 11'!I5,'Stage 12'!I5)","v":0}]
[{"$f":"IF(AF7=\"Yes\",IF('Shooter Information'!$C$2=\"R\",(SUMPRODUCT(--(AD7>$AD$5:$AD$79),--(\"Yes\"=$AF$5:$AF$79))+1),(SUMPRODUCT(--(AC7>$AC$5:$AC$79),--(\"Yes\"=$AF$5:$AF$79))+1)),0)","v":3},{"$f":"'Shooter Information'!B6","v":"Striker"},{"$f":"'Shooter Information'!C6","v":"GF"},{"$f":"IF(AF7=\"Yes\",IF('Shooter Information'!$C$2=\"R\",(SUMPRODUCT(--(C7=$C$5:$C$79),--(AD7>$AD$5:$AD$79),--(\"Yes\"=$AF$5:$AF$79))+1),(SUMPRODUCT(--(C7=$C$5:$C$79),--(AC7>$AC$5:$AC$79),--(\"Yes\"=$AF$5:$AF$79))+1)),0)","v":1},{"$f":"+'Stage 1'!K4","v":25.99},{"$f":"+'Stage 1'!L4","v":2},{"$f":"+'Stage 2'!K4","v":29.83},{"$f":"+'Stage 2'!L4","v":4},{"$f":"+'Stage 3'!K4","v":36.79},{"$f":"+'Stage 3'!L4","v":4},{"$f":"+'Stage 4'!K4","v":38.56},{"$f":"+'Stage 4'!L4","v":10},{"$f":"+'Stage 5'!K4","v":26.75},{"$f":"+'Stage 5'!L4","v":1},{"$f":"+'Stage 6'!K4","v":27.74},{"$f":"+'Stage 6'!L4","v":3},{"$f":"+'Stage 7'!K4","v":0},{"$f":"+'Stage 7'!L4","v":0},{"$f":"+'Stage 8'!K4","v":0},{"$f":"+'Stage 8'!L4","v":0},{"$f":"+'Stage 9'!K4","v":0},{"$f":"+'Stage 9'!L4","v":0},{"$f":"+'Stage 10'!K4","v":0},{"$f":"+'Stage 10'!L4","v":0},{"$f":"+'Stage 11'!K4","v":0},{"$f":"+'Stage 11'!L4","v":0},{"$f":"+'Stage 12'!K4","v":0},{"$f":"+'Stage 12'!L4","v":0},185.66,24,{"$f":"IF(ISBLANK('Shooter Information'!B6),,IF(SUM('Stage 1'!M4,'Stage 2'!M4,'Stage 3'!M4,'Stage 4'!M4,'Stage 5'!M4,'Stage 6'!M4,'Stage 7'!M4,'Stage 8'!M4,'Stage 9'!M4,'Stage 10'!M4,'Stage 11'!M4,'Stage 12'!M4)=0,\"Yes\",\"No\"))","v":"No"},{"$f":"IF(ISBLANK('Shooter Information'!B6),,IF(AK7>=2,\"No\",\"Yes\"))","v":"Yes"},185.66,24,{"$f":"IF(ISBLANK('Shooter Information'!C6),\"ZZZZZZZZZZ\",C7)","v":"GF"},{"$f":"CELL(\"row\",'Shooter Information'!B6)","v":6},{"$f":"SUM('Stage 1'!I4,'Stage 2'!I4,'Stage 3'!I4,'Stage 4'!I4,'Stage 5'!I4,'Stage 6'!I4,'Stage 7'!I4,'Stage 8'!I4,'Stage 9'!I4,'Stage 10'!I4,'Stage 11'!I4,'Stage 12'!I4)","v":0}]
[{"$f":"IF(AF8=\"Yes\",IF('Shooter Information'!$C$2=\"R\",(SUMPRODUCT(--(AD8>$AD$5:$AD$79),--(\"Yes\"=$AF$5:$AF$79))+1),(SUMPRODUCT(--(AC8>$AC$5:$AC$79),--(\"Yes\"=$AF$5:$AF$79))+1)),0)","v":4},{"$f":"'Shooter Information'!B17","v":"Justice Jack"},{"$f":"'Shooter Information'!C17","v":"SS"},{"$f":"IF(AF8=\"Yes\",IF('Shooter Information'!$C$2=\"R\",(SUMPRODUCT(--(C8=$C$5:$C$79),--(AD8>$AD$5:$AD$79),--(\"Yes\"=$AF$5:$AF$79))+1),(SUMPRODUCT(--(C8=$C$5:$C$79),--(AC8>$AC$5:$AC$79),--(\"Yes\"=$AF$5:$AF$79))+1)),0)","v":1},{"$f":"+'Stage 1'!K15","v":29.45},{"$f":"+'Stage 1'!L15","v":3},{"$f":"+'Stage 2'!K15","v":37.340000000000003},{"$f":"+'Stage 2'!L15","v":8},{"$f":"+'Stage 3'!K15","v":33.75},{"$f":"+'Stage 3'!L15","v":3},{"$f":"+'Stage 4'!K15","v":31.6},{"$f":"+'Stage 4'!L15","v":3},{"$f":"+'Stage 5'!K15","v":30.33},{"$f":"+'Stage 5'!L15","v":5},{"$f":"+'Stage 6'!K15","v":44.06},{"$f":"+'Stage 6'!L15","v":12},{"$f":"+'Stage 7'!K15","v":0},{"$f":"+'Stage 7'!L15","v":0},{"$f":"+'Stage 8'!K15","v":0},{"$f":"+'Stage 8'!L15","v":0},{"$f":"+'Stage 9'!K15","v":0},{"$f":"+'Stage 9'!L15","v":0},{"$f":"+'Stage 10'!K15","v":0},{"$f":"+'Stage 10'!L15","v":0},{"$f":"+'Stage 11'!K15","v":0},{"$f":"+'Stage 11'!L15","v":0},{"$f":"+'Stage 12'!K15","v":0},{"$f":"+'Stage 12'!L15","v":0},206.53000000000003,34,{"$f":"IF(ISBLANK('Shooter Information'!B17),,IF(SUM('Stage 1'!M15,'Stage 2'!M15,'Stage 3'!M15,'Stage 4'!M15,'Stage 5'!M15,'Stage 6'!M15,'Stage 7'!M15,'Stage 8'!M15,'Stage 9'!M15,'Stage 10'!M15,'Stage 11'!M15,'Stage 12'!M15)=0,\"Yes\",\"No\"))","v":"No"},{"$f":"IF(ISBLANK('Shooter Information'!B17),,IF(AK8>=2,\"No\",\"Yes\"))","v":"Yes"},206.53000000000003,34,{"$f":"IF(ISBLANK('Shooter Information'!C17),\"ZZZZZZZZZZ\",C8)","v":"SS"},{"$f":"CELL(\"row\",'Shooter Information'!B17)","v":17},{"$f":"SUM('Stage 1'!I15,'Stage 2'!I15,'Stage 3'!I15,'Stage 4'!I15,'Stage 5'!I15,'Stage 6'!I15,'Stage 7'!I15,'Stage 8'!I15,'Stage 9'!I15,'Stage 10'!I15,'Stage 11'!I15,'Stage 12'!I15)","v":0}]
[{"$f":"IF(AF9=\"Yes\",IF('Shooter Information'!$C$2=\"R\",(SUMPRODUCT(--(AD9>$AD$5:$AD$79),--(\"Yes\"=$AF$5:$AF$79))+1),(SUMPRODUCT(--(AC9>$AC$5:$AC$79),--(\"Yes\"=$AF$5:$AF$79))+1)),0)","v":5},{"$f":"'Shooter Information'!B14","v":"Beartooth"},{"$f":"'Shooter Information'!C14","v":"S"},{"$f":"IF(AF9=\"Yes\",IF('Shooter Information'!$C$2=\"R\",(SUMPRODUCT(--(C9=$C$5:$C$79),--(AD9>$AD$5:$AD$79),--(\"Yes\"=$AF$5:$AF$79))+1),(SUMPRODUCT(--(C9=$C$5:$C$79),--(AC9>$AC$5:$AC$79),--(\"Yes\"=$AF$5:$AF$79))+1)),0)","v":1},{"$f":"+'Stage 1'!K12","v":35.89},{"$f":"+'Stage 1'!L12","v":6},{"$f":"+'Stage 2'!K12","v":34.370000000000005},{"$f":"+'Stage 2'!L12","v":5},{"$f":"+'Stage 3'!K12","v":36.799999999999997},{"$f":"+'Stage 3'!L12","v":5},{"$f":"+'Stage 4'!K12","v":36.67},{"$f":"+'Stage 4'!L12","v":9},{"$f":"+'Stage 5'!K12","v":32.909999999999997},{"$f":"+'Stage 5'!L12","v":8},{"$f":"+'Stage 6'!K12","v":28.28},{"$f":"+'Stage 6'!L12","v":4},{"$f":"+'Stage 7'!K12","v":0},{"$f":"+'Stage 7'!L12","v":0},{"$f":"+'Stage 8'!K12","v":0},{"$f":"+'Stage 8'!L12","v":0},{"$f":"+'Stage 9'!K12","v":0},{"$f":"+'Stage 9'!L12","v":0},{"$f":"+'Stage 10'!K12","v":0},{"$f":"+'Stage 10'!L12","v":0},{"$f":"+'Stage 11'!K12","v":0},{"$f":"+'Stage 11'!L12","v":0},{"$f":"+'Stage 12'!K12","v":0},{"$f":"+'Stage 12'!L12","v":0},204.92000000000002,37,{"$f":"IF(ISBLANK('Shooter Information'!B14),,IF(SUM('Stage 1'!M12,'Stage 2'!M12,'Stage 3'!M12,'Stage 4'!M12,'Stage 5'!M12,'Stage 6'!M12,'Stage 7'!M12,'Stage 8'!M12,'Stage 9'!M12,'Stage 10'!M12,'Stage 11'!M12,'Stage 12'!M12)=0,\"Yes\",\"No\"))","v":"No"},{"$f":"IF(ISBLANK('Shooter Information'!B14),,IF(AK9>=2,\"No\",\"Yes\"))","v":"Yes"},204.92000000000002,37,{"$f":"IF(ISBLANK('Shooter Information'!C14),\"ZZZZZZZZZZ\",C9)","v":"S"},{"$f":"CELL(\"row\",'Shooter Information'!B14)","v":14},{"$f":"SUM('Stage 1'!I12,'Stage 2'!I12,'Stage 3'!I12,'Stage 4'!I12,'Stage 5'!I12,'Stage 6'!I12,'Stage 7'!I12,'Stage 8'!I12,'Stage 9'!I12,'Stage 10'!I12,'Stage 11'!I12,'Stage 12'!I12)","v":0}]
[{"$f":"IF(AF10=\"Yes\",IF('Shooter Information'!$C$2=\"R\",(SUMPRODUCT(--(AD10>$AD$5:$AD$79),--(\"Yes\"=$AF$5:$AF$79))+1),(SUMPRODUCT(--(AC10>$AC$5:$AC$79),--(\"Yes\"=$AF$5:$AF$79))+1)),0)","v":5},{"$f":"'Shooter Information'!B13","v":"Kuba Kid"},{"$f":"'Shooter Information'!C13","v":"D"},{"$f":"IF(AF10=\"Yes\",IF('Shooter Information'!$C$2=\"R\",(SUMPRODUCT(--(C10=$C$5:$C$79),--(AD10>$AD$5:$AD$79),--(\"Yes\"=$AF$5:$AF$79))+1),(SUMPRODUCT(--(C10=$C$5:$C$79),--(AC10>$AC$5:$AC$79),--(\"Yes\"=$AF$5:$AF$79))+1)),0)","v":1},{"$f":"+'Stage 1'!K11","v":40.51},{"$f":"+'Stage 1'!L11","v":10},{"$f":"+'Stage 2'!K11","v":35.42},{"$f":"+'Stage 2'!L11","v":7},{"$f":"+'Stage 3'!K11","v":39.6},{"$f":"+'Stage 3'!L11","v":8},{"$f":"+'Stage 4'!K11","v":33.17},{"$f":"+'Stage 4'!L11","v":4},{"$f":"+'Stage 5'!K11","v":27.96},{"$f":"+'Stage 5'!L11","v":3},{"$f":"+'Stage 6'!K11","v":30.65},{"$f":"+'Stage 6'!L11","v":5},{"$f":"+'Stage 7'!K11","v":0},{"$f":"+'Stage 7'!L11","v":0},{"$f":"+'Stage 8'!K11","v":0},{"$f":"+'Stage 8'!L11","v":0},{"$f":"+'Stage 9'!K11","v":0},{"$f":"+'Stage 9'!L11","v":0},{"$f":"+'Stage 10'!K11","v":0},{"$f":"+'Stage 10'!L11","v":0},{"$f":"+'Stage 11'!K11","v":0},{"$f":"+'Stage 11'!L11","v":0},{"$f":"+'Stage 12'!K11","v":0},{"$f":"+'Stage 12'!L11","v":0},207.31,37,{"$f":"IF(ISBLANK('Shooter Information'!B13),,IF(SUM('Stage 1'!M11,'Stage 2'!M11,'Stage 3'!M11,'Stage 4'!M11,'Stage 5'!M11,'Stage 6'!M11,'Stage 7'!M11,'Stage 8'!M11,'Stage 9'!M11,'Stage 10'!M11,'Stage 11'!M11,'Stage 12'!M11)=0,\"Yes\",\"No\"))","v":"No"},{"$f":"IF(ISBLANK('Shooter Information'!B13),,IF(AK10>=2,\"No\",\"Yes\"))","v":"Yes"},207.31,37,{"$f":"IF(ISBLANK('Shooter Information'!C13),\"ZZZZZZZZZZ\",C10)","v":"D"},{"$f":"CELL(\"row\",'Shooter Information'!B13)","v":13},{"$f":"SUM('Stage 1'!I11,'Stage 2'!I11,'Stage 3'!I11,'Stage 4'!I11,'Stage 5'!I11,'Stage 6'!I11,'Stage 7'!I11,'Stage 8'!I11,'Stage 9'!I11,'Stage 10'!I11,'Stage 11'!I11,'Stage 12'!I11)","v":0}]
[{"$f":"IF(AF11=\"Yes\",IF('Shooter Information'!$C$2=\"R\",(SUMPRODUCT(--(AD11>$AD$5:$AD$79),--(\"Yes\"=$AF$5:$AF$79))+1),(SUMPRODUCT(--(AC11>$AC$5:$AC$79),--(\"Yes\"=$AF$5:$AF$79))+1)),0)","v":7},{"$f":"'Shooter Information'!B19","v":"Red Cavanaugh"},{"$f":"'Shooter Information'!C19","v":49},{"$f":"IF(AF11=\"Yes\",IF('Shooter Information'!$C$2=\"R\",(SUMPRODUCT(--(C11=$C$5:$C$79),--(AD11>$AD$5:$AD$79),--(\"Yes\"=$AF$5:$AF$79))+1),(SUMPRODUCT(--(C11=$C$5:$C$79),--(AC11>$AC$5:$AC$79),--(\"Yes\"=$AF$5:$AF$79))+1)),0)","v":3},{"$f":"+'Stage 1'!K17","v":31.34},{"$f":"+'Stage 1'!L17","v":4},{"$f":"+'Stage 2'!K17","v":28.87},{"$f":"+'Stage 2'!L17","v":3},{"$f":"+'Stage 3'!K17","v":38.619999999999997},{"$f":"+'Stage 3'!L17","v":6},{"$f":"+'Stage 4'!K17","v":46.56},{"$f":"+'Stage 4'!L17","v":12},{"$f":"+'Stage 5'!K17","v":36.409999999999997},{"$f":"+'Stage 5'!L17","v":11},{"$f":"+'Stage 6'!K17","v":31.24},{"$f":"+'Stage 6'!L17","v":7},{"$f":"+'Stage 7'!K17","v":0},{"$f":"+'Stage 7'!L17","v":0},{"$f":"+'Stage 8'!K17","v":0},{"$f":"+'Stage 8'!L17","v":0},{"$f":"+'Stage 9'!K17","v":0},{"$f":"+'Stage 9'!L17","v":0},{"$f":"+'Stage 10'!K17","v":0},{"$f":"+'Stage 10'!L17","v":0},{"$f":"+'Stage 11'!K17","v":0},{"$f":"+'Stage 11'!L17","v":0},{"$f":"+'Stage 12'!K17","v":0},{"$f":"+'Stage 12'!L17","v":0},213.04,43,{"$f":"IF(ISBLANK('Shooter Information'!B19),,IF(SUM('Stage 1'!M17,'Stage 2'!M17,'Stage 3'!M17,'Stage 4'!M17,'Stage 5'!M17,'Stage 6'!M17,'Stage 7'!M17,'Stage 8'!M17,'Stage 9'!M17,'Stage 10'!M17,'Stage 11'!M17,'Stage 12'!M17)=0,\"Yes\",\"No\"))","v":"No"},{"$f":"IF(ISBLANK('Shooter Information'!B19),,IF(AK11>=2,\"No\",\"Yes\"))","v":"Yes"},213.04,43,{"$f":"IF(ISBLANK('Shooter Information'!C19),\"ZZZZZZZZZZ\",C11)","v":49},{"$f":"CELL(\"row\",'Shooter Information'!B19)","v":19},{"$f":"SUM('Stage 1'!I17,'Stage 2'!I17,'Stage 3'!I17,'Stage 4'!I17,'Stage 5'!I17,'Stage 6'!I17,'Stage 7'!I17,'Stage 8'!I17,'Stage 9'!I17,'Stage 10'!I17,'Stage 11'!I17,'Stage 12'!I17)","v":0}]
[{"$f":"IF(AF12=\"Yes\",IF('Shooter Information'!$C$2=\"R\",(SUMPRODUCT(--(AD12>$AD$5:$AD$79),--(\"Yes\"=$AF$5:$AF$79))+1),(SUMPRODUCT(--(AC12>$AC$5:$AC$79),--(\"Yes\"=$AF$5:$AF$79))+1)),0)","v":0},{"$f":"'Shooter Information'!B12","v":"Cockroach"},{"$f":"'Shooter Information'!C12","v":"CB"},{"$f":"IF(AF12=\"Yes\",IF('Shooter Information'!$C$2=\"R\",(SUMPRODUCT(--(C12=$C$5:$C$79),--(AD12>$AD$5:$AD$79),--(\"Yes\"=$AF$5:$AF$79))+1),(SUMPRODUCT(--(C12=$C$5:$C$79),--(AC12>$AC$5:$AC$79),--(\"Yes\"=$AF$5:$AF$79))+1)),0)","v":0},{"$f":"+'Stage 1'!K10","v":41.83},{"$f":"+'Stage 1'!L10","v":11},{"$f":"+'Stage 2'!K10","v":999},{"$f":"+'Stage 2'!L10","v":15},{"$f":"+'Stage 3'!K10","v":999},{"$f":"+'Stage 3'!L10","v":15},{"$f":"+'Stage 4'!K10","v":27.99},{"$f":"+'Stage 4'!L10","v":2},{"$f":"+'Stage 5'!K10","v":30.22},{"$f":"+'Stage 5'!L10","v":4},{"$f":"+'Stage 6'!K10","v":23.88},{"$f":"+'Stage 6'!L10","v":2},{"$f":"+'Stage 7'!K10","v":0},{"$f":"+'Stage 7'!L10","v":0},{"$f":"+'Stage 8'!K10","v":0},{"$f":"+'Stage 8'!L10","v":0},{"$f":"+'Stage 9'!K10","v":0},{"$f":"+'Stage 9'!L10","v":0},{"$f":"+'Stage 10'!K10","v":0},{"$f":"+'Stage 10'!L10","v":0},{"$f":"+'Stage 11'!K10","v":0},{"$f":"+'Stage 11'!L10","v":0},{"$f":"+'Stage 12'!K10","v":0},{"$f":"+'Stage 12'!L10","v":0},2121.9199999999996,49,{"$f":"IF(ISBLANK('Shooter Information'!B12),,IF(SUM('Stage 1'!M10,'Stage 2'!M10,'Stage 3'!M10,'Stage 4'!M10,'Stage 5'!M10,'Stage 6'!M10,'Stage 7'!M10,'Stage 8'!M10,'Stage 9'!M10,'Stage 10'!M10,'Stage 11'!M10,'Stage 12'!M10)=0,\"Yes\",\"No\"))","v":"No"},{"$f":"IF(ISBLANK('Shooter Information'!B12),,IF(AK12>=2,\"No\",\"Yes\"))","v":"No"},2121.9199999999996,49,{"$f":"IF(ISBLANK('Shooter Information'!C12),\"ZZZZZZZZZZ\",C12)","v":"CB"},{"$f":"CELL(\"row\",'Shooter Information'!B12)","v":12},{"$f":"SUM('Stage 1'!I10,'Stage 2'!I10,'Stage 3'!I10,'Stage 4'!I10,'Stage 5'!I10,'Stage 6'!I10,'Stage 7'!I10,'Stage 8'!I10,'Stage 9'!I10,'Stage 10'!I10,'Stage 11'!I10,'Stage 12'!I10)","v":2}]
[{"$f":"IF(AF13=\"Yes\",IF('Shooter Information'!$C$2=\"R\",(SUMPRODUCT(--(AD13>$AD$5:$AD$79),--(\"Yes\"=$AF$5:$AF$79))+1),(SUMPRODUCT(--(AC13>$AC$5:$AC$79),--(\"Yes\"=$AF$5:$AF$79))+1)),0)","v":8},{"$f":"'Shooter Information'!B11","v":"Enid City Kid"},{"$f":"'Shooter Information'!C11","v":"FC"},{"$f":"IF(AF13=\"Yes\",IF('Shooter Information'!$C$2=\"R\",(SUMPRODUCT(--(C13=$C$5:$C$79),--(AD13>$AD$5:$AD$79),--(\"Yes\"=$AF$5:$AF$79))+1),(SUMPRODUCT(--(C13=$C$5:$C$79),--(AC13>$AC$5:$AC$79),--(\"Yes\"=$AF$5:$AF$79))+1)),0)","v":1},{"$f":"+'Stage 1'!K9","v":34.35},{"$f":"+'Stage 1'!L9","v":5},{"$f":"+'Stage 2'!K9","v":43.48},{"$f":"+'Stage 2'!L9","v":12},{"$f":"+'Stage 3'!K9","v":39.119999999999997},{"$f":"+'Stage 3'!L9","v":7},{"$f":"+'Stage 4'!K9","v":34.270000000000003},{"$f":"+'Stage 4'!L9","v":6},{"$f":"+'Stage 5'!K9","v":32.380000000000003},{"$f":"+'Stage 5'!L9","v":7},{"$f":"+'Stage 6'!K9","v":56.07},{"$f":"+'Stage 6'!L9","v":13},{"$f":"+'Stage 7'!K9","v":0},{"$f":"+'Stage 7'!L9","v":0},{"$f":"+'Stage 8'!K9","v":0},{"$f":"+'Stage 8'!L9","v":0},{"$f":"+'Stage 9'!K9","v":0},{"$f":"+'Stage 9'!L9","v":0},{"$f":"+'Stage 10'!K9","v":0},{"$f":"+'Stage 10'!L9","v":0},{"$f":"+'Stage 11'!K9","v":0},{"$f":"+'Stage 11'!L9","v":0},{"$f":"+'Stage 12'!K9","v":0},{"$f":"+'Stage 12'!L9","v":0},239.67,50,{"$f":"IF(ISBLANK('Shooter Information'!B11),,IF(SUM('Stage 1'!M9,'Stage 2'!M9,'Stage 3'!M9,'Stage 4'!M9,'Stage 5'!M9,'Stage 6'!M9,'Stage 7'!M9,'Stage 8'!M9,'Stage 9'!M9,'Stage 10'!M9,'Stage 11'!M9,'Stage 12'!M9)=0,\"Yes\",\"No\"))","v":"No"},{"$f":"IF(ISBLANK('Shooter Information'!B11),,IF(AK13>=2,\"No\",\"Yes\"))","v":"Yes"},239.67,50,{"$f":"IF(ISBLANK('Shooter Information'!C11),\"ZZZZZZZZZZ\",C13)","v":"FC"},{"$f":"CELL(\"row\",'Shooter Information'!B11)","v":11},{"$f":"SUM('Stage 1'!I9,'Stage 2'!I9,'Stage 3'!I9,'Stage 4'!I9,'Stage 5'!I9,'Stage 6'!I9,'Stage 7'!I9,'Stage 8'!I9,'Stage 9'!I9,'Stage 10'!I9,'Stage 11'!I9,'Stage 12'!I9)","v":0}]
[{"$f":"IF(AF14=\"Yes\",IF('Shooter Information'!$C$2=\"R\",(SUMPRODUCT(--(AD14>$AD$5:$AD$79),--(\"Yes\"=$AF$5:$AF$79))+1),(SUMPRODUCT(--(AC14>$AC$5:$AC$79),--(\"Yes\"=$AF$5:$AF$79))+1)),0)","v":9},{"$f":"'Shooter Information'!B10","v":"Prairie City Slim"},{"$f":"'Shooter Information'!C10","v":"SS"},{"$f":"IF(AF14=\"Yes\",IF('Shooter Information'!$C$2=\"R\",(SUMPRODUCT(--(C14=$C$5:$C$79),--(AD14>$AD$5:$AD$79),--(\"Yes\"=$AF$5:$AF$79))+1),(SUMPRODUCT(--(C14=$C$5:$C$79),--(AC14>$AC$5:$AC$79),--(\"Yes\"=$AF$5:$AF$79))+1)),0)","v":2},{"$f":"+'Stage 1'!K8","v":45.65},{"$f":"+'Stage 1'!L8","v":12},{"$f":"+'Stage 2'!K8","v":38.17},{"$f":"+'Stage 2'!L8","v":9},{"$f":"+'Stage 3'!K8","v":45.15},{"$f":"+'Stage 3'!L8","v":10},{"$f":"+'Stage 4'!K8","v":40.17},{"$f":"+'Stage 4'!L8","v":11},{"$f":"+'Stage 5'!K8","v":36.04},{"$f":"+'Stage 5'!L8","v":10},{"$f":"+'Stage 6'!K8","v":36.08},{"$f":"+'Stage 6'!L8","v":10},{"$f":"+'Stage 7'!K8","v":0},{"$f":"+'Stage 7'!L8","v":0},{"$f":"+'Stage 8'!K8","v":0},{"$f":"+'Stage 8'!L8","v":0},{"$f":"+'Stage 9'!K8","v":0},{"$f":"+'Stage 9'!L8","v":0},{"$f":"+'Stage 10'!K8","v":0},{"$f":"+'Stage 10'!L8","v":0},{"$f":"+'Stage 11'!K8","v":0},{"$f":"+'Stage 11'!L8","v":0},{"$f":"+'Stage 12'!K8","v":0},{"$f":"+'Stage 12'!L8","v":0},241.26,62,{"$f":"IF(ISBLANK('Shooter Information'!B10),,IF(SUM('Stage 1'!M8,'Stage 2'!M8,'Stage 3'!M8,'Stage 4'!M8,'Stage 5'!M8,'Stage 6'!M8,'Stage 7'!M8,'Stage 8'!M8,'Stage 9'!M8,'Stage 10'!M8,'Stage 11'!M8,'Stage 12'!M8)=0,\"Yes\",\"No\"))","v":"Yes"},{"$f":"IF(ISBLANK('Shooter Information'!B10),,IF(AK14>=2,\"No\",\"Yes\"))","v":"Yes"},241.26,62,{"$f":"IF(ISBLANK('Shooter Information'!C10),\"ZZZZZZZZZZ\",C14)","v":"SS"},{"$f":"CELL(\"row\",'Shooter Information'!B10)","v":10},{"$f":"SUM('Stage 1'!I8,'Stage 2'!I8,'Stage 3'!I8,'Stage 4'!I8,'Stage 5'!I8,'Stage 6'!I8,'Stage 7'!I8,'Stage 8'!I8,'Stage 9'!I8,'Stage 10'!I8,'Stage 11'!I8,'Stage 12'!I8)","v":0}]
[{"$f":"IF(AF15=\"Yes\",IF('Shooter Information'!$C$2=\"R\",(SUMPRODUCT(--(AD15>$AD$5:$AD$79),--(\"Yes\"=$AF$5:$AF$79))+1),(SUMPRODUCT(--(AC15>$AC$5:$AC$79),--(\"Yes\"=$AF$5:$AF$79))+1)),0)","v":9},{"$f":"'Shooter Information'!B16","v":"Windhorse Rider"},{"$f":"'Shooter Information'!C16","v":"GF"},{"$f":"IF(AF15=\"Yes\",IF('Shooter Information'!$C$2=\"R\",(SUMPRODUCT(--(C15=$C$5:$C$79),--(AD15>$AD$5:$AD$79),--(\"Yes\"=$AF$5:$AF$79))+1),(SUMPRODUCT(--(C15=$C$5:$C$79),--(AC15>$AC$5:$AC$79),--(\"Yes\"=$AF$5:$AF$79))+1)),0)","v":2},{"$f":"+'Stage 1'!K14","v":36.03},{"$f":"+'Stage 1'!L14","v":7},{"$f":"+'Stage 2'!K14","v":42.69},{"$f":"+'Stage 2'!L14","v":11},{"$f":"+'Stage 3'!K14","v":48.35},{"$f":"+'Stage 3'!L14","v":12},{"$f":"+'Stage 4'!K14","v":54.45},{"$f":"+'Stage 4'!L14","v":14},{"$f":"+'Stage 5'!K14","v":33.24},{"$f":"+'Stage 5'!L14","v":9},{"$f":"+'Stage 6'!K14","v":35.96},{"$f":"+'Stage 6'!L14","v":9},{"$f":"+'Stage 7'!K14","v":0},{"$f":"+'Stage 7'!L14","v":0},{"$f":"+'Stage 8'!K14","v":0},{"$f":"+'Stage 8'!L14","v":0},{"$f":"+'Stage 9'!K14","v":0},{"$f":"+'Stage 9'!L14","v":0},{"$f":"+'Stage 10'!K14","v":0},{"$f":"+'Stage 10'!L14","v":0},{"$f":"+'Stage 11'!K14","v":0},{"$f":"+'Stage 11'!L14","v":0},{"$f":"+'Stage 12'!K14","v":0},{"$f":"+'Stage 12'!L14","v":0},250.72,62,{"$f":"IF(ISBLANK('Shooter Information'!B16),,IF(SUM('Stage 1'!M14,'Stage 2'!M14,'Stage 3'!M14,'Stage 4'!M14,'Stage 5'!M14,'Stage 6'!M14,'Stage 7'!M14,'Stage 8'!M14,'Stage 9'!M14,'Stage 10'!M14,'Stage 11'!M14,'Stage 12'!M14)=0,\"Yes\",\"No\"))","v":"No"},{"$f":"IF(ISBLANK('Shooter Information'!B16),,IF(AK15>=2,\"No\",\"Yes\"))","v":"Yes"},250.72,62,{"$f":"IF(ISBLANK('Shooter Information'!C16),\"ZZZZZZZZZZ\",C15)","v":"GF"},{"$f":"CELL(\"row\",'Shooter Information'!B16)","v":16},{"$f":"SUM('Stage 1'!I14,'Stage 2'!I14,'Stage 3'!I14,'Stage 4'!I14,'Stage 5'!I14,'Stage 6'!I14,'Stage 7'!I14,'Stage 8'!I14,'Stage 9'!I14,'Stage 10'!I14,'Stage 11'!I14,'Stage 12'!I14)","v":0}]
[{"$f":"IF(AF16=\"Yes\",IF('Shooter Information'!$C$2=\"R\",(SUMPRODUCT(--(AD16>$AD$5:$AD$79),--(\"Yes\"=$AF$5:$AF$79))+1),(SUMPRODUCT(--(AC16>$AC$5:$AC$79),--(\"Yes\"=$AF$5:$AF$79))+1)),0)","v":11},{"$f":"'Shooter Information'!B9","v":"Swifty McDraw"},{"$f":"'Shooter Information'!C9","v":"SS"},{"$f":"IF(AF16=\"Yes\",IF('Shooter Information'!$C$2=\"R\",(SUMPRODUCT(--(C16=$C$5:$C$79),--(AD16>$AD$5:$AD$79),--(\"Yes\"=$AF$5:$AF$79))+1),(SUMPRODUCT(--(C16=$C$5:$C$79),--(AC16>$AC$5:$AC$79),--(\"Yes\"=$AF$5:$AF$79))+1)),0)","v":3},{"$f":"+'Stage 1'!K7","v":85.05},{"$f":"+'Stage 1'!L7","v":14},{"$f":"+'Stage 2'!K7","v":45.94},{"$f":"+'Stage 2'!L7","v":13},{"$f":"+'Stage 3'!K7","v":44.47},{"$f":"+'Stage 3'!L7","v":9},{"$f":"+'Stage 4'!K7","v":35.549999999999997},{"$f":"+'Stage 4'!L7","v":7},{"$f":"+'Stage 5'!K7","v":38.07},{"$f":"+'Stage 5'!L7","v":13},{"$f":"+'Stage 6'!K7","v":35.46},{"$f":"+'Stage 6'!L7","v":8},{"$f":"+'Stage 7'!K7","v":0},{"$f":"+'Stage 7'!L7","v":0},{"$f":"+'Stage 8'!K7","v":0},{"$f":"+'Stage 8'!L7","v":0},{"$f":"+'Stage 9'!K7","v":0},{"$f":"+'Stage 9'!L7","v":0},{"$f":"+'Stage 10'!K7","v":0},{"$f":"+'Stage 10'!L7","v":0},{"$f":"+'Stage 11'!K7","v":0},{"$f":"+'Stage 11'!L7","v":0},{"$f":"+'Stage 12'!K7","v":0},{"$f":"+'Stage 12'!L7","v":0},284.53999999999996,64,{"$f":"IF(ISBLANK('Shooter Information'!B9),,IF(SUM('Stage 1'!M7,'Stage 2'!M7,'Stage 3'!M7,'Stage 4'!M7,'Stage 5'!M7,'Stage 6'!M7,'Stage 7'!M7,'Stage 8'!M7,'Stage 9'!M7,'Stage 10'!M7,'Stage 11'!M7,'Stage 12'!M7)=0,\"Yes\",\"No\"))","v":"Yes"},{"$f":"IF(ISBLANK('Shooter Information'!B9),,IF(AK16>=2,\"No\",\"Yes\"))","v":"Yes"},284.53999999999996,64,{"$f":"IF(ISBLANK('Shooter Information'!C9),\"ZZZZZZZZZZ\",C16)","v":"SS"},{"$f":"CELL(\"row\",'Shooter Information'!B9)","v":9},{"$f":"SUM('Stage 1'!I7,'Stage 2'!I7,'Stage 3'!I7,'Stage 4'!I7,'Stage 5'!I7,'Stage 6'!I7,'Stage 7'!I7,'Stage 8'!I7,'Stage 9'!I7,'Stage 10'!I7,'Stage 11'!I7,'Stage 12'!I7)","v":0}]
[{"$f":"IF(AF17=\"Yes\",IF('Shooter Information'!$C$2=\"R\",(SUMPRODUCT(--(AD17>$AD$5:$AD$79),--(\"Yes\"=$AF$5:$AF$79))+1),(SUMPRODUCT(--(AC17>$AC$5:$AC$79),--(\"Yes\"=$AF$5:$AF$79))+1)),0)","v":12},{"$f":"'Shooter Information'!B20","v":"Deringer Dan"},{"$f":"'Shooter Information'!C20","v":49},{"$f":"IF(AF17=\"Yes\",IF('Shooter Information'!$C$2=\"R\",(SUMPRODUCT(--(C17=$C$5:$C$79),--(AD17>$AD$5:$AD$79),--(\"Yes\"=$AF$5:$AF$79))+1),(SUMPRODUCT(--(C17=$C$5:$C$79),--(AC17>$AC$5:$AC$79),--(\"Yes\"=$AF$5:$AF$79))+1)),0)","v":4},{"$f":"+'Stage 1'!K18","v":36.17},{"$f":"+'Stage 1'!L18","v":8},{"$f":"+'Stage 2'!K18","v":42.21},{"$f":"+'Stage 2'!L18","v":10},{"$f":"+'Stage 3'!K18","v":46.3},{"$f":"+'Stage 3'!L18","v":11},{"$f":"+'Stage 4'!K18","v":47.6},{"$f":"+'Stage 4'!L18","v":13},{"$f":"+'Stage 5'!K18","v":37.979999999999997},{"$f":"+'Stage 5'!L18","v":12},{"$f":"+'Stage 6'!K18","v":40.36},{"$f":"+'Stage 6'!L18","v":11},{"$f":"+'Stage 7'!K18","v":0},{"$f":"+'Stage 7'!L18","v":0},{"$f":"+'Stage 8'!K18","v":0},{"$f":"+'Stage 8'!L18","v":0},{"$f":"+'Stage 9'!K18","v":0},{"$f":"+'Stage 9'!L18","v":0},{"$f":"+'Stage 10'!K18","v":0},{"$f":"+'Stage 10'!L18","v":0},{"$f":"+'Stage 11'!K18","v":0},{"$f":"+'Stage 11'!L18","v":0},{"$f":"+'Stage 12'!K18","v":0},{"$f":"+'Stage 12'!L18","v":0},250.62,65,{"$f":"IF(ISBLANK('Shooter Information'!B20),,IF(SUM('Stage 1'!M18,'Stage 2'!M18,'Stage 3'!M18,'Stage 4'!M18,'Stage 5'!M18,'Stage 6'!M18,'Stage 7'!M18,'Stage 8'!M18,'Stage 9'!M18,'Stage 10'!M18,'Stage 11'!M18,'Stage 12'!M18)=0,\"Yes\",\"No\"))","v":"No"},{"$f":"IF(ISBLANK('Shooter Information'!B20),,IF(AK17>=2,\"No\",\"Yes\"))","v":"Yes"},250.62,65,{"$f":"IF(ISBLANK('Shooter Information'!C20),\"ZZZZZZZZZZ\",C17)","v":49},{"$f":"CELL(\"row\",'Shooter Information'!B20)","v":20},{"$f":"SUM('Stage 1'!I18,'Stage 2'!I18,'Stage 3'!I18,'Stage 4'!I18,'Stage 5'!I18,'Stage 6'!I18,'Stage 7'!I18,'Stage 8'!I18,'Stage 9'!I18,'Stage 10'!I18,'Stage 11'!I18,'Stage 12'!I18)","v":0}]
[{"$f":"IF(AF18=\"Yes\",IF('Shooter Information'!$C$2=\"R\",(SUMPRODUCT(--(AD18>$AD$5:$AD$79),--(\"Yes\"=$AF$5:$AF$79))+1),(SUMPRODUCT(--(AC18>$AC$5:$AC$79),--(\"Yes\"=$AF$5:$AF$79))+1)),0)","v":13},{"$f":"'Shooter Information'!B8","v":"Hotshod"},{"$f":"'Shooter Information'!C8","v":"W"},{"$f":"IF(AF18=\"Yes\",IF('Shooter Information'!$C$2=\"R\",(SUMPRODUCT(--(C18=$C$5:$C$79),--(AD18>$AD$5:$AD$79),--(\"Yes\"=$AF$5:$AF$79))+1),(SUMPRODUCT(--(C18=$C$5:$C$79),--(AC18>$AC$5:$AC$79),--(\"Yes\"=$AF$5:$AF$79))+1)),0)","v":1},{"$f":"+'Stage 1'!K6","v":51.22},{"$f":"+'Stage 1'!L6","v":13},{"$f":"+'Stage 2'!K6","v":34.56},{"$f":"+'Stage 2'!L6","v":6},{"$f":"+'Stage 3'!K6","v":49.11},{"$f":"+'Stage 3'!L6","v":13},{"$f":"+'Stage 4'!K6","v":36.33},{"$f":"+'Stage 4'!L6","v":8},{"$f":"+'Stage 5'!K6","v":38.75},{"$f":"+'Stage 5'!L6","v":14},{"$f":"+'Stage 6'!K6","v":57.83},{"$f":"+'Stage 6'!L6","v":14},{"$f":"+'Stage 7'!K6","v":0},{"$f":"+'Stage 7'!L6","v":0},{"$f":"+'Stage 8'!K6","v":0},{"$f":"+'Stage 8'!L6","v":0},{"$f":"+'Stage 9'!K6","v":0},{"$f":"+'Stage 9'!L6","v":0},{"$f":"+'Stage 10'!K6","v":0},{"$f":"+'Stage 10'!L6","v":0},{"$f":"+'Stage 11'!K6","v":0},{"$f":"+'Stage 11'!L6","v":0},{"$f":"+'Stage 12'!K6","v":0},{"$f":"+'Stage 12'!L6","v":0},267.79999999999995,68,{"$f":"IF(ISBLANK('Shooter Information'!B8),,IF(SUM('Stage 1'!M6,'Stage 2'!M6,'Stage 3'!M6,'Stage 4'!M6,'Stage 5'!M6,'Stage 6'!M6,'Stage 7'!M6,'Stage 8'!M6,'Stage 9'!M6,'Stage 10'!M6,'Stage 11'!M6,'Stage 12'!M6)=0,\"Yes\",\"No\"))","v":"No"},{"$f":"IF(ISBLANK('Shooter Information'!B8),,IF(AK18>=2,\"No\",\"Yes\"))","v":"Yes"},267.79999999999995,68,{"$f":"IF(ISBLANK('Shooter Information'!C8),\"ZZZZZZZZZZ\",C18)","v":"W"},{"$f":"CELL(\"row\",'Shooter Information'!B8)","v":8},{"$f":"SUM('Stage 1'!I6,'Stage 2'!I6,'Stage 3'!I6,'Stage 4'!I6,'Stage 5'!I6,'Stage 6'!I6,'Stage 7'!I6,'Stage 8'!I6,'Stage 9'!I6,'Stage 10'!I6,'Stage 11'!I6,'Stage 12'!I6)","v":0}]
[{"$f":"IF(AF19=\"Yes\",IF('Shooter Information'!$C$2=\"R\",(SUMPRODUCT(--(AD19>$AD$5:$AD$79),--(\"Yes\"=$AF$5:$AF$79))+1),(SUMPRODUCT(--(AC19>$AC$5:$AC$79),--(\"Yes\"=$AF$5:$AF$79))+1)),0)","v":14},{"$f":"'Shooter Information'!B15","v":"Slick Rick"},{"$f":"'Shooter Information'!C15","v":"S"},{"$f":"IF(AF19=\"Yes\",IF('Shooter Information'!$C$2=\"R\",(SUMPRODUCT(--(C19=$C$5:$C$79),--(AD19>$AD$5:$AD$79),--(\"Yes\"=$AF$5:$AF$79))+1),(SUMPRODUCT(--(C19=$C$5:$C$79),--(AC19>$AC$5:$AC$79),--(\"Yes\"=$AF$5:$AF$79))+1)),0)","v":2},{"$f":"+'Stage 1'!K13","v":128.15},{"$f":"+'Stage 1'!L13","v":15},{"$f":"+'Stage 2'!K13","v":95.26},{"$f":"+'Stage 2'!L13","v":14},{"$f":"+'Stage 3'!K13","v":97.7},{"$f":"+'Stage 3'!L13","v":14},{"$f":"+'Stage 4'!K13","v":79.87},{"$f":"+'Stage 4'!L13","v":15},{"$f":"+'Stage 5'!K13","v":72.33},{"$f":"+'Stage 5'!L13","v":15},{"$f":"+'Stage 6'!K13","v":76.87},{"$f":"+'Stage 6'!L13","v":15},{"$f":"+'Stage 7'!K13","v":0},{"$f":"+'Stage 7'!L13","v":0},{"$f":"+'Stage 8'!K13","v":0},{"$f":"+'Stage 8'!L13","v":0},{"$f":"+'Stage 9'!K13","v":0},{"$f":"+'Stage 9'!L13","v":0},{"$f":"+'Stage 10'!K13","v":0},{"$f":"+'Stage 10'!L13","v":0},{"$f":"+'Stage 11'!K13","v":0},{"$f":"+'Stage 11'!L13","v":0},{"$f":"+'Stage 12'!K13","v":0},{"$f":"+'Stage 12'!L13","v":0},550.18000000000006,88,{"$f":"IF(ISBLANK('Shooter Information'!B15),,IF(SUM('Stage 1'!M13,'Stage 2'!M13,'Stage 3'!M13,'Stage 4'!M13,'Stage 5'!M13,'Stage 6'!M13,'Stage 7'!M13,'Stage 8'!M13,'Stage 9'!M13,'Stage 10'!M13,'Stage 11'!M13,'Stage 12'!M13)=0,\"Yes\",\"No\"))","v":"No"},{"$f":"IF(ISBLANK('Shooter Information'!B15),,IF(AK19>=2,\"No\",\"Yes\"))","v":"Yes"},550.18000000000006,88,{"$f":"IF(ISBLANK('Shooter Information'!C15),\"ZZZZZZZZZZ\",C19)","v":"S"},{"$f":"CELL(\"row\",'Shooter Information'!B15)","v":15},{"$f":"SUM('Stage 1'!I13,'Stage 2'!I13,'Stage 3'!I13,'Stage 4'!I13,'Stage 5'!I13,'Stage 6'!I13,'Stage 7'!I13,'Stage 8'!I13,'Stage 9'!I13,'Stage 10'!I13,'Stage 11'!I13,'Stage 12'!I13)","v":0}]
[{"$f":"IF(AF20=\"Yes\",IF('Shooter Information'!$C$2=\"R\",(SUMPRODUCT(--(AD20>$AD$5:$AD$79),--(\"Yes\"=$AF$5:$AF$79))+1),(SUMPRODUCT(--(AC20>$AC$5:$AC$79),--(\"Yes\"=$AF$5:$AF$79))+1)),0)","v":0},{"$f":"'Shooter Information'!B21","v":0},{"$f":"'Shooter Information'!C21","v":0},{"$f":"IF(AF20=\"Yes\",IF('Shooter Information'!$C$2=\"R\",(SUMPRODUCT(--(C20=$C$5:$C$79),--(AD20>$AD$5:$AD$79),--(\"Yes\"=$AF$5:$AF$79))+1),(SUMPRODUCT(--(C20=$C$5:$C$79),--(AC20>$AC$5:$AC$79),--(\"Yes\"=$AF$5:$AF$79))+1)),0)","v":0},{"$f":"+'Stage 1'!K19","v":0},{"$f":"+'Stage 1'!L19","v":0},{"$f":"+'Stage 2'!K19","v":0},{"$f":"+'Stage 2'!L19","v":0},{"$f":"+'Stage 3'!K19","v":0},{"$f":"+'Stage 3'!L19","v":0},{"$f":"+'Stage 4'!K19","v":0},{"$f":"+'Stage 4'!L19","v":0},{"$f":"+'Stage 5'!K19","v":0},{"$f":"+'Stage 5'!L19","v":0},{"$f":"+'Stage 6'!K19","v":0},{"$f":"+'Stage 6'!L19","v":0},{"$f":"+'Stage 7'!K19","v":0},{"$f":"+'Stage 7'!L19","v":0},{"$f":"+'Stage 8'!K19","v":0},{"$f":"+'Stage 8'!L19","v":0},{"$f":"+'Stage 9'!K19","v":0},{"$f":"+'Stage 9'!L19","v":0},{"$f":"+'Stage 10'!K19","v":0},{"$f":"+'Stage 10'!L19","v":0},{"$f":"+'Stage 11'!K19","v":0},{"$f":"+'Stage 11'!L19","v":0},{"$f":"+'Stage 12'!K19","v":0},{"$f":"+'Stage 12'!L19","v":0},0,0,{"$f":"IF(ISBLANK('Shooter Information'!B21),,IF(SUM('Stage 1'!M19,'Stage 2'!M19,'Stage 3'!M19,'Stage 4'!M19,'Stage 5'!M19,'Stage 6'!M19,'Stage 7'!M19,'Stage 8'!M19,'Stage 9'!M19,'Stage 10'!M19,'Stage 11'!M19,'Stage 12'!M19)=0,\"Yes\",\"No\"))","v":0},{"$f":"IF(ISBLANK('Shooter Information'!B21),,IF(AK20>=2,\"No\",\"Yes\"))","v":0},99999,99999,{"$f":"IF(ISBLANK('Shooter Information'!C21),\"ZZZZZZZZZZ\",C20)","v":"ZZZZZZZZZZ"},{"$f":"CELL(\"row\",'Shooter Information'!B21)","v":21},{"$f":"SUM('Stage 1'!I19,'Stage 2'!I19,'Stage 3'!I19,'Stage 4'!I19,'Stage 5'!I19,'Stage 6'!I19,'Stage 7'!I19,'Stage 8'!I19,'Stage 9'!I19,'Stage 10'!I19,'Stage 11'!I19,'Stage 12'!I19)","v":0}]
[{"$f":"IF(AF21=\"Yes\",IF('Shooter Information'!$C$2=\"R\",(SUMPRODUCT(--(AD21>$AD$5:$AD$79),--(\"Yes\"=$AF$5:$AF$79))+1),(SUMPRODUCT(--(AC21>$AC$5:$AC$79),--(\"Yes\"=$AF$5:$AF$79))+1)),0)","v":0},{"$f":"'Shooter Information'!B22","v":0},{"$f":"'Shooter Information'!C22","v":0},{"$f":"IF(AF21=\"Yes\",IF('Shooter Information'!$C$2=\"R\",(SUMPRODUCT(--(C21=$C$5:$C$79),--(AD21>$AD$5:$AD$79),--(\"Yes\"=$AF$5:$AF$79))+1),(SUMPRODUCT(--(C21=$C$5:$C$79),--(AC21>$AC$5:$AC$79),--(\"Yes\"=$AF$5:$AF$79))+1)),0)","v":0},{"$f":"+'Stage 1'!K20","v":0},{"$f":"+'Stage 1'!L20","v":0},{"$f":"+'Stage 2'!K20","v":0},{"$f":"+'Stage 2'!L20","v":0},{"$f":"+'Stage 3'!K20","v":0},{"$f":"+'Stage 3'!L20","v":0},{"$f":"+'Stage 4'!K20","v":0},{"$f":"+'Stage 4'!L20","v":0},{"$f":"+'Stage 5'!K20","v":0},{"$f":"+'Stage 5'!L20","v":0},{"$f":"+'Stage 6'!K20","v":0},{"$f":"+'Stage 6'!L20","v":0},{"$f":"+'Stage 7'!K20","v":0},{"$f":"+'Stage 7'!L20","v":0},{"$f":"+'Stage 8'!K20","v":0},{"$f":"+'Stage 8'!L20","v":0},{"$f":"+'Stage 9'!K20","v":0},{"$f":"+'Stage 9'!L20","v":0},{"$f":"+'Stage 10'!K20","v":0},{"$f":"+'Stage 10'!L20","v":0},{"$f":"+'Stage 11'!K20","v":0},{"$f":"+'Stage 11'!L20","v":0},{"$f":"+'Stage 12'!K20","v":0},{"$f":"+'Stage 12'!L20","v":0},0,0,{"$f":"IF(ISBLANK('Shooter Information'!B22),,IF(SUM('Stage 1'!M20,'Stage 2'!M20,'Stage 3'!M20,'Stage 4'!M20,'Stage 5'!M20,'Stage 6'!M20,'Stage 7'!M20,'Stage 8'!M20,'Stage 9'!M20,'Stage 10'!M20,'Stage 11'!M20,'Stage 12'!M20)=0,\"Yes\",\"No\"))","v":0},{"$f":"IF(ISBLANK('Shooter Information'!B22),,IF(AK21>=2,\"No\",\"Yes\"))","v":0},99999,99999,{"$f":"IF(ISBLANK('Shooter Information'!C22),\"ZZZZZZZZZZ\",C21)","v":"ZZZZZZZZZZ"},{"$f":"CELL(\"row\",'Shooter Information'!B22)","v":22},{"$f":"SUM('Stage 1'!I20,'Stage 2'!I20,'Stage 3'!I20,'Stage 4'!I20,'Stage 5'!I20,'Stage 6'!I20,'Stage 7'!I20,'Stage 8'!I20,'Stage 9'!I20,'Stage 10'!I20,'Stage 11'!I20,'Stage 12'!I20)","v":0}]
[{"$f":"IF(AF22=\"Yes\",IF('Shooter Information'!$C$2=\"R\",(SUMPRODUCT(--(AD22>$AD$5:$AD$79),--(\"Yes\"=$AF$5:$AF$79))+1),(SUMPRODUCT(--(AC22>$AC$5:$AC$79),--(\"Yes\"=$AF$5:$AF$79))+1)),0)","v":0},{"$f":"'Shooter Information'!B23","v":0},{"$f":"'Shooter Information'!C23","v":0},{"$f":"IF(AF22=\"Yes\",IF('Shooter Information'!$C$2=\"R\",(SUMPRODUCT(--(C22=$C$5:$C$79),--(AD22>$AD$5:$AD$79),--(\"Yes\"=$AF$5:$AF$79))+1),(SUMPRODUCT(--(C22=$C$5:$C$79),--(AC22>$AC$5:$AC$79),--(\"Yes\"=$AF$5:$AF$79))+1)),0)","v":0},{"$f":"+'Stage 1'!K21","v":0},{"$f":"+'Stage 1'!L21","v":0},{"$f":"+'Stage 2'!K21","v":0},{"$f":"+'Stage 2'!L21","v":0},{"$f":"+'Stage 3'!K21","v":0},{"$f":"+'Stage 3'!L21","v":0},{"$f":"+'Stage 4'!K21","v":0},{"$f":"+'Stage 4'!L21","v":0},{"$f":"+'Stage 5'!K21","v":0},{"$f":"+'Stage 5'!L21","v":0},{"$f":"+'Stage 6'!K21","v":0},{"$f":"+'Stage 6'!L21","v":0},{"$f":"+'Stage 7'!K21","v":0},{"$f":"+'Stage 7'!L21","v":0},{"$f":"+'Stage 8'!K21","v":0},{"$f":"+'Stage 8'!L21","v":0},{"$f":"+'Stage 9'!K21","v":0},{"$f":"+'Stage 9'!L21","v":0},{"$f":"+'Stage 10'!K21","v":0},{"$f":"+'Stage 10'!L21","v":0},{"$f":"+'Stage 11'!K21","v":0},{"$f":"+'Stage 11'!L21","v":0},{"$f":"+'Stage 12'!K21","v":0},{"$f":"+'Stage 12'!L21","v":0},0,0,{"$f":"IF(ISBLANK('Shooter Information'!B23),,IF(SUM('Stage 1'!M21,'Stage 2'!M21,'Stage 3'!M21,'Stage 4'!M21,'Stage 5'!M21,'Stage 6'!M21,'Stage 7'!M21,'Stage 8'!M21,'Stage 9'!M21,'Stage 10'!M21,'Stage 11'!M21,'Stage 12'!M21)=0,\"Yes\",\"No\"))","v":0},{"$f":"IF(ISBLANK('Shooter Information'!B23),,IF(AK22>=2,\"No\",\"Yes\"))","v":0},99999,99999,{"$f":"IF(ISBLANK('Shooter Information'!C23),\"ZZZZZZZZZZ\",C22)","v":"ZZZZZZZZZZ"},{"$f":"CELL(\"row\",'Shooter Information'!B23)","v":23},{"$f":"SUM('Stage 1'!I21,'Stage 2'!I21,'Stage 3'!I21,'Stage 4'!I21,'Stage 5'!I21,'Stage 6'!I21,'Stage 7'!I21,'Stage 8'!I21,'Stage 9'!I21,'Stage 10'!I21,'Stage 11'!I21,'Stage 12'!I21)","v":0}]
[{"$f":"IF(AF23=\"Yes\",IF('Shooter Information'!$C$2=\"R\",(SUMPRODUCT(--(AD23>$AD$5:$AD$79),--(\"Yes\"=$AF$5:$AF$79))+1),(SUMPRODUCT(--(AC23>$AC$5:$AC$79),--(\"Yes\"=$AF$5:$AF$79))+1)),0)","v":0},{"$f":"'Shooter Information'!B24","v":0},{"$f":"'Shooter Information'!C24","v":0},{"$f":"IF(AF23=\"Yes\",IF('Shooter Information'!$C$2=\"R\",(SUMPRODUCT(--(C23=$C$5:$C$79),--(AD23>$AD$5:$AD$79),--(\"Yes\"=$AF$5:$AF$79))+1),(SUMPRODUCT(--(C23=$C$5:$C$79),--(AC23>$AC$5:$AC$79),--(\"Yes\"=$AF$5:$AF$79))+1)),0)","v":0},{"$f":"+'Stage 1'!K22","v":0},{"$f":"+'Stage 1'!L22","v":0},{"$f":"+'Stage 2'!K22","v":0},{"$f":"+'Stage 2'!L22","v":0},{"$f":"+'Stage 3'!K22","v":0},{"$f":"+'Stage 3'!L22","v":0},{"$f":"+'Stage 4'!K22","v":0},{"$f":"+'Stage 4'!L22","v":0},{"$f":"+'Stage 5'!K22","v":0},{"$f":"+'Stage 5'!L22","v":0},{"$f":"+'Stage 6'!K22","v":0},{"$f":"+'Stage 6'!L22","v":0},{"$f":"+'Stage 7'!K22","v":0},{"$f":"+'Stage 7'!L22","v":0},{"$f":"+'Stage 8'!K22","v":0},{"$f":"+'Stage 8'!L22","v":0},{"$f":"+'Stage 9'!K22","v":0},{"$f":"+'Stage 9'!L22","v":0},{"$f":"+'Stage 10'!K22","v":0},{"$f":"+'Stage 10'!L22","v":0},{"$f":"+'Stage 11'!K22","v":0},{"$f":"+'Stage 11'!L22","v":0},{"$f":"+'Stage 12'!K22","v":0},{"$f":"+'Stage 12'!L22","v":0},0,0,{"$f":"IF(ISBLANK('Shooter Information'!B24),,IF(SUM('Stage 1'!M22,'Stage 2'!M22,'Stage 3'!M22,'Stage 4'!M22,'Stage 5'!M22,'Stage 6'!M22,'Stage 7'!M22,'Stage 8'!M22,'Stage 9'!M22,'Stage 10'!M22,'Stage 11'!M22,'Stage 12'!M22)=0,\"Yes\",\"No\"))","v":0},{"$f":"IF(ISBLANK('Shooter Information'!B24),,IF(AK23>=2,\"No\",\"Yes\"))","v":0},99999,99999,{"$f":"IF(ISBLANK('Shooter Information'!C24),\"ZZZZZZZZZZ\",C23)","v":"ZZZZZZZZZZ"},{"$f":"CELL(\"row\",'Shooter Information'!B24)","v":24},{"$f":"SUM('Stage 1'!I22,'Stage 2'!I22,'Stage 3'!I22,'Stage 4'!I22,'Stage 5'!I22,'Stage 6'!I22,'Stage 7'!I22,'Stage 8'!I22,'Stage 9'!I22,'Stage 10'!I22,'Stage 11'!I22,'Stage 12'!I22)","v":0}]
[{"$f":"IF(AF24=\"Yes\",IF('Shooter Information'!$C$2=\"R\",(SUMPRODUCT(--(AD24>$AD$5:$AD$79),--(\"Yes\"=$AF$5:$AF$79))+1),(SUMPRODUCT(--(AC24>$AC$5:$AC$79),--(\"Yes\"=$AF$5:$AF$79))+1)),0)","v":0},{"$f":"'Shooter Information'!B25","v":0},{"$f":"'Shooter Information'!C25","v":0},{"$f":"IF(AF24=\"Yes\",IF('Shooter Information'!$C$2=\"R\",(SUMPRODUCT(--(C24=$C$5:$C$79),--(AD24>$AD$5:$AD$79),--(\"Yes\"=$AF$5:$AF$79))+1),(SUMPRODUCT(--(C24=$C$5:$C$79),--(AC24>$AC$5:$AC$79),--(\"Yes\"=$AF$5:$AF$79))+1)),0)","v":0},{"$f":"+'Stage 1'!K23","v":0},{"$f":"+'Stage 1'!L23","v":0},{"$f":"+'Stage 2'!K23","v":0},{"$f":"+'Stage 2'!L23","v":0},{"$f":"+'Stage 3'!K23","v":0},{"$f":"+'Stage 3'!L23","v":0},{"$f":"+'Stage 4'!K23","v":0},{"$f":"+'Stage 4'!L23","v":0},{"$f":"+'Stage 5'!K23","v":0},{"$f":"+'Stage 5'!L23","v":0},{"$f":"+'Stage 6'!K23","v":0},{"$f":"+'Stage 6'!L23","v":0},{"$f":"+'Stage 7'!K23","v":0},{"$f":"+'Stage 7'!L23","v":0},{"$f":"+'Stage 8'!K23","v":0},{"$f":"+'Stage 8'!L23","v":0},{"$f":"+'Stage 9'!K23","v":0},{"$f":"+'Stage 9'!L23","v":0},{"$f":"+'Stage 10'!K23","v":0},{"$f":"+'Stage 10'!L23","v":0},{"$f":"+'Stage 11'!K23","v":0},{"$f":"+'Stage 11'!L23","v":0},{"$f":"+'Stage 12'!K23","v":0},{"$f":"+'Stage 12'!L23","v":0},0,0,{"$f":"IF(ISBLANK('Shooter Information'!B25),,IF(SUM('Stage 1'!M23,'Stage 2'!M23,'Stage 3'!M23,'Stage 4'!M23,'Stage 5'!M23,'Stage 6'!M23,'Stage 7'!M23,'Stage 8'!M23,'Stage 9'!M23,'Stage 10'!M23,'Stage 11'!M23,'Stage 12'!M23)=0,\"Yes\",\"No\"))","v":0},{"$f":"IF(ISBLANK('Shooter Information'!B25),,IF(AK24>=2,\"No\",\"Yes\"))","v":0},99999,99999,{"$f":"IF(ISBLANK('Shooter Information'!C25),\"ZZZZZZZZZZ\",C24)","v":"ZZZZZZZZZZ"},{"$f":"CELL(\"row\",'Shooter Information'!B25)","v":25},{"$f":"SUM('Stage 1'!I23,'Stage 2'!I23,'Stage 3'!I23,'Stage 4'!I23,'Stage 5'!I23,'Stage 6'!I23,'Stage 7'!I23,'Stage 8'!I23,'Stage 9'!I23,'Stage 10'!I23,'Stage 11'!I23,'Stage 12'!I23)","v":0}]
[{"$f":"IF(AF25=\"Yes\",IF('Shooter Information'!$C$2=\"R\",(SUMPRODUCT(--(AD25>$AD$5:$AD$79),--(\"Yes\"=$AF$5:$AF$79))+1),(SUMPRODUCT(--(AC25>$AC$5:$AC$79),--(\"Yes\"=$AF$5:$AF$79))+1)),0)","v":0},{"$f":"'Shooter Information'!B26","v":0},{"$f":"'Shooter Information'!C26","v":0},{"$f":"IF(AF25=\"Yes\",IF('Shooter Information'!$C$2=\"R\",(SUMPRODUCT(--(C25=$C$5:$C$79),--(AD25>$AD$5:$AD$79),--(\"Yes\"=$AF$5:$AF$79))+1),(SUMPRODUCT(--(C25=$C$5:$C$79),--(AC25>$AC$5:$AC$79),--(\"Yes\"=$AF$5:$AF$79))+1)),0)","v":0},{"$f":"+'Stage 1'!K24","v":0},{"$f":"+'Stage 1'!L24","v":0},{"$f":"+'Stage 2'!K24","v":0},{"$f":"+'Stage 2'!L24","v":0},{"$f":"+'Stage 3'!K24","v":0},{"$f":"+'Stage 3'!L24","v":0},{"$f":"+'Stage 4'!K24","v":0},{"$f":"+'Stage 4'!L24","v":0},{"$f":"+'Stage 5'!K24","v":0},{"$f":"+'Stage 5'!L24","v":0},{"$f":"+'Stage 6'!K24","v":0},{"$f":"+'Stage 6'!L24","v":0},{"$f":"+'Stage 7'!K24","v":0},{"$f":"+'Stage 7'!L24","v":0},{"$f":"+'Stage 8'!K24","v":0},{"$f":"+'Stage 8'!L24","v":0},{"$f":"+'Stage 9'!K24","v":0},{"$f":"+'Stage 9'!L24","v":0},{"$f":"+'Stage 10'!K24","v":0},{"$f":"+'Stage 10'!L24","v":0},{"$f":"+'Stage 11'!K24","v":0},{"$f":"+'Stage 11'!L24","v":0},{"$f":"+'Stage 12'!K24","v":0},{"$f":"+'Stage 12'!L24","v":0},0,0,{"$f":"IF(ISBLANK('Shooter Information'!B26),,IF(SUM('Stage 1'!M24,'Stage 2'!M24,'Stage 3'!M24,'Stage 4'!M24,'Stage 5'!M24,'Stage 6'!M24,'Stage 7'!M24,'Stage 8'!M24,'Stage 9'!M24,'Stage 10'!M24,'Stage 11'!M24,'Stage 12'!M24)=0,\"Yes\",\"No\"))","v":0},{"$f":"IF(ISBLANK('Shooter Information'!B26),,IF(AK25>=2,\"No\",\"Yes\"))","v":0},99999,99999,{"$f":"IF(ISBLANK('Shooter Information'!C26),\"ZZZZZZZZZZ\",C25)","v":"ZZZZZZZZZZ"},{"$f":"CELL(\"row\",'Shooter Information'!B26)","v":26},{"$f":"SUM('Stage 1'!I24,'Stage 2'!I24,'Stage 3'!I24,'Stage 4'!I24,'Stage 5'!I24,'Stage 6'!I24,'Stage 7'!I24,'Stage 8'!I24,'Stage 9'!I24,'Stage 10'!I24,'Stage 11'!I24,'Stage 12'!I24)","v":0}]
[{"$f":"IF(AF26=\"Yes\",IF('Shooter Information'!$C$2=\"R\",(SUMPRODUCT(--(AD26>$AD$5:$AD$79),--(\"Yes\"=$AF$5:$AF$79))+1),(SUMPRODUCT(--(AC26>$AC$5:$AC$79),--(\"Yes\"=$AF$5:$AF$79))+1)),0)","v":0},{"$f":"'Shooter Information'!B27","v":0},{"$f":"'Shooter Information'!C27","v":0},{"$f":"IF(AF26=\"Yes\",IF('Shooter Information'!$C$2=\"R\",(SUMPRODUCT(--(C26=$C$5:$C$79),--(AD26>$AD$5:$AD$79),--(\"Yes\"=$AF$5:$AF$79))+1),(SUMPRODUCT(--(C26=$C$5:$C$79),--(AC26>$AC$5:$AC$79),--(\"Yes\"=$AF$5:$AF$79))+1)),0)","v":0},{"$f":"+'Stage 1'!K25","v":0},{"$f":"+'Stage 1'!L25","v":0},{"$f":"+'Stage 2'!K25","v":0},{"$f":"+'Stage 2'!L25","v":0},{"$f":"+'Stage 3'!K25","v":0},{"$f":"+'Stage 3'!L25","v":0},{"$f":"+'Stage 4'!K25","v":0},{"$f":"+'Stage 4'!L25","v":0},{"$f":"+'Stage 5'!K25","v":0},{"$f":"+'Stage 5'!L25","v":0},{"$f":"+'Stage 6'!K25","v":0},{"$f":"+'Stage 6'!L25","v":0},{"$f":"+'Stage 7'!K25","v":0},{"$f":"+'Stage 7'!L25","v":0},{"$f":"+'Stage 8'!K25","v":0},{"$f":"+'Stage 8'!L25","v":0},{"$f":"+'Stage 9'!K25","v":0},{"$f":"+'Stage 9'!L25","v":0},{"$f":"+'Stage 10'!K25","v":0},{"$f":"+'Stage 10'!L25","v":0},{"$f":"+'Stage 11'!K25","v":0},{"$f":"+'Stage 11'!L25","v":0},{"$f":"+'Stage 12'!K25","v":0},{"$f":"+'Stage 12'!L25","v":0},0,0,{"$f":"IF(ISBLANK('Shooter Information'!B27),,IF(SUM('Stage 1'!M25,'Stage 2'!M25,'Stage 3'!M25,'Stage 4'!M25,'Stage 5'!M25,'Stage 6'!M25,'Stage 7'!M25,'Stage 8'!M25,'Stage 9'!M25,'Stage 10'!M25,'Stage 11'!M25,'Stage 12'!M25)=0,\"Yes\",\"No\"))","v":0},{"$f":"IF(ISBLANK('Shooter Information'!B27),,IF(AK26>=2,\"No\",\"Yes\"))","v":0},99999,99999,{"$f":"IF(ISBLANK('Shooter Information'!C27),\"ZZZZZZZZZZ\",C26)","v":"ZZZZZZZZZZ"},{"$f":"CELL(\"row\",'Shooter Information'!B27)","v":27},{"$f":"SUM('Stage 1'!I25,'Stage 2'!I25,'Stage 3'!I25,'Stage 4'!I25,'Stage 5'!I25,'Stage 6'!I25,'Stage 7'!I25,'Stage 8'!I25,'Stage 9'!I25,'Stage 10'!I25,'Stage 11'!I25,'Stage 12'!I25)","v":0}]
[{"$f":"IF(AF27=\"Yes\",IF('Shooter Information'!$C$2=\"R\",(SUMPRODUCT(--(AD27>$AD$5:$AD$79),--(\"Yes\"=$AF$5:$AF$79))+1),(SUMPRODUCT(--(AC27>$AC$5:$AC$79),--(\"Yes\"=$AF$5:$AF$79))+1)),0)","v":0},{"$f":"'Shooter Information'!B28","v":0},{"$f":"'Shooter Information'!C28","v":0},{"$f":"IF(AF27=\"Yes\",IF('Shooter Information'!$C$2=\"R\",(SUMPRODUCT(--(C27=$C$5:$C$79),--(AD27>$AD$5:$AD$79),--(\"Yes\"=$AF$5:$AF$79))+1),(SUMPRODUCT(--(C27=$C$5:$C$79),--(AC27>$AC$5:$AC$79),--(\"Yes\"=$AF$5:$AF$79))+1)),0)","v":0},{"$f":"+'Stage 1'!K26","v":0},{"$f":"+'Stage 1'!L26","v":0},{"$f":"+'Stage 2'!K26","v":0},{"$f":"+'Stage 2'!L26","v":0},{"$f":"+'Stage 3'!K26","v":0},{"$f":"+'Stage 3'!L26","v":0},{"$f":"+'Stage 4'!K26","v":0},{"$f":"+'Stage 4'!L26","v":0},{"$f":"+'Stage 5'!K26","v":0},{"$f":"+'Stage 5'!L26","v":0},{"$f":"+'Stage 6'!K26","v":0},{"$f":"+'Stage 6'!L26","v":0},{"$f":"+'Stage 7'!K26","v":0},{"$f":"+'Stage 7'!L26","v":0},{"$f":"+'Stage 8'!K26","v":0},{"$f":"+'Stage 8'!L26","v":0},{"$f":"+'Stage 9'!K26","v":0},{"$f":"+'Stage 9'!L26","v":0},{"$f":"+'Stage 10'!K26","v":0},{"$f":"+'Stage 10'!L26","v":0},{"$f":"+'Stage 11'!K26","v":0},{"$f":"+'Stage 11'!L26","v":0},{"$f":"+'Stage 12'!K26","v":0},{"$f":"+'Stage 12'!L26","v":0},0,0,{"$f":"IF(ISBLANK('Shooter Information'!B28),,IF(SUM('Stage 1'!M26,'Stage 2'!M26,'Stage 3'!M26,'Stage 4'!M26,'Stage 5'!M26,'Stage 6'!M26,'Stage 7'!M26,'Stage 8'!M26,'Stage 9'!M26,'Stage 10'!M26,'Stage 11'!M26,'Stage 12'!M26)=0,\"Yes\",\"No\"))","v":0},{"$f":"IF(ISBLANK('Shooter Information'!B28),,IF(AK27>=2,\"No\",\"Yes\"))","v":0},99999,99999,{"$f":"IF(ISBLANK('Shooter Information'!C28),\"ZZZZZZZZZZ\",C27)","v":"ZZZZZZZZZZ"},{"$f":"CELL(\"row\",'Shooter Information'!B28)","v":28},{"$f":"SUM('Stage 1'!I26,'Stage 2'!I26,'Stage 3'!I26,'Stage 4'!I26,'Stage 5'!I26,'Stage 6'!I26,'Stage 7'!I26,'Stage 8'!I26,'Stage 9'!I26,'Stage 10'!I26,'Stage 11'!I26,'Stage 12'!I26)","v":0}]
[{"$f":"IF(AF28=\"Yes\",IF('Shooter Information'!$C$2=\"R\",(SUMPRODUCT(--(AD28>$AD$5:$AD$79),--(\"Yes\"=$AF$5:$AF$79))+1),(SUMPRODUCT(--(AC28>$AC$5:$AC$79),--(\"Yes\"=$AF$5:$AF$79))+1)),0)","v":0},{"$f":"'Shooter Information'!B29","v":0},{"$f":"'Shooter Information'!C29","v":0},{"$f":"IF(AF28=\"Yes\",IF('Shooter Information'!$C$2=\"R\",(SUMPRODUCT(--(C28=$C$5:$C$79),--(AD28>$AD$5:$AD$79),--(\"Yes\"=$AF$5:$AF$79))+1),(SUMPRODUCT(--(C28=$C$5:$C$79),--(AC28>$AC$5:$AC$79),--(\"Yes\"=$AF$5:$AF$79))+1)),0)","v":0},{"$f":"+'Stage 1'!K27","v":0},{"$f":"+'Stage 1'!L27","v":0},{"$f":"+'Stage 2'!K27","v":0},{"$f":"+'Stage 2'!L27","v":0},{"$f":"+'Stage 3'!K27","v":0},{"$f":"+'Stage 3'!L27","v":0},{"$f":"+'Stage 4'!K27","v":0},{"$f":"+'Stage 4'!L27","v":0},{"$f":"+'Stage 5'!K27","v":0},{"$f":"+'Stage 5'!L27","v":0},{"$f":"+'Stage 6'!K27","v":0},{"$f":"+'Stage 6'!L27","v":0},{"$f":"+'Stage 7'!K27","v":0},{"$f":"+'Stage 7'!L27","v":0},{"$f":"+'Stage 8'!K27","v":0},{"$f":"+'Stage 8'!L27","v":0},{"$f":"+'Stage 9'!K27","v":0},{"$f":"+'Stage 9'!L27","v":0},{"$f":"+'Stage 10'!K27","v":0},{"$f":"+'Stage 10'!L27","v":0},{"$f":"+'Stage 11'!K27","v":0},{"$f":"+'Stage 11'!L27","v":0},{"$f":"+'Stage 12'!K27","v":0},{"$f":"+'Stage 12'!L27","v":0},0,0,{"$f":"IF(ISBLANK('Shooter Information'!B29),,IF(SUM('Stage 1'!M27,'Stage 2'!M27,'Stage 3'!M27,'Stage 4'!M27,'Stage 5'!M27,'Stage 6'!M27,'Stage 7'!M27,'Stage 8'!M27,'Stage 9'!M27,'Stage 10'!M27,'Stage 11'!M27,'Stage 12'!M27)=0,\"Yes\",\"No\"))","v":0},{"$f":"IF(ISBLANK('Shooter Information'!B29),,IF(AK28>=2,\"No\",\"Yes\"))","v":0},99999,99999,{"$f":"IF(ISBLANK('Shooter Information'!C29),\"ZZZZZZZZZZ\",C28)","v":"ZZZZZZZZZZ"},{"$f":"CELL(\"row\",'Shooter Information'!B29)","v":29},{"$f":"SUM('Stage 1'!I27,'Stage 2'!I27,'Stage 3'!I27,'Stage 4'!I27,'Stage 5'!I27,'Stage 6'!I27,'Stage 7'!I27,'Stage 8'!I27,'Stage 9'!I27,'Stage 10'!I27,'Stage 11'!I27,'Stage 12'!I27)","v":0}]
[{"$f":"IF(AF29=\"Yes\",IF('Shooter Information'!$C$2=\"R\",(SUMPRODUCT(--(AD29>$AD$5:$AD$79),--(\"Yes\"=$AF$5:$AF$79))+1),(SUMPRODUCT(--(AC29>$AC$5:$AC$79),--(\"Yes\"=$AF$5:$AF$79))+1)),0)","v":0},{"$f":"'Shooter Information'!B30","v":0},{"$f":"'Shooter Information'!C30","v":0},{"$f":"IF(AF29=\"Yes\",IF('Shooter Information'!$C$2=\"R\",(SUMPRODUCT(--(C29=$C$5:$C$79),--(AD29>$AD$5:$AD$79),--(\"Yes\"=$AF$5:$AF$79))+1),(SUMPRODUCT(--(C29=$C$5:$C$79),--(AC29>$AC$5:$AC$79),--(\"Yes\"=$AF$5:$AF$79))+1)),0)","v":0},{"$f":"+'Stage 1'!K28","v":0},{"$f":"+'Stage 1'!L28","v":0},{"$f":"+'Stage 2'!K28","v":0},{"$f":"+'Stage 2'!L28","v":0},{"$f":"+'Stage 3'!K28","v":0},{"$f":"+'Stage 3'!L28","v":0},{"$f":"+'Stage 4'!K28","v":0},{"$f":"+'Stage 4'!L28","v":0},{"$f":"+'Stage 5'!K28","v":0},{"$f":"+'Stage 5'!L28","v":0},{"$f":"+'Stage 6'!K28","v":0},{"$f":"+'Stage 6'!L28","v":0},{"$f":"+'Stage 7'!K28","v":0},{"$f":"+'Stage 7'!L28","v":0},{"$f":"+'Stage 8'!K28","v":0},{"$f":"+'Stage 8'!L28","v":0},{"$f":"+'Stage 9'!K28","v":0},{"$f":"+'Stage 9'!L28","v":0},{"$f":"+'Stage 10'!K28","v":0},{"$f":"+'Stage 10'!L28","v":0},{"$f":"+'Stage 11'!K28","v":0},{"$f":"+'Stage 11'!L28","v":0},{"$f":"+'Stage 12'!K28","v":0},{"$f":"+'Stage 12'!L28","v":0},0,0,{"$f":"IF(ISBLANK('Shooter Information'!B30),,IF(SUM('Stage 1'!M28,'Stage 2'!M28,'Stage 3'!M28,'Stage 4'!M28,'Stage 5'!M28,'Stage 6'!M28,'Stage 7'!M28,'Stage 8'!M28,'Stage 9'!M28,'Stage 10'!M28,'Stage 11'!M28,'Stage 12'!M28)=0,\"Yes\",\"No\"))","v":0},{"$f":"IF(ISBLANK('Shooter Information'!B30),,IF(AK29>=2,\"No\",\"Yes\"))","v":0},99999,99999,{"$f":"IF(ISBLANK('Shooter Information'!C30),\"ZZZZZZZZZZ\",C29)","v":"ZZZZZZZZZZ"},{"$f":"CELL(\"row\",'Shooter Information'!B30)","v":30},{"$f":"SUM('Stage 1'!I28,'Stage 2'!I28,'Stage 3'!I28,'Stage 4'!I28,'Stage 5'!I28,'Stage 6'!I28,'Stage 7'!I28,'Stage 8'!I28,'Stage 9'!I28,'Stage 10'!I28,'Stage 11'!I28,'Stage 12'!I28)","v":0}]
[{"$f":"IF(AF30=\"Yes\",IF('Shooter Information'!$C$2=\"R\",(SUMPRODUCT(--(AD30>$AD$5:$AD$79),--(\"Yes\"=$AF$5:$AF$79))+1),(SUMPRODUCT(--(AC30>$AC$5:$AC$79),--(\"Yes\"=$AF$5:$AF$79))+1)),0)","v":0},{"$f":"'Shooter Information'!B31","v":0},{"$f":"'Shooter Information'!C31","v":0},{"$f":"IF(AF30=\"Yes\",IF('Shooter Information'!$C$2=\"R\",(SUMPRODUCT(--(C30=$C$5:$C$79),--(AD30>$AD$5:$AD$79),--(\"Yes\"=$AF$5:$AF$79))+1),(SUMPRODUCT(--(C30=$C$5:$C$79),--(AC30>$AC$5:$AC$79),--(\"Yes\"=$AF$5:$AF$79))+1)),0)","v":0},{"$f":"+'Stage 1'!K29","v":0},{"$f":"+'Stage 1'!L29","v":0},{"$f":"+'Stage 2'!K29","v":0},{"$f":"+'Stage 2'!L29","v":0},{"$f":"+'Stage 3'!K29","v":0},{"$f":"+'Stage 3'!L29","v":0},{"$f":"+'Stage 4'!K29","v":0},{"$f":"+'Stage 4'!L29","v":0},{"$f":"+'Stage 5'!K29","v":0},{"$f":"+'Stage 5'!L29","v":0},{"$f":"+'Stage 6'!K29","v":0},{"$f":"+'Stage 6'!L29","v":0},{"$f":"+'Stage 7'!K29","v":0},{"$f":"+'Stage 7'!L29","v":0},{"$f":"+'Stage 8'!K29","v":0},{"$f":"+'Stage 8'!L29","v":0},{"$f":"+'Stage 9'!K29","v":0},{"$f":"+'Stage 9'!L29","v":0},{"$f":"+'Stage 10'!K29","v":0},{"$f":"+'Stage 10'!L29","v":0},{"$f":"+'Stage 11'!K29","v":0},{"$f":"+'Stage 11'!L29","v":0},{"$f":"+'Stage 12'!K29","v":0},{"$f":"+'Stage 12'!L29","v":0},0,0,{"$f":"IF(ISBLANK('Shooter Information'!B31),,IF(SUM('Stage 1'!M29,'Stage 2'!M29,'Stage 3'!M29,'Stage 4'!M29,'Stage 5'!M29,'Stage 6'!M29,'Stage 7'!M29,'Stage 8'!M29,'Stage 9'!M29,'Stage 10'!M29,'Stage 11'!M29,'Stage 12'!M29)=0,\"Yes\",\"No\"))","v":0},{"$f":"IF(ISBLANK('Shooter Information'!B31),,IF(AK30>=2,\"No\",\"Yes\"))","v":0},99999,99999,{"$f":"IF(ISBLANK('Shooter Information'!C31),\"ZZZZZZZZZZ\",C30)","v":"ZZZZZZZZZZ"},{"$f":"CELL(\"row\",'Shooter Information'!B31)","v":31},{"$f":"SUM('Stage 1'!I29,'Stage 2'!I29,'Stage 3'!I29,'Stage 4'!I29,'Stage 5'!I29,'Stage 6'!I29,'Stage 7'!I29,'Stage 8'!I29,'Stage 9'!I29,'Stage 10'!I29,'Stage 11'!I29,'Stage 12'!I29)","v":0}]
[{"$f":"IF(AF31=\"Yes\",IF('Shooter Information'!$C$2=\"R\",(SUMPRODUCT(--(AD31>$AD$5:$AD$79),--(\"Yes\"=$AF$5:$AF$79))+1),(SUMPRODUCT(--(AC31>$AC$5:$AC$79),--(\"Yes\"=$AF$5:$AF$79))+1)),0)","v":0},{"$f":"'Shooter Information'!B32","v":0},{"$f":"'Shooter Information'!C32","v":0},{"$f":"IF(AF31=\"Yes\",IF('Shooter Information'!$C$2=\"R\",(SUMPRODUCT(--(C31=$C$5:$C$79),--(AD31>$AD$5:$AD$79),--(\"Yes\"=$AF$5:$AF$79))+1),(SUMPRODUCT(--(C31=$C$5:$C$79),--(AC31>$AC$5:$AC$79),--(\"Yes\"=$AF$5:$AF$79))+1)),0)","v":0},{"$f":"+'Stage 1'!K30","v":0},{"$f":"+'Stage 1'!L30","v":0},{"$f":"+'Stage 2'!K30","v":0},{"$f":"+'Stage 2'!L30","v":0},{"$f":"+'Stage 3'!K30","v":0},{"$f":"+'Stage 3'!L30","v":0},{"$f":"+'Stage 4'!K30","v":0},{"$f":"+'Stage 4'!L30","v":0},{"$f":"+'Stage 5'!K30","v":0},{"$f":"+'Stage 5'!L30","v":0},{"$f":"+'Stage 6'!K30","v":0},{"$f":"+'Stage 6'!L30","v":0},{"$f":"+'Stage 7'!K30","v":0},{"$f":"+'Stage 7'!L30","v":0},{"$f":"+'Stage 8'!K30","v":0},{"$f":"+'Stage 8'!L30","v":0},{"$f":"+'Stage 9'!K30","v":0},{"$f":"+'Stage 9'!L30","v":0},{"$f":"+'Stage 10'!K30","v":0},{"$f":"+'Stage 10'!L30","v":0},{"$f":"+'Stage 11'!K30","v":0},{"$f":"+'Stage 11'!L30","v":0},{"$f":"+'Stage 12'!K30","v":0},{"$f":"+'Stage 12'!L30","v":0},0,0,{"$f":"IF(ISBLANK('Shooter Information'!B32),,IF(SUM('Stage 1'!M30,'Stage 2'!M30,'Stage 3'!M30,'Stage 4'!M30,'Stage 5'!M30,'Stage 6'!M30,'Stage 7'!M30,'Stage 8'!M30,'Stage 9'!M30,'Stage 10'!M30,'Stage 11'!M30,'Stage 12'!M30)=0,\"Yes\",\"No\"))","v":0},{"$f":"IF(ISBLANK('Shooter Information'!B32),,IF(AK31>=2,\"No\",\"Yes\"))","v":0},99999,99999,{"$f":"IF(ISBLANK('Shooter Information'!C32),\"ZZZZZZZZZZ\",C31)","v":"ZZZZZZZZZZ"},{"$f":"CELL(\"row\",'Shooter Information'!B32)","v":32},{"$f":"SUM('Stage 1'!I30,'Stage 2'!I30,'Stage 3'!I30,'Stage 4'!I30,'Stage 5'!I30,'Stage 6'!I30,'Stage 7'!I30,'Stage 8'!I30,'Stage 9'!I30,'Stage 10'!I30,'Stage 11'!I30,'Stage 12'!I30)","v":0}]
[{"$f":"IF(AF32=\"Yes\",IF('Shooter Information'!$C$2=\"R\",(SUMPRODUCT(--(AD32>$AD$5:$AD$79),--(\"Yes\"=$AF$5:$AF$79))+1),(SUMPRODUCT(--(AC32>$AC$5:$AC$79),--(\"Yes\"=$AF$5:$AF$79))+1)),0)","v":0},{"$f":"'Shooter Information'!B33","v":0},{"$f":"'Shooter Information'!C33","v":0},{"$f":"IF(AF32=\"Yes\",IF('Shooter Information'!$C$2=\"R\",(SUMPRODUCT(--(C32=$C$5:$C$79),--(AD32>$AD$5:$AD$79),--(\"Yes\"=$AF$5:$AF$79))+1),(SUMPRODUCT(--(C32=$C$5:$C$79),--(AC32>$AC$5:$AC$79),--(\"Yes\"=$AF$5:$AF$79))+1)),0)","v":0},{"$f":"+'Stage 1'!K31","v":0},{"$f":"+'Stage 1'!L31","v":0},{"$f":"+'Stage 2'!K31","v":0},{"$f":"+'Stage 2'!L31","v":0},{"$f":"+'Stage 3'!K31","v":0},{"$f":"+'Stage 3'!L31","v":0},{"$f":"+'Stage 4'!K31","v":0},{"$f":"+'Stage 4'!L31","v":0},{"$f":"+'Stage 5'!K31","v":0},{"$f":"+'Stage 5'!L31","v":0},{"$f":"+'Stage 6'!K31","v":0},{"$f":"+'Stage 6'!L31","v":0},{"$f":"+'Stage 7'!K31","v":0},{"$f":"+'Stage 7'!L31","v":0},{"$f":"+'Stage 8'!K31","v":0},{"$f":"+'Stage 8'!L31","v":0},{"$f":"+'Stage 9'!K31","v":0},{"$f":"+'Stage 9'!L31","v":0},{"$f":"+'Stage 10'!K31","v":0},{"$f":"+'Stage 10'!L31","v":0},{"$f":"+'Stage 11'!K31","v":0},{"$f":"+'Stage 11'!L31","v":0},{"$f":"+'Stage 12'!K31","v":0},{"$f":"+'Stage 12'!L31","v":0},0,0,{"$f":"IF(ISBLANK('Shooter Information'!B33),,IF(SUM('Stage 1'!M31,'Stage 2'!M31,'Stage 3'!M31,'Stage 4'!M31,'Stage 5'!M31,'Stage 6'!M31,'Stage 7'!M31,'Stage 8'!M31,'Stage 9'!M31,'Stage 10'!M31,'Stage 11'!M31,'Stage 12'!M31)=0,\"Yes\",\"No\"))","v":0},{"$f":"IF(ISBLANK('Shooter Information'!B33),,IF(AK32>=2,\"No\",\"Yes\"))","v":0},99999,99999,{"$f":"IF(ISBLANK('Shooter Information'!C33),\"ZZZZZZZZZZ\",C32)","v":"ZZZZZZZZZZ"},{"$f":"CELL(\"row\",'Shooter Information'!B33)","v":33},{"$f":"SUM('Stage 1'!I31,'Stage 2'!I31,'Stage 3'!I31,'Stage 4'!I31,'Stage 5'!I31,'Stage 6'!I31,'Stage 7'!I31,'Stage 8'!I31,'Stage 9'!I31,'Stage 10'!I31,'Stage 11'!I31,'Stage 12'!I31)","v":0}]
[{"$f":"IF(AF33=\"Yes\",IF('Shooter Information'!$C$2=\"R\",(SUMPRODUCT(--(AD33>$AD$5:$AD$79),--(\"Yes\"=$AF$5:$AF$79))+1),(SUMPRODUCT(--(AC33>$AC$5:$AC$79),--(\"Yes\"=$AF$5:$AF$79))+1)),0)","v":0},{"$f":"'Shooter Information'!B34","v":0},{"$f":"'Shooter Information'!C34","v":0},{"$f":"IF(AF33=\"Yes\",IF('Shooter Information'!$C$2=\"R\",(SUMPRODUCT(--(C33=$C$5:$C$79),--(AD33>$AD$5:$AD$79),--(\"Yes\"=$AF$5:$AF$79))+1),(SUMPRODUCT(--(C33=$C$5:$C$79),--(AC33>$AC$5:$AC$79),--(\"Yes\"=$AF$5:$AF$79))+1)),0)","v":0},{"$f":"+'Stage 1'!K32","v":0},{"$f":"+'Stage 1'!L32","v":0},{"$f":"+'Stage 2'!K32","v":0},{"$f":"+'Stage 2'!L32","v":0},{"$f":"+'Stage 3'!K32","v":0},{"$f":"+'Stage 3'!L32","v":0},{"$f":"+'Stage 4'!K32","v":0},{"$f":"+'Stage 4'!L32","v":0},{"$f":"+'Stage 5'!K32","v":0},{"$f":"+'Stage 5'!L32","v":0},{"$f":"+'Stage 6'!K32","v":0},{"$f":"+'Stage 6'!L32","v":0},{"$f":"+'Stage 7'!K32","v":0},{"$f":"+'Stage 7'!L32","v":0},{"$f":"+'Stage 8'!K32","v":0},{"$f":"+'Stage 8'!L32","v":0},{"$f":"+'Stage 9'!K32","v":0},{"$f":"+'Stage 9'!L32","v":0},{"$f":"+'Stage 10'!K32","v":0},{"$f":"+'Stage 10'!L32","v":0},{"$f":"+'Stage 11'!K32","v":0},{"$f":"+'Stage 11'!L32","v":0},{"$f":"+'Stage 12'!K32","v":0},{"$f":"+'Stage 12'!L32","v":0},0,0,{"$f":"IF(ISBLANK('Shooter Information'!B34),,IF(SUM('Stage 1'!M32,'Stage 2'!M32,'Stage 3'!M32,'Stage 4'!M32,'Stage 5'!M32,'Stage 6'!M32,'Stage 7'!M32,'Stage 8'!M32,'Stage 9'!M32,'Stage 10'!M32,'Stage 11'!M32,'Stage 12'!M32)=0,\"Yes\",\"No\"))","v":0},{"$f":"IF(ISBLANK('Shooter Information'!B34),,IF(AK33>=2,\"No\",\"Yes\"))","v":0},99999,99999,{"$f":"IF(ISBLANK('Shooter Information'!C34),\"ZZZZZZZZZZ\",C33)","v":"ZZZZZZZZZZ"},{"$f":"CELL(\"row\",'Shooter Information'!B34)","v":34},{"$f":"SUM('Stage 1'!I32,'Stage 2'!I32,'Stage 3'!I32,'Stage 4'!I32,'Stage 5'!I32,'Stage 6'!I32,'Stage 7'!I32,'Stage 8'!I32,'Stage 9'!I32,'Stage 10'!I32,'Stage 11'!I32,'Stage 12'!I32)","v":0}]
[{"$f":"IF(AF34=\"Yes\",IF('Shooter Information'!$C$2=\"R\",(SUMPRODUCT(--(AD34>$AD$5:$AD$79),--(\"Yes\"=$AF$5:$AF$79))+1),(SUMPRODUCT(--(AC34>$AC$5:$AC$79),--(\"Yes\"=$AF$5:$AF$79))+1)),0)","v":0},{"$f":"'Shooter Information'!B35","v":0},{"$f":"'Shooter Information'!C35","v":0},{"$f":"IF(AF34=\"Yes\",IF('Shooter Information'!$C$2=\"R\",(SUMPRODUCT(--(C34=$C$5:$C$79),--(AD34>$AD$5:$AD$79),--(\"Yes\"=$AF$5:$AF$79))+1),(SUMPRODUCT(--(C34=$C$5:$C$79),--(AC34>$AC$5:$AC$79),--(\"Yes\"=$AF$5:$AF$79))+1)),0)","v":0},{"$f":"+'Stage 1'!K33","v":0},{"$f":"+'Stage 1'!L33","v":0},{"$f":"+'Stage 2'!K33","v":0},{"$f":"+'Stage 2'!L33","v":0},{"$f":"+'Stage 3'!K33","v":0},{"$f":"+'Stage 3'!L33","v":0},{"$f":"+'Stage 4'!K33","v":0},{"$f":"+'Stage 4'!L33","v":0},{"$f":"+'Stage 5'!K33","v":0},{"$f":"+'Stage 5'!L33","v":0},{"$f":"+'Stage 6'!K33","v":0},{"$f":"+'Stage 6'!L33","v":0},{"$f":"+'Stage 7'!K33","v":0},{"$f":"+'Stage 7'!L33","v":0},{"$f":"+'Stage 8'!K33","v":0},{"$f":"+'Stage 8'!L33","v":0},{"$f":"+'Stage 9'!K33","v":0},{"$f":"+'Stage 9'!L33","v":0},{"$f":"+'Stage 10'!K33","v":0},{"$f":"+'Stage 10'!L33","v":0},{"$f":"+'Stage 11'!K33","v":0},{"$f":"+'Stage 11'!L33","v":0},{"$f":"+'Stage 12'!K33","v":0},{"$f":"+'Stage 12'!L33","v":0},0,0,{"$f":"IF(ISBLANK('Shooter Information'!B35),,IF(SUM('Stage 1'!M33,'Stage 2'!M33,'Stage 3'!M33,'Stage 4'!M33,'Stage 5'!M33,'Stage 6'!M33,'Stage 7'!M33,'Stage 8'!M33,'Stage 9'!M33,'Stage 10'!M33,'Stage 11'!M33,'Stage 12'!M33)=0,\"Yes\",\"No\"))","v":0},{"$f":"IF(ISBLANK('Shooter Information'!B35),,IF(AK34>=2,\"No\",\"Yes\"))","v":0},99999,99999,{"$f":"IF(ISBLANK('Shooter Information'!C35),\"ZZZZZZZZZZ\",C34)","v":"ZZZZZZZZZZ"},{"$f":"CELL(\"row\",'Shooter Information'!B35)","v":35},{"$f":"SUM('Stage 1'!I33,'Stage 2'!I33,'Stage 3'!I33,'Stage 4'!I33,'Stage 5'!I33,'Stage 6'!I33,'Stage 7'!I33,'Stage 8'!I33,'Stage 9'!I33,'Stage 10'!I33,'Stage 11'!I33,'Stage 12'!I33)","v":0}]
[{"$f":"IF(AF35=\"Yes\",IF('Shooter Information'!$C$2=\"R\",(SUMPRODUCT(--(AD35>$AD$5:$AD$79),--(\"Yes\"=$AF$5:$AF$79))+1),(SUMPRODUCT(--(AC35>$AC$5:$AC$79),--(\"Yes\"=$AF$5:$AF$79))+1)),0)","v":0},{"$f":"'Shooter Information'!B36","v":0},{"$f":"'Shooter Information'!C36","v":0},{"$f":"IF(AF35=\"Yes\",IF('Shooter Information'!$C$2=\"R\",(SUMPRODUCT(--(C35=$C$5:$C$79),--(AD35>$AD$5:$AD$79),--(\"Yes\"=$AF$5:$AF$79))+1),(SUMPRODUCT(--(C35=$C$5:$C$79),--(AC35>$AC$5:$AC$79),--(\"Yes\"=$AF$5:$AF$79))+1)),0)","v":0},{"$f":"+'Stage 1'!K34","v":0},{"$f":"+'Stage 1'!L34","v":0},{"$f":"+'Stage 2'!K34","v":0},{"$f":"+'Stage 2'!L34","v":0},{"$f":"+'Stage 3'!K34","v":0},{"$f":"+'Stage 3'!L34","v":0},{"$f":"+'Stage 4'!K34","v":0},{"$f":"+'Stage 4'!L34","v":0},{"$f":"+'Stage 5'!K34","v":0},{"$f":"+'Stage 5'!L34","v":0},{"$f":"+'Stage 6'!K34","v":0},{"$f":"+'Stage 6'!L34","v":0},{"$f":"+'Stage 7'!K34","v":0},{"$f":"+'Stage 7'!L34","v":0},{"$f":"+'Stage 8'!K34","v":0},{"$f":"+'Stage 8'!L34","v":0},{"$f":"+'Stage 9'!K34","v":0},{"$f":"+'Stage 9'!L34","v":0},{"$f":"+'Stage 10'!K34","v":0},{"$f":"+'Stage 10'!L34","v":0},{"$f":"+'Stage 11'!K34","v":0},{"$f":"+'Stage 11'!L34","v":0},{"$f":"+'Stage 12'!K34","v":0},{"$f":"+'Stage 12'!L34","v":0},0,0,{"$f":"IF(ISBLANK('Shooter Information'!B36),,IF(SUM('Stage 1'!M34,'Stage 2'!M34,'Stage 3'!M34,'Stage 4'!M34,'Stage 5'!M34,'Stage 6'!M34,'Stage 7'!M34,'Stage 8'!M34,'Stage 9'!M34,'Stage 10'!M34,'Stage 11'!M34,'Stage 12'!M34)=0,\"Yes\",\"No\"))","v":0},{"$f":"IF(ISBLANK('Shooter Information'!B36),,IF(AK35>=2,\"No\",\"Yes\"))","v":0},99999,99999,{"$f":"IF(ISBLANK('Shooter Information'!C36),\"ZZZZZZZZZZ\",C35)","v":"ZZZZZZZZZZ"},{"$f":"CELL(\"row\",'Shooter Information'!B36)","v":36},{"$f":"SUM('Stage 1'!I34,'Stage 2'!I34,'Stage 3'!I34,'Stage 4'!I34,'Stage 5'!I34,'Stage 6'!I34,'Stage 7'!I34,'Stage 8'!I34,'Stage 9'!I34,'Stage 10'!I34,'Stage 11'!I34,'Stage 12'!I34)","v":0}]
[{"$f":"IF(AF36=\"Yes\",IF('Shooter Information'!$C$2=\"R\",(SUMPRODUCT(--(AD36>$AD$5:$AD$79),--(\"Yes\"=$AF$5:$AF$79))+1),(SUMPRODUCT(--(AC36>$AC$5:$AC$79),--(\"Yes\"=$AF$5:$AF$79))+1)),0)","v":0},{"$f":"'Shooter Information'!B37","v":0},{"$f":"'Shooter Information'!C37","v":0},{"$f":"IF(AF36=\"Yes\",IF('Shooter Information'!$C$2=\"R\",(SUMPRODUCT(--(C36=$C$5:$C$79),--(AD36>$AD$5:$AD$79),--(\"Yes\"=$AF$5:$AF$79))+1),(SUMPRODUCT(--(C36=$C$5:$C$79),--(AC36>$AC$5:$AC$79),--(\"Yes\"=$AF$5:$AF$79))+1)),0)","v":0},{"$f":"+'Stage 1'!K35","v":0},{"$f":"+'Stage 1'!L35","v":0},{"$f":"+'Stage 2'!K35","v":0},{"$f":"+'Stage 2'!L35","v":0},{"$f":"+'Stage 3'!K35","v":0},{"$f":"+'Stage 3'!L35","v":0},{"$f":"+'Stage 4'!K35","v":0},{"$f":"+'Stage 4'!L35","v":0},{"$f":"+'Stage 5'!K35","v":0},{"$f":"+'Stage 5'!L35","v":0},{"$f":"+'Stage 6'!K35","v":0},{"$f":"+'Stage 6'!L35","v":0},{"$f":"+'Stage 7'!K35","v":0},{"$f":"+'Stage 7'!L35","v":0},{"$f":"+'Stage 8'!K35","v":0},{"$f":"+'Stage 8'!L35","v":0},{"$f":"+'Stage 9'!K35","v":0},{"$f":"+'Stage 9'!L35","v":0},{"$f":"+'Stage 10'!K35","v":0},{"$f":"+'Stage 10'!L35","v":0},{"$f":"+'Stage 11'!K35","v":0},{"$f":"+'Stage 11'!L35","v":0},{"$f":"+'Stage 12'!K35","v":0},{"$f":"+'Stage 12'!L35","v":0},0,0,{"$f":"IF(ISBLANK('Shooter Information'!B37),,IF(SUM('Stage 1'!M35,'Stage 2'!M35,'Stage 3'!M35,'Stage 4'!M35,'Stage 5'!M35,'Stage 6'!M35,'Stage 7'!M35,'Stage 8'!M35,'Stage 9'!M35,'Stage 10'!M35,'Stage 11'!M35,'Stage 12'!M35)=0,\"Yes\",\"No\"))","v":0},{"$f":"IF(ISBLANK('Shooter Information'!B37),,IF(AK36>=2,\"No\",\"Yes\"))","v":0},99999,99999,{"$f":"IF(ISBLANK('Shooter Information'!C37),\"ZZZZZZZZZZ\",C36)","v":"ZZZZZZZZZZ"},{"$f":"CELL(\"row\",'Shooter Information'!B37)","v":37},{"$f":"SUM('Stage 1'!I35,'Stage 2'!I35,'Stage 3'!I35,'Stage 4'!I35,'Stage 5'!I35,'Stage 6'!I35,'Stage 7'!I35,'Stage 8'!I35,'Stage 9'!I35,'Stage 10'!I35,'Stage 11'!I35,'Stage 12'!I35)","v":0}]
[{"$f":"IF(AF37=\"Yes\",IF('Shooter Information'!$C$2=\"R\",(SUMPRODUCT(--(AD37>$AD$5:$AD$79),--(\"Yes\"=$AF$5:$AF$79))+1),(SUMPRODUCT(--(AC37>$AC$5:$AC$79),--(\"Yes\"=$AF$5:$AF$79))+1)),0)","v":0},{"$f":"'Shooter Information'!B38","v":0},{"$f":"'Shooter Information'!C38","v":0},{"$f":"IF(AF37=\"Yes\",IF('Shooter Information'!$C$2=\"R\",(SUMPRODUCT(--(C37=$C$5:$C$79),--(AD37>$AD$5:$AD$79),--(\"Yes\"=$AF$5:$AF$79))+1),(SUMPRODUCT(--(C37=$C$5:$C$79),--(AC37>$AC$5:$AC$79),--(\"Yes\"=$AF$5:$AF$79))+1)),0)","v":0},{"$f":"+'Stage 1'!K36","v":0},{"$f":"+'Stage 1'!L36","v":0},{"$f":"+'Stage 2'!K36","v":0},{"$f":"+'Stage 2'!L36","v":0},{"$f":"+'Stage 3'!K36","v":0},{"$f":"+'Stage 3'!L36","v":0},{"$f":"+'Stage 4'!K36","v":0},{"$f":"+'Stage 4'!L36","v":0},{"$f":"+'Stage 5'!K36","v":0},{"$f":"+'Stage 5'!L36","v":0},{"$f":"+'Stage 6'!K36","v":0},{"$f":"+'Stage 6'!L36","v":0},{"$f":"+'Stage 7'!K36","v":0},{"$f":"+'Stage 7'!L36","v":0},{"$f":"+'Stage 8'!K36","v":0},{"$f":"+'Stage 8'!L36","v":0},{"$f":"+'Stage 9'!K36","v":0},{"$f":"+'Stage 9'!L36","v":0},{"$f":"+'Stage 10'!K36","v":0},{"$f":"+'Stage 10'!L36","v":0},{"$f":"+'Stage 11'!K36","v":0},{"$f":"+'Stage 11'!L36","v":0},{"$f":"+'Stage 12'!K36","v":0},{"$f":"+'Stage 12'!L36","v":0},{"$f":"+E37+G37+I37+K37+M37+O37+Q37+S37+U37+W37+Y37+AA37","v":0},{"$f":"+F37+H37+J37+L37+N37+P37+R37+T37+V37+X37+Z37+AB37","v":0},{"$f":"IF(ISBLANK('Shooter Information'!B38),,IF(SUM('Stage 1'!M36,'Stage 2'!M36,'Stage 3'!M36,'Stage 4'!M36,'Stage 5'!M36,'Stage 6'!M36,'Stage 7'!M36,'Stage 8'!M36,'Stage 9'!M36,'Stage 10'!M36,'Stage 11'!M36,'Stage 12'!M36)=0,\"Yes\",\"No\"))","v":0},{"$f":"IF(ISBLANK('Shooter Information'!B38),,IF(AK37>=2,\"No\",\"Yes\"))","v":0},{"$f":"IF(AC37=0,99999,AC37)","v":99999},{"$f":"IF(AD37=0,99999,AD37)","v":99999},{"$f":"IF(ISBLANK('Shooter Information'!C38),\"ZZZZZZZZZZ\",C37)","v":"ZZZZZZZZZZ"},{"$f":"CELL(\"row\",'Shooter Information'!B38)","v":38},{"$f":"SUM('Stage 1'!I36,'Stage 2'!I36,'Stage 3'!I36,'Stage 4'!I36,'Stage 5'!I36,'Stage 6'!I36,'Stage 7'!I36,'Stage 8'!I36,'Stage 9'!I36,'Stage 10'!I36,'Stage 11'!I36,'Stage 12'!I36)","v":0}]
[{"$f":"IF(AF38=\"Yes\",IF('Shooter Information'!$C$2=\"R\",(SUMPRODUCT(--(AD38>$AD$5:$AD$79),--(\"Yes\"=$AF$5:$AF$79))+1),(SUMPRODUCT(--(AC38>$AC$5:$AC$79),--(\"Yes\"=$AF$5:$AF$79))+1)),0)","v":0},{"$f":"'Shooter Information'!B39","v":0},{"$f":"'Shooter Information'!C39","v":0},{"$f":"IF(AF38=\"Yes\",IF('Shooter Information'!$C$2=\"R\",(SUMPRODUCT(--(C38=$C$5:$C$79),--(AD38>$AD$5:$AD$79),--(\"Yes\"=$AF$5:$AF$79))+1),(SUMPRODUCT(--(C38=$C$5:$C$79),--(AC38>$AC$5:$AC$79),--(\"Yes\"=$AF$5:$AF$79))+1)),0)","v":0},{"$f":"+'Stage 1'!K37","v":0},{"$f":"+'Stage 1'!L37","v":0},{"$f":"+'Stage 2'!K37","v":0},{"$f":"+'Stage 2'!L37","v":0},{"$f":"+'Stage 3'!K37","v":0},{"$f":"+'Stage 3'!L37","v":0},{"$f":"+'Stage 4'!K37","v":0},{"$f":"+'Stage 4'!L37","v":0},{"$f":"+'Stage 5'!K37","v":0},{"$f":"+'Stage 5'!L37","v":0},{"$f":"+'Stage 6'!K37","v":0},{"$f":"+'Stage 6'!L37","v":0},{"$f":"+'Stage 7'!K37","v":0},{"$f":"+'Stage 7'!L37","v":0},{"$f":"+'Stage 8'!K37","v":0},{"$f":"+'Stage 8'!L37","v":0},{"$f":"+'Stage 9'!K37","v":0},{"$f":"+'Stage 9'!L37","v":0},{"$f":"+'Stage 10'!K37","v":0},{"$f":"+'Stage 10'!L37","v":0},{"$f":"+'Stage 11'!K37","v":0},{"$f":"+'Stage 11'!L37","v":0},{"$f":"+'Stage 12'!K37","v":0},{"$f":"+'Stage 12'!L37","v":0},0,0,{"$f":"IF(ISBLANK('Shooter Information'!B39),,IF(SUM('Stage 1'!M37,'Stage 2'!M37,'Stage 3'!M37,'Stage 4'!M37,'Stage 5'!M37,'Stage 6'!M37,'Stage 7'!M37,'Stage 8'!M37,'Stage 9'!M37,'Stage 10'!M37,'Stage 11'!M37,'Stage 12'!M37)=0,\"Yes\",\"No\"))","v":0},{"$f":"IF(ISBLANK('Shooter Information'!B39),,IF(AK38>=2,\"No\",\"Yes\"))","v":0},99999,99999,{"$f":"IF(ISBLANK('Shooter Information'!C39),\"ZZZZZZZZZZ\",C38)","v":"ZZZZZZZZZZ"},{"$f":"CELL(\"row\",'Shooter Information'!B39)","v":39},{"$f":"SUM('Stage 1'!I37,'Stage 2'!I37,'Stage 3'!I37,'Stage 4'!I37,'Stage 5'!I37,'Stage 6'!I37,'Stage 7'!I37,'Stage 8'!I37,'Stage 9'!I37,'Stage 10'!I37,'Stage 11'!I37,'Stage 12'!I37)","v":0}]
[{"$f":"IF(AF39=\"Yes\",IF('Shooter Information'!$C$2=\"R\",(SUMPRODUCT(--(AD39>$AD$5:$AD$79),--(\"Yes\"=$AF$5:$AF$79))+1),(SUMPRODUCT(--(AC39>$AC$5:$AC$79),--(\"Yes\"=$AF$5:$AF$79))+1)),0)","v":0},{"$f":"'Shooter Information'!B40","v":0},{"$f":"'Shooter Information'!C40","v":0},{"$f":"IF(AF39=\"Yes\",IF('Shooter Information'!$C$2=\"R\",(SUMPRODUCT(--(C39=$C$5:$C$79),--(AD39>$AD$5:$AD$79),--(\"Yes\"=$AF$5:$AF$79))+1),(SUMPRODUCT(--(C39=$C$5:$C$79),--(AC39>$AC$5:$AC$79),--(\"Yes\"=$AF$5:$AF$79))+1)),0)","v":0},{"$f":"+'Stage 1'!K38","v":0},{"$f":"+'Stage 1'!L38","v":0},{"$f":"+'Stage 2'!K38","v":0},{"$f":"+'Stage 2'!L38","v":0},{"$f":"+'Stage 3'!K38","v":0},{"$f":"+'Stage 3'!L38","v":0},{"$f":"+'Stage 4'!K38","v":0},{"$f":"+'Stage 4'!L38","v":0},{"$f":"+'Stage 5'!K38","v":0},{"$f":"+'Stage 5'!L38","v":0},{"$f":"+'Stage 6'!K38","v":0},{"$f":"+'Stage 6'!L38","v":0},{"$f":"+'Stage 7'!K38","v":0},{"$f":"+'Stage 7'!L38","v":0},{"$f":"+'Stage 8'!K38","v":0},{"$f":"+'Stage 8'!L38","v":0},{"$f":"+'Stage 9'!K38","v":0},{"$f":"+'Stage 9'!L38","v":0},{"$f":"+'Stage 10'!K38","v":0},{"$f":"+'Stage 10'!L38","v":0},{"$f":"+'Stage 11'!K38","v":0},{"$f":"+'Stage 11'!L38","v":0},{"$f":"+'Stage 12'!K38","v":0},{"$f":"+'Stage 12'!L38","v":0},0,0,{"$f":"IF(ISBLANK('Shooter Information'!B40),,IF(SUM('Stage 1'!M38,'Stage 2'!M38,'Stage 3'!M38,'Stage 4'!M38,'Stage 5'!M38,'Stage 6'!M38,'Stage 7'!M38,'Stage 8'!M38,'Stage 9'!M38,'Stage 10'!M38,'Stage 11'!M38,'Stage 12'!M38)=0,\"Yes\",\"No\"))","v":0},{"$f":"IF(ISBLANK('Shooter Information'!B40),,IF(AK39>=2,\"No\",\"Yes\"))","v":0},99999,99999,{"$f":"IF(ISBLANK('Shooter Information'!C40),\"ZZZZZZZZZZ\",C39)","v":"ZZZZZZZZZZ"},{"$f":"CELL(\"row\",'Shooter Information'!B40)","v":40},{"$f":"SUM('Stage 1'!I38,'Stage 2'!I38,'Stage 3'!I38,'Stage 4'!I38,'Stage 5'!I38,'Stage 6'!I38,'Stage 7'!I38,'Stage 8'!I38,'Stage 9'!I38,'Stage 10'!I38,'Stage 11'!I38,'Stage 12'!I38)","v":0}]
[{"$f":"IF(AF40=\"Yes\",IF('Shooter Information'!$C$2=\"R\",(SUMPRODUCT(--(AD40>$AD$5:$AD$79),--(\"Yes\"=$AF$5:$AF$79))+1),(SUMPRODUCT(--(AC40>$AC$5:$AC$79),--(\"Yes\"=$AF$5:$AF$79))+1)),0)","v":0},{"$f":"'Shooter Information'!B41","v":0},{"$f":"'Shooter Information'!C41","v":0},{"$f":"IF(AF40=\"Yes\",IF('Shooter Information'!$C$2=\"R\",(SUMPRODUCT(--(C40=$C$5:$C$79),--(AD40>$AD$5:$AD$79),--(\"Yes\"=$AF$5:$AF$79))+1),(SUMPRODUCT(--(C40=$C$5:$C$79),--(AC40>$AC$5:$AC$79),--(\"Yes\"=$AF$5:$AF$79))+1)),0)","v":0},{"$f":"+'Stage 1'!K39","v":0},{"$f":"+'Stage 1'!L39","v":0},{"$f":"+'Stage 2'!K39","v":0},{"$f":"+'Stage 2'!L39","v":0},{"$f":"+'Stage 3'!K39","v":0},{"$f":"+'Stage 3'!L39","v":0},{"$f":"+'Stage 4'!K39","v":0},{"$f":"+'Stage 4'!L39","v":0},{"$f":"+'Stage 5'!K39","v":0},{"$f":"+'Stage 5'!L39","v":0},{"$f":"+'Stage 6'!K39","v":0},{"$f":"+'Stage 6'!L39","v":0},{"$f":"+'Stage 7'!K39","v":0},{"$f":"+'Stage 7'!L39","v":0},{"$f":"+'Stage 8'!K39","v":0},{"$f":"+'Stage 8'!L39","v":0},{"$f":"+'Stage 9'!K39","v":0},{"$f":"+'Stage 9'!L39","v":0},{"$f":"+'Stage 10'!K39","v":0},{"$f":"+'Stage 10'!L39","v":0},{"$f":"+'Stage 11'!K39","v":0},{"$f":"+'Stage 11'!L39","v":0},{"$f":"+'Stage 12'!K39","v":0},{"$f":"+'Stage 12'!L39","v":0},0,0,{"$f":"IF(ISBLANK('Shooter Information'!B41),,IF(SUM('Stage 1'!M39,'Stage 2'!M39,'Stage 3'!M39,'Stage 4'!M39,'Stage 5'!M39,'Stage 6'!M39,'Stage 7'!M39,'Stage 8'!M39,'Stage 9'!M39,'Stage 10'!M39,'Stage 11'!M39,'Stage 12'!M39)=0,\"Yes\",\"No\"))","v":0},{"$f":"IF(ISBLANK('Shooter Information'!B41),,IF(AK40>=2,\"No\",\"Yes\"))","v":0},99999,99999,{"$f":"IF(ISBLANK('Shooter Information'!C41),\"ZZZZZZZZZZ\",C40)","v":"ZZZZZZZZZZ"},{"$f":"CELL(\"row\",'Shooter Information'!B41)","v":41},{"$f":"SUM('Stage 1'!I39,'Stage 2'!I39,'Stage 3'!I39,'Stage 4'!I39,'Stage 5'!I39,'Stage 6'!I39,'Stage 7'!I39,'Stage 8'!I39,'Stage 9'!I39,'Stage 10'!I39,'Stage 11'!I39,'Stage 12'!I39)","v":0}]
[{"$f":"IF(AF41=\"Yes\",IF('Shooter Information'!$C$2=\"R\",(SUMPRODUCT(--(AD41>$AD$5:$AD$79),--(\"Yes\"=$AF$5:$AF$79))+1),(SUMPRODUCT(--(AC41>$AC$5:$AC$79),--(\"Yes\"=$AF$5:$AF$79))+1)),0)","v":0},{"$f":"'Shooter Information'!B42","v":0},{"$f":"'Shooter Information'!C42","v":0},{"$f":"IF(AF41=\"Yes\",IF('Shooter Information'!$C$2=\"R\",(SUMPRODUCT(--(C41=$C$5:$C$79),--(AD41>$AD$5:$AD$79),--(\"Yes\"=$AF$5:$AF$79))+1),(SUMPRODUCT(--(C41=$C$5:$C$79),--(AC41>$AC$5:$AC$79),--(\"Yes\"=$AF$5:$AF$79))+1)),0)","v":0},{"$f":"+'Stage 1'!K40","v":0},{"$f":"+'Stage 1'!L40","v":0},{"$f":"+'Stage 2'!K40","v":0},{"$f":"+'Stage 2'!L40","v":0},{"$f":"+'Stage 3'!K40","v":0},{"$f":"+'Stage 3'!L40","v":0},{"$f":"+'Stage 4'!K40","v":0},{"$f":"+'Stage 4'!L40","v":0},{"$f":"+'Stage 5'!K40","v":0},{"$f":"+'Stage 5'!L40","v":0},{"$f":"+'Stage 6'!K40","v":0},{"$f":"+'Stage 6'!L40","v":0},{"$f":"+'Stage 7'!K40","v":0},{"$f":"+'Stage 7'!L40","v":0},{"$f":"+'Stage 8'!K40","v":0},{"$f":"+'Stage 8'!L40","v":0},{"$f":"+'Stage 9'!K40","v":0},{"$f":"+'Stage 9'!L40","v":0},{"$f":"+'Stage 10'!K40","v":0},{"$f":"+'Stage 10'!L40","v":0},{"$f":"+'Stage 11'!K40","v":0},{"$f":"+'Stage 11'!L40","v":0},{"$f":"+'Stage 12'!K40","v":0},{"$f":"+'Stage 12'!L40","v":0},0,0,{"$f":"IF(ISBLANK('Shooter Information'!B42),,IF(SUM('Stage 1'!M40,'Stage 2'!M40,'Stage 3'!M40,'Stage 4'!M40,'Stage 5'!M40,'Stage 6'!M40,'Stage 7'!M40,'Stage 8'!M40,'Stage 9'!M40,'Stage 10'!M40,'Stage 11'!M40,'Stage 12'!M40)=0,\"Yes\",\"No\"))","v":0},{"$f":"IF(ISBLANK('Shooter Information'!B42),,IF(AK41>=2,\"No\",\"Yes\"))","v":0},99999,99999,{"$f":"IF(ISBLANK('Shooter Information'!C42),\"ZZZZZZZZZZ\",C41)","v":"ZZZZZZZZZZ"},{"$f":"CELL(\"row\",'Shooter Information'!B42)","v":42},{"$f":"SUM('Stage 1'!I40,'Stage 2'!I40,'Stage 3'!I40,'Stage 4'!I40,'Stage 5'!I40,'Stage 6'!I40,'Stage 7'!I40,'Stage 8'!I40,'Stage 9'!I40,'Stage 10'!I40,'Stage 11'!I40,'Stage 12'!I40)","v":0}]
[{"$f":"IF(AF42=\"Yes\",IF('Shooter Information'!$C$2=\"R\",(SUMPRODUCT(--(AD42>$AD$5:$AD$79),--(\"Yes\"=$AF$5:$AF$79))+1),(SUMPRODUCT(--(AC42>$AC$5:$AC$79),--(\"Yes\"=$AF$5:$AF$79))+1)),0)","v":0},{"$f":"'Shooter Information'!B43","v":0},{"$f":"'Shooter Information'!C43","v":0},{"$f":"IF(AF42=\"Yes\",IF('Shooter Information'!$C$2=\"R\",(SUMPRODUCT(--(C42=$C$5:$C$79),--(AD42>$AD$5:$AD$79),--(\"Yes\"=$AF$5:$AF$79))+1),(SUMPRODUCT(--(C42=$C$5:$C$79),--(AC42>$AC$5:$AC$79),--(\"Yes\"=$AF$5:$AF$79))+1)),0)","v":0},{"$f":"+'Stage 1'!K41","v":0},{"$f":"+'Stage 1'!L41","v":0},{"$f":"+'Stage 2'!K41","v":0},{"$f":"+'Stage 2'!L41","v":0},{"$f":"+'Stage 3'!K41","v":0},{"$f":"+'Stage 3'!L41","v":0},{"$f":"+'Stage 4'!K41","v":0},{"$f":"+'Stage 4'!L41","v":0},{"$f":"+'Stage 5'!K41","v":0},{"$f":"+'Stage 5'!L41","v":0},{"$f":"+'Stage 6'!K41","v":0},{"$f":"+'Stage 6'!L41","v":0},{"$f":"+'Stage 7'!K41","v":0},{"$f":"+'Stage 7'!L41","v":0},{"$f":"+'Stage 8'!K41","v":0},{"$f":"+'Stage 8'!L41","v":0},{"$f":"+'Stage 9'!K41","v":0},{"$f":"+'Stage 9'!L41","v":0},{"$f":"+'Stage 10'!K41","v":0},{"$f":"+'Stage 10'!L41","v":0},{"$f":"+'Stage 11'!K41","v":0},{"$f":"+'Stage 11'!L41","v":0},{"$f":"+'Stage 12'!K41","v":0},{"$f":"+'Stage 12'!L41","v":0},0,0,{"$f":"IF(ISBLANK('Shooter Information'!B43),,IF(SUM('Stage 1'!M41,'Stage 2'!M41,'Stage 3'!M41,'Stage 4'!M41,'Stage 5'!M41,'Stage 6'!M41,'Stage 7'!M41,'Stage 8'!M41,'Stage 9'!M41,'Stage 10'!M41,'Stage 11'!M41,'Stage 12'!M41)=0,\"Yes\",\"No\"))","v":0},{"$f":"IF(ISBLANK('Shooter Information'!B43),,IF(AK42>=2,\"No\",\"Yes\"))","v":0},99999,99999,{"$f":"IF(ISBLANK('Shooter Information'!C43),\"ZZZZZZZZZZ\",C42)","v":"ZZZZZZZZZZ"},{"$f":"CELL(\"row\",'Shooter Information'!B43)","v":43},{"$f":"SUM('Stage 1'!I41,'Stage 2'!I41,'Stage 3'!I41,'Stage 4'!I41,'Stage 5'!I41,'Stage 6'!I41,'Stage 7'!I41,'Stage 8'!I41,'Stage 9'!I41,'Stage 10'!I41,'Stage 11'!I41,'Stage 12'!I41)","v":0}]
[{"$f":"IF(AF43=\"Yes\",IF('Shooter Information'!$C$2=\"R\",(SUMPRODUCT(--(AD43>$AD$5:$AD$79),--(\"Yes\"=$AF$5:$AF$79))+1),(SUMPRODUCT(--(AC43>$AC$5:$AC$79),--(\"Yes\"=$AF$5:$AF$79))+1)),0)","v":0},{"$f":"'Shooter Information'!B44","v":0},{"$f":"'Shooter Information'!C44","v":0},{"$f":"IF(AF43=\"Yes\",IF('Shooter Information'!$C$2=\"R\",(SUMPRODUCT(--(C43=$C$5:$C$79),--(AD43>$AD$5:$AD$79),--(\"Yes\"=$AF$5:$AF$79))+1),(SUMPRODUCT(--(C43=$C$5:$C$79),--(AC43>$AC$5:$AC$79),--(\"Yes\"=$AF$5:$AF$79))+1)),0)","v":0},{"$f":"+'Stage 1'!K42","v":0},{"$f":"+'Stage 1'!L42","v":0},{"$f":"+'Stage 2'!K42","v":0},{"$f":"+'Stage 2'!L42","v":0},{"$f":"+'Stage 3'!K42","v":0},{"$f":"+'Stage 3'!L42","v":0},{"$f":"+'Stage 4'!K42","v":0},{"$f":"+'Stage 4'!L42","v":0},{"$f":"+'Stage 5'!K42","v":0},{"$f":"+'Stage 5'!L42","v":0},{"$f":"+'Stage 6'!K42","v":0},{"$f":"+'Stage 6'!L42","v":0},{"$f":"+'Stage 7'!K42","v":0},{"$f":"+'Stage 7'!L42","v":0},{"$f":"+'Stage 8'!K42","v":0},{"$f":"+'Stage 8'!L42","v":0},{"$f":"+'Stage 9'!K42","v":0},{"$f":"+'Stage 9'!L42","v":0},{"$f":"+'Stage 10'!K42","v":0},{"$f":"+'Stage 10'!L42","v":0},{"$f":"+'Stage 11'!K42","v":0},{"$f":"+'Stage 11'!L42","v":0},{"$f":"+'Stage 12'!K42","v":0},{"$f":"+'Stage 12'!L42","v":0},0,0,{"$f":"IF(ISBLANK('Shooter Information'!B44),,IF(SUM('Stage 1'!M42,'Stage 2'!M42,'Stage 3'!M42,'Stage 4'!M42,'Stage 5'!M42,'Stage 6'!M42,'Stage 7'!M42,'Stage 8'!M42,'Stage 9'!M42,'Stage 10'!M42,'Stage 11'!M42,'Stage 12'!M42)=0,\"Yes\",\"No\"))","v":0},{"$f":"IF(ISBLANK('Shooter Information'!B44),,IF(AK43>=2,\"No\",\"Yes\"))","v":0},99999,99999,{"$f":"IF(ISBLANK('Shooter Information'!C44),\"ZZZZZZZZZZ\",C43)","v":"ZZZZZZZZZZ"},{"$f":"CELL(\"row\",'Shooter Information'!B44)","v":44},{"$f":"SUM('Stage 1'!I42,'Stage 2'!I42,'Stage 3'!I42,'Stage 4'!I42,'Stage 5'!I42,'Stage 6'!I42,'Stage 7'!I42,'Stage 8'!I42,'Stage 9'!I42,'Stage 10'!I42,'Stage 11'!I42,'Stage 12'!I42)","v":0}]
[{"$f":"IF(AF44=\"Yes\",IF('Shooter Information'!$C$2=\"R\",(SUMPRODUCT(--(AD44>$AD$5:$AD$79),--(\"Yes\"=$AF$5:$AF$79))+1),(SUMPRODUCT(--(AC44>$AC$5:$AC$79),--(\"Yes\"=$AF$5:$AF$79))+1)),0)","v":0},{"$f":"'Shooter Information'!B45","v":0},{"$f":"'Shooter Information'!C45","v":0},{"$f":"IF(AF44=\"Yes\",IF('Shooter Information'!$C$2=\"R\",(SUMPRODUCT(--(C44=$C$5:$C$79),--(AD44>$AD$5:$AD$79),--(\"Yes\"=$AF$5:$AF$79))+1),(SUMPRODUCT(--(C44=$C$5:$C$79),--(AC44>$AC$5:$AC$79),--(\"Yes\"=$AF$5:$AF$79))+1)),0)","v":0},{"$f":"+'Stage 1'!K43","v":0},{"$f":"+'Stage 1'!L43","v":0},{"$f":"+'Stage 2'!K43","v":0},{"$f":"+'Stage 2'!L43","v":0},{"$f":"+'Stage 3'!K43","v":0},{"$f":"+'Stage 3'!L43","v":0},{"$f":"+'Stage 4'!K43","v":0},{"$f":"+'Stage 4'!L43","v":0},{"$f":"+'Stage 5'!K43","v":0},{"$f":"+'Stage 5'!L43","v":0},{"$f":"+'Stage 6'!K43","v":0},{"$f":"+'Stage 6'!L43","v":0},{"$f":"+'Stage 7'!K43","v":0},{"$f":"+'Stage 7'!L43","v":0},{"$f":"+'Stage 8'!K43","v":0},{"$f":"+'Stage 8'!L43","v":0},{"$f":"+'Stage 9'!K43","v":0},{"$f":"+'Stage 9'!L43","v":0},{"$f":"+'Stage 10'!K43","v":0},{"$f":"+'Stage 10'!L43","v":0},{"$f":"+'Stage 11'!K43","v":0},{"$f":"+'Stage 11'!L43","v":0},{"$f":"+'Stage 12'!K43","v":0},{"$f":"+'Stage 12'!L43","v":0},0,0,{"$f":"IF(ISBLANK('Shooter Information'!B45),,IF(SUM('Stage 1'!M43,'Stage 2'!M43,'Stage 3'!M43,'Stage 4'!M43,'Stage 5'!M43,'Stage 6'!M43,'Stage 7'!M43,'Stage 8'!M43,'Stage 9'!M43,'Stage 10'!M43,'Stage 11'!M43,'Stage 12'!M43)=0,\"Yes\",\"No\"))","v":0},{"$f":"IF(ISBLANK('Shooter Information'!B45),,IF(AK44>=2,\"No\",\"Yes\"))","v":0},99999,99999,{"$f":"IF(ISBLANK('Shooter Information'!C45),\"ZZZZZZZZZZ\",C44)","v":"ZZZZZZZZZZ"},{"$f":"CELL(\"row\",'Shooter Information'!B45)","v":45},{"$f":"SUM('Stage 1'!I43,'Stage 2'!I43,'Stage 3'!I43,'Stage 4'!I43,'Stage 5'!I43,'Stage 6'!I43,'Stage 7'!I43,'Stage 8'!I43,'Stage 9'!I43,'Stage 10'!I43,'Stage 11'!I43,'Stage 12'!I43)","v":0}]
[{"$f":"IF(AF45=\"Yes\",IF('Shooter Information'!$C$2=\"R\",(SUMPRODUCT(--(AD45>$AD$5:$AD$79),--(\"Yes\"=$AF$5:$AF$79))+1),(SUMPRODUCT(--(AC45>$AC$5:$AC$79),--(\"Yes\"=$AF$5:$AF$79))+1)),0)","v":0},{"$f":"'Shooter Information'!B46","v":0},{"$f":"'Shooter Information'!C46","v":0},{"$f":"IF(AF45=\"Yes\",IF('Shooter Information'!$C$2=\"R\",(SUMPRODUCT(--(C45=$C$5:$C$79),--(AD45>$AD$5:$AD$79),--(\"Yes\"=$AF$5:$AF$79))+1),(SUMPRODUCT(--(C45=$C$5:$C$79),--(AC45>$AC$5:$AC$79),--(\"Yes\"=$AF$5:$AF$79))+1)),0)","v":0},{"$f":"+'Stage 1'!K44","v":0},{"$f":"+'Stage 1'!L44","v":0},{"$f":"+'Stage 2'!K44","v":0},{"$f":"+'Stage 2'!L44","v":0},{"$f":"+'Stage 3'!K44","v":0},{"$f":"+'Stage 3'!L44","v":0},{"$f":"+'Stage 4'!K44","v":0},{"$f":"+'Stage 4'!L44","v":0},{"$f":"+'Stage 5'!K44","v":0},{"$f":"+'Stage 5'!L44","v":0},{"$f":"+'Stage 6'!K44","v":0},{"$f":"+'Stage 6'!L44","v":0},{"$f":"+'Stage 7'!K44","v":0},{"$f":"+'Stage 7'!L44","v":0},{"$f":"+'Stage 8'!K44","v":0},{"$f":"+'Stage 8'!L44","v":0},{"$f":"+'Stage 9'!K44","v":0},{"$f":"+'Stage 9'!L44","v":0},{"$f":"+'Stage 10'!K44","v":0},{"$f":"+'Stage 10'!L44","v":0},{"$f":"+'Stage 11'!K44","v":0},{"$f":"+'Stage 11'!L44","v":0},{"$f":"+'Stage 12'!K44","v":0},{"$f":"+'Stage 12'!L44","v":0},0,0,{"$f":"IF(ISBLANK('Shooter Information'!B46),,IF(SUM('Stage 1'!M44,'Stage 2'!M44,'Stage 3'!M44,'Stage 4'!M44,'Stage 5'!M44,'Stage 6'!M44,'Stage 7'!M44,'Stage 8'!M44,'Stage 9'!M44,'Stage 10'!M44,'Stage 11'!M44,'Stage 12'!M44)=0,\"Yes\",\"No\"))","v":0},{"$f":"IF(ISBLANK('Shooter Information'!B46),,IF(AK45>=2,\"No\",\"Yes\"))","v":0},99999,99999,{"$f":"IF(ISBLANK('Shooter Information'!C46),\"ZZZZZZZZZZ\",C45)","v":"ZZZZZZZZZZ"},{"$f":"CELL(\"row\",'Shooter Information'!B46)","v":46},{"$f":"SUM('Stage 1'!I44,'Stage 2'!I44,'Stage 3'!I44,'Stage 4'!I44,'Stage 5'!I44,'Stage 6'!I44,'Stage 7'!I44,'Stage 8'!I44,'Stage 9'!I44,'Stage 10'!I44,'Stage 11'!I44,'Stage 12'!I44)","v":0}]
[{"$f":"IF(AF46=\"Yes\",IF('Shooter Information'!$C$2=\"R\",(SUMPRODUCT(--(AD46>$AD$5:$AD$79),--(\"Yes\"=$AF$5:$AF$79))+1),(SUMPRODUCT(--(AC46>$AC$5:$AC$79),--(\"Yes\"=$AF$5:$AF$79))+1)),0)","v":0},{"$f":"'Shooter Information'!B47","v":0},{"$f":"'Shooter Information'!C47","v":0},{"$f":"IF(AF46=\"Yes\",IF('Shooter Information'!$C$2=\"R\",(SUMPRODUCT(--(C46=$C$5:$C$79),--(AD46>$AD$5:$AD$79),--(\"Yes\"=$AF$5:$AF$79))+1),(SUMPRODUCT(--(C46=$C$5:$C$79),--(AC46>$AC$5:$AC$79),--(\"Yes\"=$AF$5:$AF$79))+1)),0)","v":0},{"$f":"+'Stage 1'!K45","v":0},{"$f":"+'Stage 1'!L45","v":0},{"$f":"+'Stage 2'!K45","v":0},{"$f":"+'Stage 2'!L45","v":0},{"$f":"+'Stage 3'!K45","v":0},{"$f":"+'Stage 3'!L45","v":0},{"$f":"+'Stage 4'!K45","v":0},{"$f":"+'Stage 4'!L45","v":0},{"$f":"+'Stage 5'!K45","v":0},{"$f":"+'Stage 5'!L45","v":0},{"$f":"+'Stage 6'!K45","v":0},{"$f":"+'Stage 6'!L45","v":0},{"$f":"+'Stage 7'!K45","v":0},{"$f":"+'Stage 7'!L45","v":0},{"$f":"+'Stage 8'!K45","v":0},{"$f":"+'Stage 8'!L45","v":0},{"$f":"+'Stage 9'!K45","v":0},{"$f":"+'Stage 9'!L45","v":0},{"$f":"+'Stage 10'!K45","v":0},{"$f":"+'Stage 10'!L45","v":0},{"$f":"+'Stage 11'!K45","v":0},{"$f":"+'Stage 11'!L45","v":0},{"$f":"+'Stage 12'!K45","v":0},{"$f":"+'Stage 12'!L45","v":0},0,0,{"$f":"IF(ISBLANK('Shooter Information'!B47),,IF(SUM('Stage 1'!M45,'Stage 2'!M45,'Stage 3'!M45,'Stage 4'!M45,'Stage 5'!M45,'Stage 6'!M45,'Stage 7'!M45,'Stage 8'!M45,'Stage 9'!M45,'Stage 10'!M45,'Stage 11'!M45,'Stage 12'!M45)=0,\"Yes\",\"No\"))","v":0},{"$f":"IF(ISBLANK('Shooter Information'!B47),,IF(AK46>=2,\"No\",\"Yes\"))","v":0},99999,99999,{"$f":"IF(ISBLANK('Shooter Information'!C47),\"ZZZZZZZZZZ\",C46)","v":"ZZZZZZZZZZ"},{"$f":"CELL(\"row\",'Shooter Information'!B47)","v":47},{"$f":"SUM('Stage 1'!I45,'Stage 2'!I45,'Stage 3'!I45,'Stage 4'!I45,'Stage 5'!I45,'Stage 6'!I45,'Stage 7'!I45,'Stage 8'!I45,'Stage 9'!I45,'Stage 10'!I45,'Stage 11'!I45,'Stage 12'!I45)","v":0}]
[{"$f":"IF(AF47=\"Yes\",IF('Shooter Information'!$C$2=\"R\",(SUMPRODUCT(--(AD47>$AD$5:$AD$79),--(\"Yes\"=$AF$5:$AF$79))+1),(SUMPRODUCT(--(AC47>$AC$5:$AC$79),--(\"Yes\"=$AF$5:$AF$79))+1)),0)","v":0},{"$f":"'Shooter Information'!B48","v":0},{"$f":"'Shooter Information'!C48","v":0},{"$f":"IF(AF47=\"Yes\",IF('Shooter Information'!$C$2=\"R\",(SUMPRODUCT(--(C47=$C$5:$C$79),--(AD47>$AD$5:$AD$79),--(\"Yes\"=$AF$5:$AF$79))+1),(SUMPRODUCT(--(C47=$C$5:$C$79),--(AC47>$AC$5:$AC$79),--(\"Yes\"=$AF$5:$AF$79))+1)),0)","v":0},{"$f":"+'Stage 1'!K46","v":0},{"$f":"+'Stage 1'!L46","v":0},{"$f":"+'Stage 2'!K46","v":0},{"$f":"+'Stage 2'!L46","v":0},{"$f":"+'Stage 3'!K46","v":0},{"$f":"+'Stage 3'!L46","v":0},{"$f":"+'Stage 4'!K46","v":0},{"$f":"+'Stage 4'!L46","v":0},{"$f":"+'Stage 5'!K46","v":0},{"$f":"+'Stage 5'!L46","v":0},{"$f":"+'Stage 6'!K46","v":0},{"$f":"+'Stage 6'!L46","v":0},{"$f":"+'Stage 7'!K46","v":0},{"$f":"+'Stage 7'!L46","v":0},{"$f":"+'Stage 8'!K46","v":0},{"$f":"+'Stage 8'!L46","v":0},{"$f":"+'Stage 9'!K46","v":0},{"$f":"+'Stage 9'!L46","v":0},{"$f":"+'Stage 10'!K46","v":0},{"$f":"+'Stage 10'!L46","v":0},{"$f":"+'Stage 11'!K46","v":0},{"$f":"+'Stage 11'!L46","v":0},{"$f":"+'Stage 12'!K46","v":0},{"$f":"+'Stage 12'!L46","v":0},0,0,{"$f":"IF(ISBLANK('Shooter Information'!B48),,IF(SUM('Stage 1'!M46,'Stage 2'!M46,'Stage 3'!M46,'Stage 4'!M46,'Stage 5'!M46,'Stage 6'!M46,'Stage 7'!M46,'Stage 8'!M46,'Stage 9'!M46,'Stage 10'!M46,'Stage 11'!M46,'Stage 12'!M46)=0,\"Yes\",\"No\"))","v":0},{"$f":"IF(ISBLANK('Shooter Information'!B48),,IF(AK47>=2,\"No\",\"Yes\"))","v":0},99999,99999,{"$f":"IF(ISBLANK('Shooter Information'!C48),\"ZZZZZZZZZZ\",C47)","v":"ZZZZZZZZZZ"},{"$f":"CELL(\"row\",'Shooter Information'!B48)","v":48},{"$f":"SUM('Stage 1'!I46,'Stage 2'!I46,'Stage 3'!I46,'Stage 4'!I46,'Stage 5'!I46,'Stage 6'!I46,'Stage 7'!I46,'Stage 8'!I46,'Stage 9'!I46,'Stage 10'!I46,'Stage 11'!I46,'Stage 12'!I46)","v":0}]
[{"$f":"IF(AF48=\"Yes\",IF('Shooter Information'!$C$2=\"R\",(SUMPRODUCT(--(AD48>$AD$5:$AD$79),--(\"Yes\"=$AF$5:$AF$79))+1),(SUMPRODUCT(--(AC48>$AC$5:$AC$79),--(\"Yes\"=$AF$5:$AF$79))+1)),0)","v":0},{"$f":"'Shooter Information'!B49","v":0},{"$f":"'Shooter Information'!C49","v":0},{"$f":"IF(AF48=\"Yes\",IF('Shooter Information'!$C$2=\"R\",(SUMPRODUCT(--(C48=$C$5:$C$79),--(AD48>$AD$5:$AD$79),--(\"Yes\"=$AF$5:$AF$79))+1),(SUMPRODUCT(--(C48=$C$5:$C$79),--(AC48>$AC$5:$AC$79),--(\"Yes\"=$AF$5:$AF$79))+1)),0)","v":0},{"$f":"+'Stage 1'!K47","v":0},{"$f":"+'Stage 1'!L47","v":0},{"$f":"+'Stage 2'!K47","v":0},{"$f":"+'Stage 2'!L47","v":0},{"$f":"+'Stage 3'!K47","v":0},{"$f":"+'Stage 3'!L47","v":0},{"$f":"+'Stage 4'!K47","v":0},{"$f":"+'Stage 4'!L47","v":0},{"$f":"+'Stage 5'!K47","v":0},{"$f":"+'Stage 5'!L47","v":0},{"$f":"+'Stage 6'!K47","v":0},{"$f":"+'Stage 6'!L47","v":0},{"$f":"+'Stage 7'!K47","v":0},{"$f":"+'Stage 7'!L47","v":0},{"$f":"+'Stage 8'!K47","v":0},{"$f":"+'Stage 8'!L47","v":0},{"$f":"+'Stage 9'!K47","v":0},{"$f":"+'Stage 9'!L47","v":0},{"$f":"+'Stage 10'!K47","v":0},{"$f":"+'Stage 10'!L47","v":0},{"$f":"+'Stage 11'!K47","v":0},{"$f":"+'Stage 11'!L47","v":0},{"$f":"+'Stage 12'!K47","v":0},{"$f":"+'Stage 12'!L47","v":0},0,0,{"$f":"IF(ISBLANK('Shooter Information'!B49),,IF(SUM('Stage 1'!M47,'Stage 2'!M47,'Stage 3'!M47,'Stage 4'!M47,'Stage 5'!M47,'Stage 6'!M47,'Stage 7'!M47,'Stage 8'!M47,'Stage 9'!M47,'Stage 10'!M47,'Stage 11'!M47,'Stage 12'!M47)=0,\"Yes\",\"No\"))","v":0},{"$f":"IF(ISBLANK('Shooter Information'!B49),,IF(AK48>=2,\"No\",\"Yes\"))","v":0},99999,99999,{"$f":"IF(ISBLANK('Shooter Information'!C49),\"ZZZZZZZZZZ\",C48)","v":"ZZZZZZZZZZ"},{"$f":"CELL(\"row\",'Shooter Information'!B49)","v":49},{"$f":"SUM('Stage 1'!I47,'Stage 2'!I47,'Stage 3'!I47,'Stage 4'!I47,'Stage 5'!I47,'Stage 6'!I47,'Stage 7'!I47,'Stage 8'!I47,'Stage 9'!I47,'Stage 10'!I47,'Stage 11'!I47,'Stage 12'!I47)","v":0}]
[{"$f":"IF(AF49=\"Yes\",IF('Shooter Information'!$C$2=\"R\",(SUMPRODUCT(--(AD49>$AD$5:$AD$79),--(\"Yes\"=$AF$5:$AF$79))+1),(SUMPRODUCT(--(AC49>$AC$5:$AC$79),--(\"Yes\"=$AF$5:$AF$79))+1)),0)","v":0},{"$f":"'Shooter Information'!B50","v":0},{"$f":"'Shooter Information'!C50","v":0},{"$f":"IF(AF49=\"Yes\",IF('Shooter Information'!$C$2=\"R\",(SUMPRODUCT(--(C49=$C$5:$C$79),--(AD49>$AD$5:$AD$79),--(\"Yes\"=$AF$5:$AF$79))+1),(SUMPRODUCT(--(C49=$C$5:$C$79),--(AC49>$AC$5:$AC$79),--(\"Yes\"=$AF$5:$AF$79))+1)),0)","v":0},{"$f":"+'Stage 1'!K48","v":0},{"$f":"+'Stage 1'!L48","v":0},{"$f":"+'Stage 2'!K48","v":0},{"$f":"+'Stage 2'!L48","v":0},{"$f":"+'Stage 3'!K48","v":0},{"$f":"+'Stage 3'!L48","v":0},{"$f":"+'Stage 4'!K48","v":0},{"$f":"+'Stage 4'!L48","v":0},{"$f":"+'Stage 5'!K48","v":0},{"$f":"+'Stage 5'!L48","v":0},{"$f":"+'Stage 6'!K48","v":0},{"$f":"+'Stage 6'!L48","v":0},{"$f":"+'Stage 7'!K48","v":0},{"$f":"+'Stage 7'!L48","v":0},{"$f":"+'Stage 8'!K48","v":0},{"$f":"+'Stage 8'!L48","v":0},{"$f":"+'Stage 9'!K48","v":0},{"$f":"+'Stage 9'!L48","v":0},{"$f":"+'Stage 10'!K48","v":0},{"$f":"+'Stage 10'!L48","v":0},{"$f":"+'Stage 11'!K48","v":0},{"$f":"+'Stage 11'!L48","v":0},{"$f":"+'Stage 12'!K48","v":0},{"$f":"+'Stage 12'!L48","v":0},0,0,{"$f":"IF(ISBLANK('Shooter Information'!B50),,IF(SUM('Stage 1'!M48,'Stage 2'!M48,'Stage 3'!M48,'Stage 4'!M48,'Stage 5'!M48,'Stage 6'!M48,'Stage 7'!M48,'Stage 8'!M48,'Stage 9'!M48,'Stage 10'!M48,'Stage 11'!M48,'Stage 12'!M48)=0,\"Yes\",\"No\"))","v":0},{"$f":"IF(ISBLANK('Shooter Information'!B50),,IF(AK49>=2,\"No\",\"Yes\"))","v":0},99999,99999,{"$f":"IF(ISBLANK('Shooter Information'!C50),\"ZZZZZZZZZZ\",C49)","v":"ZZZZZZZZZZ"},{"$f":"CELL(\"row\",'Shooter Information'!B50)","v":50},{"$f":"SUM('Stage 1'!I48,'Stage 2'!I48,'Stage 3'!I48,'Stage 4'!I48,'Stage 5'!I48,'Stage 6'!I48,'Stage 7'!I48,'Stage 8'!I48,'Stage 9'!I48,'Stage 10'!I48,'Stage 11'!I48,'Stage 12'!I48)","v":0}]
[{"$f":"IF(AF50=\"Yes\",IF('Shooter Information'!$C$2=\"R\",(SUMPRODUCT(--(AD50>$AD$5:$AD$79),--(\"Yes\"=$AF$5:$AF$79))+1),(SUMPRODUCT(--(AC50>$AC$5:$AC$79),--(\"Yes\"=$AF$5:$AF$79))+1)),0)","v":0},{"$f":"'Shooter Information'!B51","v":0},{"$f":"'Shooter Information'!C51","v":0},{"$f":"IF(AF50=\"Yes\",IF('Shooter Information'!$C$2=\"R\",(SUMPRODUCT(--(C50=$C$5:$C$79),--(AD50>$AD$5:$AD$79),--(\"Yes\"=$AF$5:$AF$79))+1),(SUMPRODUCT(--(C50=$C$5:$C$79),--(AC50>$AC$5:$AC$79),--(\"Yes\"=$AF$5:$AF$79))+1)),0)","v":0},{"$f":"+'Stage 1'!K49","v":0},{"$f":"+'Stage 1'!L49","v":0},{"$f":"+'Stage 2'!K49","v":0},{"$f":"+'Stage 2'!L49","v":0},{"$f":"+'Stage 3'!K49","v":0},{"$f":"+'Stage 3'!L49","v":0},{"$f":"+'Stage 4'!K49","v":0},{"$f":"+'Stage 4'!L49","v":0},{"$f":"+'Stage 5'!K49","v":0},{"$f":"+'Stage 5'!L49","v":0},{"$f":"+'Stage 6'!K49","v":0},{"$f":"+'Stage 6'!L49","v":0},{"$f":"+'Stage 7'!K49","v":0},{"$f":"+'Stage 7'!L49","v":0},{"$f":"+'Stage 8'!K49","v":0},{"$f":"+'Stage 8'!L49","v":0},{"$f":"+'Stage 9'!K49","v":0},{"$f":"+'Stage 9'!L49","v":0},{"$f":"+'Stage 10'!K49","v":0},{"$f":"+'Stage 10'!L49","v":0},{"$f":"+'Stage 11'!K49","v":0},{"$f":"+'Stage 11'!L49","v":0},{"$f":"+'Stage 12'!K49","v":0},{"$f":"+'Stage 12'!L49","v":0},0,0,{"$f":"IF(ISBLANK('Shooter Information'!B51),,IF(SUM('Stage 1'!M49,'Stage 2'!M49,'Stage 3'!M49,'Stage 4'!M49,'Stage 5'!M49,'Stage 6'!M49,'Stage 7'!M49,'Stage 8'!M49,'Stage 9'!M49,'Stage 10'!M49,'Stage 11'!M49,'Stage 12'!M49)=0,\"Yes\",\"No\"))","v":0},{"$f":"IF(ISBLANK('Shooter Information'!B51),,IF(AK50>=2,\"No\",\"Yes\"))","v":0},99999,99999,{"$f":"IF(ISBLANK('Shooter Information'!C51),\"ZZZZZZZZZZ\",C50)","v":"ZZZZZZZZZZ"},{"$f":"CELL(\"row\",'Shooter Information'!B51)","v":51},{"$f":"SUM('Stage 1'!I49,'Stage 2'!I49,'Stage 3'!I49,'Stage 4'!I49,'Stage 5'!I49,'Stage 6'!I49,'Stage 7'!I49,'Stage 8'!I49,'Stage 9'!I49,'Stage 10'!I49,'Stage 11'!I49,'Stage 12'!I49)","v":0}]
[{"$f":"IF(AF51=\"Yes\",IF('Shooter Information'!$C$2=\"R\",(SUMPRODUCT(--(AD51>$AD$5:$AD$79),--(\"Yes\"=$AF$5:$AF$79))+1),(SUMPRODUCT(--(AC51>$AC$5:$AC$79),--(\"Yes\"=$AF$5:$AF$79))+1)),0)","v":0},{"$f":"'Shooter Information'!B52","v":0},{"$f":"'Shooter Information'!C52","v":0},{"$f":"IF(AF51=\"Yes\",IF('Shooter Information'!$C$2=\"R\",(SUMPRODUCT(--(C51=$C$5:$C$79),--(AD51>$AD$5:$AD$79),--(\"Yes\"=$AF$5:$AF$79))+1),(SUMPRODUCT(--(C51=$C$5:$C$79),--(AC51>$AC$5:$AC$79),--(\"Yes\"=$AF$5:$AF$79))+1)),0)","v":0},{"$f":"+'Stage 1'!K50","v":0},{"$f":"+'Stage 1'!L50","v":0},{"$f":"+'Stage 2'!K50","v":0},{"$f":"+'Stage 2'!L50","v":0},{"$f":"+'Stage 3'!K50","v":0},{"$f":"+'Stage 3'!L50","v":0},{"$f":"+'Stage 4'!K50","v":0},{"$f":"+'Stage 4'!L50","v":0},{"$f":"+'Stage 5'!K50","v":0},{"$f":"+'Stage 5'!L50","v":0},{"$f":"+'Stage 6'!K50","v":0},{"$f":"+'Stage 6'!L50","v":0},{"$f":"+'Stage 7'!K50","v":0},{"$f":"+'Stage 7'!L50","v":0},{"$f":"+'Stage 8'!K50","v":0},{"$f":"+'Stage 8'!L50","v":0},{"$f":"+'Stage 9'!K50","v":0},{"$f":"+'Stage 9'!L50","v":0},{"$f":"+'Stage 10'!K50","v":0},{"$f":"+'Stage 10'!L50","v":0},{"$f":"+'Stage 11'!K50","v":0},{"$f":"+'Stage 11'!L50","v":0},{"$f":"+'Stage 12'!K50","v":0},{"$f":"+'Stage 12'!L50","v":0},0,0,{"$f":"IF(ISBLANK('Shooter Information'!B52),,IF(SUM('Stage 1'!M50,'Stage 2'!M50,'Stage 3'!M50,'Stage 4'!M50,'Stage 5'!M50,'Stage 6'!M50,'Stage 7'!M50,'Stage 8'!M50,'Stage 9'!M50,'Stage 10'!M50,'Stage 11'!M50,'Stage 12'!M50)=0,\"Yes\",\"No\"))","v":0},{"$f":"IF(ISBLANK('Shooter Information'!B52),,IF(AK51>=2,\"No\",\"Yes\"))","v":0},99999,99999,{"$f":"IF(ISBLANK('Shooter Information'!C52),\"ZZZZZZZZZZ\",C51)","v":"ZZZZZZZZZZ"},{"$f":"CELL(\"row\",'Shooter Information'!B52)","v":52},{"$f":"SUM('Stage 1'!I50,'Stage 2'!I50,'Stage 3'!I50,'Stage 4'!I50,'Stage 5'!I50,'Stage 6'!I50,'Stage 7'!I50,'Stage 8'!I50,'Stage 9'!I50,'Stage 10'!I50,'Stage 11'!I50,'Stage 12'!I50)","v":0}]
[{"$f":"IF(AF52=\"Yes\",IF('Shooter Information'!$C$2=\"R\",(SUMPRODUCT(--(AD52>$AD$5:$AD$79),--(\"Yes\"=$AF$5:$AF$79))+1),(SUMPRODUCT(--(AC52>$AC$5:$AC$79),--(\"Yes\"=$AF$5:$AF$79))+1)),0)","v":0},{"$f":"'Shooter Information'!B53","v":0},{"$f":"'Shooter Information'!C53","v":0},{"$f":"IF(AF52=\"Yes\",IF('Shooter Information'!$C$2=\"R\",(SUMPRODUCT(--(C52=$C$5:$C$79),--(AD52>$AD$5:$AD$79),--(\"Yes\"=$AF$5:$AF$79))+1),(SUMPRODUCT(--(C52=$C$5:$C$79),--(AC52>$AC$5:$AC$79),--(\"Yes\"=$AF$5:$AF$79))+1)),0)","v":0},{"$f":"+'Stage 1'!K51","v":0},{"$f":"+'Stage 1'!L51","v":0},{"$f":"+'Stage 2'!K51","v":0},{"$f":"+'Stage 2'!L51","v":0},{"$f":"+'Stage 3'!K51","v":0},{"$f":"+'Stage 3'!L51","v":0},{"$f":"+'Stage 4'!K51","v":0},{"$f":"+'Stage 4'!L51","v":0},{"$f":"+'Stage 5'!K51","v":0},{"$f":"+'Stage 5'!L51","v":0},{"$f":"+'Stage 6'!K51","v":0},{"$f":"+'Stage 6'!L51","v":0},{"$f":"+'Stage 7'!K51","v":0},{"$f":"+'Stage 7'!L51","v":0},{"$f":"+'Stage 8'!K51","v":0},{"$f":"+'Stage 8'!L51","v":0},{"$f":"+'Stage 9'!K51","v":0},{"$f":"+'Stage 9'!L51","v":0},{"$f":"+'Stage 10'!K51","v":0},{"$f":"+'Stage 10'!L51","v":0},{"$f":"+'Stage 11'!K51","v":0},{"$f":"+'Stage 11'!L51","v":0},{"$f":"+'Stage 12'!K51","v":0},{"$f":"+'Stage 12'!L51","v":0},0,0,{"$f":"IF(ISBLANK('Shooter Information'!B53),,IF(SUM('Stage 1'!M51,'Stage 2'!M51,'Stage 3'!M51,'Stage 4'!M51,'Stage 5'!M51,'Stage 6'!M51,'Stage 7'!M51,'Stage 8'!M51,'Stage 9'!M51,'Stage 10'!M51,'Stage 11'!M51,'Stage 12'!M51)=0,\"Yes\",\"No\"))","v":0},{"$f":"IF(ISBLANK('Shooter Information'!B53),,IF(AK52>=2,\"No\",\"Yes\"))","v":0},99999,99999,{"$f":"IF(ISBLANK('Shooter Information'!C53),\"ZZZZZZZZZZ\",C52)","v":"ZZZZZZZZZZ"},{"$f":"CELL(\"row\",'Shooter Information'!B53)","v":53},{"$f":"SUM('Stage 1'!I51,'Stage 2'!I51,'Stage 3'!I51,'Stage 4'!I51,'Stage 5'!I51,'Stage 6'!I51,'Stage 7'!I51,'Stage 8'!I51,'Stage 9'!I51,'Stage 10'!I51,'Stage 11'!I51,'Stage 12'!I51)","v":0}]
[{"$f":"IF(AF53=\"Yes\",IF('Shooter Information'!$C$2=\"R\",(SUMPRODUCT(--(AD53>$AD$5:$AD$79),--(\"Yes\"=$AF$5:$AF$79))+1),(SUMPRODUCT(--(AC53>$AC$5:$AC$79),--(\"Yes\"=$AF$5:$AF$79))+1)),0)","v":0},{"$f":"'Shooter Information'!B54","v":0},{"$f":"'Shooter Information'!C54","v":0},{"$f":"IF(AF53=\"Yes\",IF('Shooter Information'!$C$2=\"R\",(SUMPRODUCT(--(C53=$C$5:$C$79),--(AD53>$AD$5:$AD$79),--(\"Yes\"=$AF$5:$AF$79))+1),(SUMPRODUCT(--(C53=$C$5:$C$79),--(AC53>$AC$5:$AC$79),--(\"Yes\"=$AF$5:$AF$79))+1)),0)","v":0},{"$f":"+'Stage 1'!K52","v":0},{"$f":"+'Stage 1'!L52","v":0},{"$f":"+'Stage 2'!K52","v":0},{"$f":"+'Stage 2'!L52","v":0},{"$f":"+'Stage 3'!K52","v":0},{"$f":"+'Stage 3'!L52","v":0},{"$f":"+'Stage 4'!K52","v":0},{"$f":"+'Stage 4'!L52","v":0},{"$f":"+'Stage 5'!K52","v":0},{"$f":"+'Stage 5'!L52","v":0},{"$f":"+'Stage 6'!K52","v":0},{"$f":"+'Stage 6'!L52","v":0},{"$f":"+'Stage 7'!K52","v":0},{"$f":"+'Stage 7'!L52","v":0},{"$f":"+'Stage 8'!K52","v":0},{"$f":"+'Stage 8'!L52","v":0},{"$f":"+'Stage 9'!K52","v":0},{"$f":"+'Stage 9'!L52","v":0},{"$f":"+'Stage 10'!K52","v":0},{"$f":"+'Stage 10'!L52","v":0},{"$f":"+'Stage 11'!K52","v":0},{"$f":"+'Stage 11'!L52","v":0},{"$f":"+'Stage 12'!K52","v":0},{"$f":"+'Stage 12'!L52","v":0},0,0,{"$f":"IF(ISBLANK('Shooter Information'!B54),,IF(SUM('Stage 1'!M52,'Stage 2'!M52,'Stage 3'!M52,'Stage 4'!M52,'Stage 5'!M52,'Stage 6'!M52,'Stage 7'!M52,'Stage 8'!M52,'Stage 9'!M52,'Stage 10'!M52,'Stage 11'!M52,'Stage 12'!M52)=0,\"Yes\",\"No\"))","v":0},{"$f":"IF(ISBLANK('Shooter Information'!B54),,IF(AK53>=2,\"No\",\"Yes\"))","v":0},99999,99999,{"$f":"IF(ISBLANK('Shooter Information'!C54),\"ZZZZZZZZZZ\",C53)","v":"ZZZZZZZZZZ"},{"$f":"CELL(\"row\",'Shooter Information'!B54)","v":54},{"$f":"SUM('Stage 1'!I52,'Stage 2'!I52,'Stage 3'!I52,'Stage 4'!I52,'Stage 5'!I52,'Stage 6'!I52,'Stage 7'!I52,'Stage 8'!I52,'Stage 9'!I52,'Stage 10'!I52,'Stage 11'!I52,'Stage 12'!I52)","v":0}]
[{"$f":"IF(AF54=\"Yes\",IF('Shooter Information'!$C$2=\"R\",(SUMPRODUCT(--(AD54>$AD$5:$AD$79),--(\"Yes\"=$AF$5:$AF$79))+1),(SUMPRODUCT(--(AC54>$AC$5:$AC$79),--(\"Yes\"=$AF$5:$AF$79))+1)),0)","v":0},{"$f":"'Shooter Information'!B55","v":0},{"$f":"'Shooter Information'!C55","v":0},{"$f":"IF(AF54=\"Yes\",IF('Shooter Information'!$C$2=\"R\",(SUMPRODUCT(--(C54=$C$5:$C$79),--(AD54>$AD$5:$AD$79),--(\"Yes\"=$AF$5:$AF$79))+1),(SUMPRODUCT(--(C54=$C$5:$C$79),--(AC54>$AC$5:$AC$79),--(\"Yes\"=$AF$5:$AF$79))+1)),0)","v":0},{"$f":"+'Stage 1'!K53","v":0},{"$f":"+'Stage 1'!L53","v":0},{"$f":"+'Stage 2'!K53","v":0},{"$f":"+'Stage 2'!L53","v":0},{"$f":"+'Stage 3'!K53","v":0},{"$f":"+'Stage 3'!L53","v":0},{"$f":"+'Stage 4'!K53","v":0},{"$f":"+'Stage 4'!L53","v":0},{"$f":"+'Stage 5'!K53","v":0},{"$f":"+'Stage 5'!L53","v":0},{"$f":"+'Stage 6'!K53","v":0},{"$f":"+'Stage 6'!L53","v":0},{"$f":"+'Stage 7'!K53","v":0},{"$f":"+'Stage 7'!L53","v":0},{"$f":"+'Stage 8'!K53","v":0},{"$f":"+'Stage 8'!L53","v":0},{"$f":"+'Stage 9'!K53","v":0},{"$f":"+'Stage 9'!L53","v":0},{"$f":"+'Stage 10'!K53","v":0},{"$f":"+'Stage 10'!L53","v":0},{"$f":"+'Stage 11'!K53","v":0},{"$f":"+'Stage 11'!L53","v":0},{"$f":"+'Stage 12'!K53","v":0},{"$f":"+'Stage 12'!L53","v":0},0,0,{"$f":"IF(ISBLANK('Shooter Information'!B55),,IF(SUM('Stage 1'!M53,'Stage 2'!M53,'Stage 3'!M53,'Stage 4'!M53,'Stage 5'!M53,'Stage 6'!M53,'Stage 7'!M53,'Stage 8'!M53,'Stage 9'!M53,'Stage 10'!M53,'Stage 11'!M53,'Stage 12'!M53)=0,\"Yes\",\"No\"))","v":0},{"$f":"IF(ISBLANK('Shooter Information'!B55),,IF(AK54>=2,\"No\",\"Yes\"))","v":0},99999,99999,{"$f":"IF(ISBLANK('Shooter Information'!C55),\"ZZZZZZZZZZ\",C54)","v":"ZZZZZZZZZZ"},{"$f":"CELL(\"row\",'Shooter Information'!B55)","v":55},{"$f":"SUM('Stage 1'!I53,'Stage 2'!I53,'Stage 3'!I53,'Stage 4'!I53,'Stage 5'!I53,'Stage 6'!I53,'Stage 7'!I53,'Stage 8'!I53,'Stage 9'!I53,'Stage 10'!I53,'Stage 11'!I53,'Stage 12'!I53)","v":0}]
[{"$f":"IF(AF55=\"Yes\",IF('Shooter Information'!$C$2=\"R\",(SUMPRODUCT(--(AD55>$AD$5:$AD$79),--(\"Yes\"=$AF$5:$AF$79))+1),(SUMPRODUCT(--(AC55>$AC$5:$AC$79),--(\"Yes\"=$AF$5:$AF$79))+1)),0)","v":0},{"$f":"'Shooter Information'!B56","v":0},{"$f":"'Shooter Information'!C56","v":0},{"$f":"IF(AF55=\"Yes\",IF('Shooter Information'!$C$2=\"R\",(SUMPRODUCT(--(C55=$C$5:$C$79),--(AD55>$AD$5:$AD$79),--(\"Yes\"=$AF$5:$AF$79))+1),(SUMPRODUCT(--(C55=$C$5:$C$79),--(AC55>$AC$5:$AC$79),--(\"Yes\"=$AF$5:$AF$79))+1)),0)","v":0},{"$f":"+'Stage 1'!K54","v":0},{"$f":"+'Stage 1'!L54","v":0},{"$f":"+'Stage 2'!K54","v":0},{"$f":"+'Stage 2'!L54","v":0},{"$f":"+'Stage 3'!K54","v":0},{"$f":"+'Stage 3'!L54","v":0},{"$f":"+'Stage 4'!K54","v":0},{"$f":"+'Stage 4'!L54","v":0},{"$f":"+'Stage 5'!K54","v":0},{"$f":"+'Stage 5'!L54","v":0},{"$f":"+'Stage 6'!K54","v":0},{"$f":"+'Stage 6'!L54","v":0},{"$f":"+'Stage 7'!K54","v":0},{"$f":"+'Stage 7'!L54","v":0},{"$f":"+'Stage 8'!K54","v":0},{"$f":"+'Stage 8'!L54","v":0},{"$f":"+'Stage 9'!K54","v":0},{"$f":"+'Stage 9'!L54","v":0},{"$f":"+'Stage 10'!K54","v":0},{"$f":"+'Stage 10'!L54","v":0},{"$f":"+'Stage 11'!K54","v":0},{"$f":"+'Stage 11'!L54","v":0},{"$f":"+'Stage 12'!K54","v":0},{"$f":"+'Stage 12'!L54","v":0},0,0,{"$f":"IF(ISBLANK('Shooter Information'!B56),,IF(SUM('Stage 1'!M54,'Stage 2'!M54,'Stage 3'!M54,'Stage 4'!M54,'Stage 5'!M54,'Stage 6'!M54,'Stage 7'!M54,'Stage 8'!M54,'Stage 9'!M54,'Stage 10'!M54,'Stage 11'!M54,'Stage 12'!M54)=0,\"Yes\",\"No\"))","v":0},{"$f":"IF(ISBLANK('Shooter Information'!B56),,IF(AK55>=2,\"No\",\"Yes\"))","v":0},99999,99999,{"$f":"IF(ISBLANK('Shooter Information'!C56),\"ZZZZZZZZZZ\",C55)","v":"ZZZZZZZZZZ"},{"$f":"CELL(\"row\",'Shooter Information'!B56)","v":56},{"$f":"SUM('Stage 1'!I54,'Stage 2'!I54,'Stage 3'!I54,'Stage 4'!I54,'Stage 5'!I54,'Stage 6'!I54,'Stage 7'!I54,'Stage 8'!I54,'Stage 9'!I54,'Stage 10'!I54,'Stage 11'!I54,'Stage 12'!I54)","v":0}]
[{"$f":"IF(AF56=\"Yes\",IF('Shooter Information'!$C$2=\"R\",(SUMPRODUCT(--(AD56>$AD$5:$AD$79),--(\"Yes\"=$AF$5:$AF$79))+1),(SUMPRODUCT(--(AC56>$AC$5:$AC$79),--(\"Yes\"=$AF$5:$AF$79))+1)),0)","v":0},{"$f":"'Shooter Information'!B57","v":0},{"$f":"'Shooter Information'!C57","v":0},{"$f":"IF(AF56=\"Yes\",IF('Shooter Information'!$C$2=\"R\",(SUMPRODUCT(--(C56=$C$5:$C$79),--(AD56>$AD$5:$AD$79),--(\"Yes\"=$AF$5:$AF$79))+1),(SUMPRODUCT(--(C56=$C$5:$C$79),--(AC56>$AC$5:$AC$79),--(\"Yes\"=$AF$5:$AF$79))+1)),0)","v":0},{"$f":"+'Stage 1'!K55","v":0},{"$f":"+'Stage 1'!L55","v":0},{"$f":"+'Stage 2'!K55","v":0},{"$f":"+'Stage 2'!L55","v":0},{"$f":"+'Stage 3'!K55","v":0},{"$f":"+'Stage 3'!L55","v":0},{"$f":"+'Stage 4'!K55","v":0},{"$f":"+'Stage 4'!L55","v":0},{"$f":"+'Stage 5'!K55","v":0},{"$f":"+'Stage 5'!L55","v":0},{"$f":"+'Stage 6'!K55","v":0},{"$f":"+'Stage 6'!L55","v":0},{"$f":"+'Stage 7'!K55","v":0},{"$f":"+'Stage 7'!L55","v":0},{"$f":"+'Stage 8'!K55","v":0},{"$f":"+'Stage 8'!L55","v":0},{"$f":"+'Stage 9'!K55","v":0},{"$f":"+'Stage 9'!L55","v":0},{"$f":"+'Stage 10'!K55","v":0},{"$f":"+'Stage 10'!L55","v":0},{"$f":"+'Stage 11'!K55","v":0},{"$f":"+'Stage 11'!L55","v":0},{"$f":"+'Stage 12'!K55","v":0},{"$f":"+'Stage 12'!L55","v":0},0,0,{"$f":"IF(ISBLANK('Shooter Information'!B57),,IF(SUM('Stage 1'!M55,'Stage 2'!M55,'Stage 3'!M55,'Stage 4'!M55,'Stage 5'!M55,'Stage 6'!M55,'Stage 7'!M55,'Stage 8'!M55,'Stage 9'!M55,'Stage 10'!M55,'Stage 11'!M55,'Stage 12'!M55)=0,\"Yes\",\"No\"))","v":0},{"$f":"IF(ISBLANK('Shooter Information'!B57),,IF(AK56>=2,\"No\",\"Yes\"))","v":0},99999,99999,{"$f":"IF(ISBLANK('Shooter Information'!C57),\"ZZZZZZZZZZ\",C56)","v":"ZZZZZZZZZZ"},{"$f":"CELL(\"row\",'Shooter Information'!B57)","v":57},{"$f":"SUM('Stage 1'!I55,'Stage 2'!I55,'Stage 3'!I55,'Stage 4'!I55,'Stage 5'!I55,'Stage 6'!I55,'Stage 7'!I55,'Stage 8'!I55,'Stage 9'!I55,'Stage 10'!I55,'Stage 11'!I55,'Stage 12'!I55)","v":0}]
[{"$f":"IF(AF57=\"Yes\",IF('Shooter Information'!$C$2=\"R\",(SUMPRODUCT(--(AD57>$AD$5:$AD$79),--(\"Yes\"=$AF$5:$AF$79))+1),(SUMPRODUCT(--(AC57>$AC$5:$AC$79),--(\"Yes\"=$AF$5:$AF$79))+1)),0)","v":0},{"$f":"'Shooter Information'!B58","v":0},{"$f":"'Shooter Information'!C58","v":0},{"$f":"IF(AF57=\"Yes\",IF('Shooter Information'!$C$2=\"R\",(SUMPRODUCT(--(C57=$C$5:$C$79),--(AD57>$AD$5:$AD$79),--(\"Yes\"=$AF$5:$AF$79))+1),(SUMPRODUCT(--(C57=$C$5:$C$79),--(AC57>$AC$5:$AC$79),--(\"Yes\"=$AF$5:$AF$79))+1)),0)","v":0},{"$f":"+'Stage 1'!K56","v":0},{"$f":"+'Stage 1'!L56","v":0},{"$f":"+'Stage 2'!K56","v":0},{"$f":"+'Stage 2'!L56","v":0},{"$f":"+'Stage 3'!K56","v":0},{"$f":"+'Stage 3'!L56","v":0},{"$f":"+'Stage 4'!K56","v":0},{"$f":"+'Stage 4'!L56","v":0},{"$f":"+'Stage 5'!K56","v":0},{"$f":"+'Stage 5'!L56","v":0},{"$f":"+'Stage 6'!K56","v":0},{"$f":"+'Stage 6'!L56","v":0},{"$f":"+'Stage 7'!K56","v":0},{"$f":"+'Stage 7'!L56","v":0},{"$f":"+'Stage 8'!K56","v":0},{"$f":"+'Stage 8'!L56","v":0},{"$f":"+'Stage 9'!K56","v":0},{"$f":"+'Stage 9'!L56","v":0},{"$f":"+'Stage 10'!K56","v":0},{"$f":"+'Stage 10'!L56","v":0},{"$f":"+'Stage 11'!K56","v":0},{"$f":"+'Stage 11'!L56","v":0},{"$f":"+'Stage 12'!K56","v":0},{"$f":"+'Stage 12'!L56","v":0},0,0,{"$f":"IF(ISBLANK('Shooter Information'!B58),,IF(SUM('Stage 1'!M56,'Stage 2'!M56,'Stage 3'!M56,'Stage 4'!M56,'Stage 5'!M56,'Stage 6'!M56,'Stage 7'!M56,'Stage 8'!M56,'Stage 9'!M56,'Stage 10'!M56,'Stage 11'!M56,'Stage 12'!M56)=0,\"Yes\",\"No\"))","v":0},{"$f":"IF(ISBLANK('Shooter Information'!B58),,IF(AK57>=2,\"No\",\"Yes\"))","v":0},99999,99999,{"$f":"IF(ISBLANK('Shooter Information'!C58),\"ZZZZZZZZZZ\",C57)","v":"ZZZZZZZZZZ"},{"$f":"CELL(\"row\",'Shooter Information'!B58)","v":58},{"$f":"SUM('Stage 1'!I56,'Stage 2'!I56,'Stage 3'!I56,'Stage 4'!I56,'Stage 5'!I56,'Stage 6'!I56,'Stage 7'!I56,'Stage 8'!I56,'Stage 9'!I56,'Stage 10'!I56,'Stage 11'!I56,'Stage 12'!I56)","v":0}]
[{"$f":"IF(AF58=\"Yes\",IF('Shooter Information'!$C$2=\"R\",(SUMPRODUCT(--(AD58>$AD$5:$AD$79),--(\"Yes\"=$AF$5:$AF$79))+1),(SUMPRODUCT(--(AC58>$AC$5:$AC$79),--(\"Yes\"=$AF$5:$AF$79))+1)),0)","v":0},{"$f":"'Shooter Information'!B59","v":0},{"$f":"'Shooter Information'!C59","v":0},{"$f":"IF(AF58=\"Yes\",IF('Shooter Information'!$C$2=\"R\",(SUMPRODUCT(--(C58=$C$5:$C$79),--(AD58>$AD$5:$AD$79),--(\"Yes\"=$AF$5:$AF$79))+1),(SUMPRODUCT(--(C58=$C$5:$C$79),--(AC58>$AC$5:$AC$79),--(\"Yes\"=$AF$5:$AF$79))+1)),0)","v":0},{"$f":"+'Stage 1'!K57","v":0},{"$f":"+'Stage 1'!L57","v":0},{"$f":"+'Stage 2'!K57","v":0},{"$f":"+'Stage 2'!L57","v":0},{"$f":"+'Stage 3'!K57","v":0},{"$f":"+'Stage 3'!L57","v":0},{"$f":"+'Stage 4'!K57","v":0},{"$f":"+'Stage 4'!L57","v":0},{"$f":"+'Stage 5'!K57","v":0},{"$f":"+'Stage 5'!L57","v":0},{"$f":"+'Stage 6'!K57","v":0},{"$f":"+'Stage 6'!L57","v":0},{"$f":"+'Stage 7'!K57","v":0},{"$f":"+'Stage 7'!L57","v":0},{"$f":"+'Stage 8'!K57","v":0},{"$f":"+'Stage 8'!L57","v":0},{"$f":"+'Stage 9'!K57","v":0},{"$f":"+'Stage 9'!L57","v":0},{"$f":"+'Stage 10'!K57","v":0},{"$f":"+'Stage 10'!L57","v":0},{"$f":"+'Stage 11'!K57","v":0},{"$f":"+'Stage 11'!L57","v":0},{"$f":"+'Stage 12'!K57","v":0},{"$f":"+'Stage 12'!L57","v":0},0,0,{"$f":"IF(ISBLANK('Shooter Information'!B59),,IF(SUM('Stage 1'!M57,'Stage 2'!M57,'Stage 3'!M57,'Stage 4'!M57,'Stage 5'!M57,'Stage 6'!M57,'Stage 7'!M57,'Stage 8'!M57,'Stage 9'!M57,'Stage 10'!M57,'Stage 11'!M57,'Stage 12'!M57)=0,\"Yes\",\"No\"))","v":0},{"$f":"IF(ISBLANK('Shooter Information'!B59),,IF(AK58>=2,\"No\",\"Yes\"))","v":0},99999,99999,{"$f":"IF(ISBLANK('Shooter Information'!C59),\"ZZZZZZZZZZ\",C58)","v":"ZZZZZZZZZZ"},{"$f":"CELL(\"row\",'Shooter Information'!B59)","v":59},{"$f":"SUM('Stage 1'!I57,'Stage 2'!I57,'Stage 3'!I57,'Stage 4'!I57,'Stage 5'!I57,'Stage 6'!I57,'Stage 7'!I57,'Stage 8'!I57,'Stage 9'!I57,'Stage 10'!I57,'Stage 11'!I57,'Stage 12'!I57)","v":0}]
[{"$f":"IF(AF59=\"Yes\",IF('Shooter Information'!$C$2=\"R\",(SUMPRODUCT(--(AD59>$AD$5:$AD$79),--(\"Yes\"=$AF$5:$AF$79))+1),(SUMPRODUCT(--(AC59>$AC$5:$AC$79),--(\"Yes\"=$AF$5:$AF$79))+1)),0)","v":0},{"$f":"'Shooter Information'!B60","v":0},{"$f":"'Shooter Information'!C60","v":0},{"$f":"IF(AF59=\"Yes\",IF('Shooter Information'!$C$2=\"R\",(SUMPRODUCT(--(C59=$C$5:$C$79),--(AD59>$AD$5:$AD$79),--(\"Yes\"=$AF$5:$AF$79))+1),(SUMPRODUCT(--(C59=$C$5:$C$79),--(AC59>$AC$5:$AC$79),--(\"Yes\"=$AF$5:$AF$79))+1)),0)","v":0},{"$f":"+'Stage 1'!K58","v":0},{"$f":"+'Stage 1'!L58","v":0},{"$f":"+'Stage 2'!K58","v":0},{"$f":"+'Stage 2'!L58","v":0},{"$f":"+'Stage 3'!K58","v":0},{"$f":"+'Stage 3'!L58","v":0},{"$f":"+'Stage 4'!K58","v":0},{"$f":"+'Stage 4'!L58","v":0},{"$f":"+'Stage 5'!K58","v":0},{"$f":"+'Stage 5'!L58","v":0},{"$f":"+'Stage 6'!K58","v":0},{"$f":"+'Stage 6'!L58","v":0},{"$f":"+'Stage 7'!K58","v":0},{"$f":"+'Stage 7'!L58","v":0},{"$f":"+'Stage 8'!K58","v":0},{"$f":"+'Stage 8'!L58","v":0},{"$f":"+'Stage 9'!K58","v":0},{"$f":"+'Stage 9'!L58","v":0},{"$f":"+'Stage 10'!K58","v":0},{"$f":"+'Stage 10'!L58","v":0},{"$f":"+'Stage 11'!K58","v":0},{"$f":"+'Stage 11'!L58","v":0},{"$f":"+'Stage 12'!K58","v":0},{"$f":"+'Stage 12'!L58","v":0},0,0,{"$f":"IF(ISBLANK('Shooter Information'!B60),,IF(SUM('Stage 1'!M58,'Stage 2'!M58,'Stage 3'!M58,'Stage 4'!M58,'Stage 5'!M58,'Stage 6'!M58,'Stage 7'!M58,'Stage 8'!M58,'Stage 9'!M58,'Stage 10'!M58,'Stage 11'!M58,'Stage 12'!M58)=0,\"Yes\",\"No\"))","v":0},{"$f":"IF(ISBLANK('Shooter Information'!B60),,IF(AK59>=2,\"No\",\"Yes\"))","v":0},99999,99999,{"$f":"IF(ISBLANK('Shooter Information'!C60),\"ZZZZZZZZZZ\",C59)","v":"ZZZZZZZZZZ"},{"$f":"CELL(\"row\",'Shooter Information'!B60)","v":60},{"$f":"SUM('Stage 1'!I58,'Stage 2'!I58,'Stage 3'!I58,'Stage 4'!I58,'Stage 5'!I58,'Stage 6'!I58,'Stage 7'!I58,'Stage 8'!I58,'Stage 9'!I58,'Stage 10'!I58,'Stage 11'!I58,'Stage 12'!I58)","v":0}]
[{"$f":"IF(AF60=\"Yes\",IF('Shooter Information'!$C$2=\"R\",(SUMPRODUCT(--(AD60>$AD$5:$AD$79),--(\"Yes\"=$AF$5:$AF$79))+1),(SUMPRODUCT(--(AC60>$AC$5:$AC$79),--(\"Yes\"=$AF$5:$AF$79))+1)),0)","v":0},{"$f":"'Shooter Information'!B61","v":0},{"$f":"'Shooter Information'!C61","v":0},{"$f":"IF(AF60=\"Yes\",IF('Shooter Information'!$C$2=\"R\",(SUMPRODUCT(--(C60=$C$5:$C$79),--(AD60>$AD$5:$AD$79),--(\"Yes\"=$AF$5:$AF$79))+1),(SUMPRODUCT(--(C60=$C$5:$C$79),--(AC60>$AC$5:$AC$79),--(\"Yes\"=$AF$5:$AF$79))+1)),0)","v":0},{"$f":"+'Stage 1'!K59","v":0},{"$f":"+'Stage 1'!L59","v":0},{"$f":"+'Stage 2'!K59","v":0},{"$f":"+'Stage 2'!L59","v":0},{"$f":"+'Stage 3'!K59","v":0},{"$f":"+'Stage 3'!L59","v":0},{"$f":"+'Stage 4'!K59","v":0},{"$f":"+'Stage 4'!L59","v":0},{"$f":"+'Stage 5'!K59","v":0},{"$f":"+'Stage 5'!L59","v":0},{"$f":"+'Stage 6'!K59","v":0},{"$f":"+'Stage 6'!L59","v":0},{"$f":"+'Stage 7'!K59","v":0},{"$f":"+'Stage 7'!L59","v":0},{"$f":"+'Stage 8'!K59","v":0},{"$f":"+'Stage 8'!L59","v":0},{"$f":"+'Stage 9'!K59","v":0},{"$f":"+'Stage 9'!L59","v":0},{"$f":"+'Stage 10'!K59","v":0},{"$f":"+'Stage 10'!L59","v":0},{"$f":"+'Stage 11'!K59","v":0},{"$f":"+'Stage 11'!L59","v":0},{"$f":"+'Stage 12'!K59","v":0},{"$f":"+'Stage 12'!L59","v":0},0,0,{"$f":"IF(ISBLANK('Shooter Information'!B61),,IF(SUM('Stage 1'!M59,'Stage 2'!M59,'Stage 3'!M59,'Stage 4'!M59,'Stage 5'!M59,'Stage 6'!M59,'Stage 7'!M59,'Stage 8'!M59,'Stage 9'!M59,'Stage 10'!M59,'Stage 11'!M59,'Stage 12'!M59)=0,\"Yes\",\"No\"))","v":0},{"$f":"IF(ISBLANK('Shooter Information'!B61),,IF(AK60>=2,\"No\",\"Yes\"))","v":0},99999,99999,{"$f":"IF(ISBLANK('Shooter Information'!C61),\"ZZZZZZZZZZ\",C60)","v":"ZZZZZZZZZZ"},{"$f":"CELL(\"row\",'Shooter Information'!B61)","v":61},{"$f":"SUM('Stage 1'!I59,'Stage 2'!I59,'Stage 3'!I59,'Stage 4'!I59,'Stage 5'!I59,'Stage 6'!I59,'Stage 7'!I59,'Stage 8'!I59,'Stage 9'!I59,'Stage 10'!I59,'Stage 11'!I59,'Stage 12'!I59)","v":0}]
[{"$f":"IF(AF61=\"Yes\",IF('Shooter Information'!$C$2=\"R\",(SUMPRODUCT(--(AD61>$AD$5:$AD$79),--(\"Yes\"=$AF$5:$AF$79))+1),(SUMPRODUCT(--(AC61>$AC$5:$AC$79),--(\"Yes\"=$AF$5:$AF$79))+1)),0)","v":0},{"$f":"'Shooter Information'!B62","v":0},{"$f":"'Shooter Information'!C62","v":0},{"$f":"IF(AF61=\"Yes\",IF('Shooter Information'!$C$2=\"R\",(SUMPRODUCT(--(C61=$C$5:$C$79),--(AD61>$AD$5:$AD$79),--(\"Yes\"=$AF$5:$AF$79))+1),(SUMPRODUCT(--(C61=$C$5:$C$79),--(AC61>$AC$5:$AC$79),--(\"Yes\"=$AF$5:$AF$79))+1)),0)","v":0},{"$f":"+'Stage 1'!K60","v":0},{"$f":"+'Stage 1'!L60","v":0},{"$f":"+'Stage 2'!K60","v":0},{"$f":"+'Stage 2'!L60","v":0},{"$f":"+'Stage 3'!K60","v":0},{"$f":"+'Stage 3'!L60","v":0},{"$f":"+'Stage 4'!K60","v":0},{"$f":"+'Stage 4'!L60","v":0},{"$f":"+'Stage 5'!K60","v":0},{"$f":"+'Stage 5'!L60","v":0},{"$f":"+'Stage 6'!K60","v":0},{"$f":"+'Stage 6'!L60","v":0},{"$f":"+'Stage 7'!K60","v":0},{"$f":"+'Stage 7'!L60","v":0},{"$f":"+'Stage 8'!K60","v":0},{"$f":"+'Stage 8'!L60","v":0},{"$f":"+'Stage 9'!K60","v":0},{"$f":"+'Stage 9'!L60","v":0},{"$f":"+'Stage 10'!K60","v":0},{"$f":"+'Stage 10'!L60","v":0},{"$f":"+'Stage 11'!K60","v":0},{"$f":"+'Stage 11'!L60","v":0},{"$f":"+'Stage 12'!K60","v":0},{"$f":"+'Stage 12'!L60","v":0},0,0,{"$f":"IF(ISBLANK('Shooter Information'!B62),,IF(SUM('Stage 1'!M60,'Stage 2'!M60,'Stage 3'!M60,'Stage 4'!M60,'Stage 5'!M60,'Stage 6'!M60,'Stage 7'!M60,'Stage 8'!M60,'Stage 9'!M60,'Stage 10'!M60,'Stage 11'!M60,'Stage 12'!M60)=0,\"Yes\",\"No\"))","v":0},{"$f":"IF(ISBLANK('Shooter Information'!B62),,IF(AK61>=2,\"No\",\"Yes\"))","v":0},99999,99999,{"$f":"IF(ISBLANK('Shooter Information'!C62),\"ZZZZZZZZZZ\",C61)","v":"ZZZZZZZZZZ"},{"$f":"CELL(\"row\",'Shooter Information'!B62)","v":62},{"$f":"SUM('Stage 1'!I60,'Stage 2'!I60,'Stage 3'!I60,'Stage 4'!I60,'Stage 5'!I60,'Stage 6'!I60,'Stage 7'!I60,'Stage 8'!I60,'Stage 9'!I60,'Stage 10'!I60,'Stage 11'!I60,'Stage 12'!I60)","v":0}]
[{"$f":"IF(AF62=\"Yes\",IF('Shooter Information'!$C$2=\"R\",(SUMPRODUCT(--(AD62>$AD$5:$AD$79),--(\"Yes\"=$AF$5:$AF$79))+1),(SUMPRODUCT(--(AC62>$AC$5:$AC$79),--(\"Yes\"=$AF$5:$AF$79))+1)),0)","v":0},{"$f":"'Shooter Information'!B63","v":0},{"$f":"'Shooter Information'!C63","v":0},{"$f":"IF(AF62=\"Yes\",IF('Shooter Information'!$C$2=\"R\",(SUMPRODUCT(--(C62=$C$5:$C$79),--(AD62>$AD$5:$AD$79),--(\"Yes\"=$AF$5:$AF$79))+1),(SUMPRODUCT(--(C62=$C$5:$C$79),--(AC62>$AC$5:$AC$79),--(\"Yes\"=$AF$5:$AF$79))+1)),0)","v":0},{"$f":"+'Stage 1'!K61","v":0},{"$f":"+'Stage 1'!L61","v":0},{"$f":"+'Stage 2'!K61","v":0},{"$f":"+'Stage 2'!L61","v":0},{"$f":"+'Stage 3'!K61","v":0},{"$f":"+'Stage 3'!L61","v":0},{"$f":"+'Stage 4'!K61","v":0},{"$f":"+'Stage 4'!L61","v":0},{"$f":"+'Stage 5'!K61","v":0},{"$f":"+'Stage 5'!L61","v":0},{"$f":"+'Stage 6'!K61","v":0},{"$f":"+'Stage 6'!L61","v":0},{"$f":"+'Stage 7'!K61","v":0},{"$f":"+'Stage 7'!L61","v":0},{"$f":"+'Stage 8'!K61","v":0},{"$f":"+'Stage 8'!L61","v":0},{"$f":"+'Stage 9'!K61","v":0},{"$f":"+'Stage 9'!L61","v":0},{"$f":"+'Stage 10'!K61","v":0},{"$f":"+'Stage 10'!L61","v":0},{"$f":"+'Stage 11'!K61","v":0},{"$f":"+'Stage 11'!L61","v":0},{"$f":"+'Stage 12'!K61","v":0},{"$f":"+'Stage 12'!L61","v":0},0,0,{"$f":"IF(ISBLANK('Shooter Information'!B63),,IF(SUM('Stage 1'!M61,'Stage 2'!M61,'Stage 3'!M61,'Stage 4'!M61,'Stage 5'!M61,'Stage 6'!M61,'Stage 7'!M61,'Stage 8'!M61,'Stage 9'!M61,'Stage 10'!M61,'Stage 11'!M61,'Stage 12'!M61)=0,\"Yes\",\"No\"))","v":0},{"$f":"IF(ISBLANK('Shooter Information'!B63),,IF(AK62>=2,\"No\",\"Yes\"))","v":0},99999,99999,{"$f":"IF(ISBLANK('Shooter Information'!C63),\"ZZZZZZZZZZ\",C62)","v":"ZZZZZZZZZZ"},{"$f":"CELL(\"row\",'Shooter Information'!B63)","v":63},{"$f":"SUM('Stage 1'!I61,'Stage 2'!I61,'Stage 3'!I61,'Stage 4'!I61,'Stage 5'!I61,'Stage 6'!I61,'Stage 7'!I61,'Stage 8'!I61,'Stage 9'!I61,'Stage 10'!I61,'Stage 11'!I61,'Stage 12'!I61)","v":0}]
[{"$f":"IF(AF63=\"Yes\",IF('Shooter Information'!$C$2=\"R\",(SUMPRODUCT(--(AD63>$AD$5:$AD$79),--(\"Yes\"=$AF$5:$AF$79))+1),(SUMPRODUCT(--(AC63>$AC$5:$AC$79),--(\"Yes\"=$AF$5:$AF$79))+1)),0)","v":0},{"$f":"'Shooter Information'!B64","v":0},{"$f":"'Shooter Information'!C64","v":0},{"$f":"IF(AF63=\"Yes\",IF('Shooter Information'!$C$2=\"R\",(SUMPRODUCT(--(C63=$C$5:$C$79),--(AD63>$AD$5:$AD$79),--(\"Yes\"=$AF$5:$AF$79))+1),(SUMPRODUCT(--(C63=$C$5:$C$79),--(AC63>$AC$5:$AC$79),--(\"Yes\"=$AF$5:$AF$79))+1)),0)","v":0},{"$f":"+'Stage 1'!K62","v":0},{"$f":"+'Stage 1'!L62","v":0},{"$f":"+'Stage 2'!K62","v":0},{"$f":"+'Stage 2'!L62","v":0},{"$f":"+'Stage 3'!K62","v":0},{"$f":"+'Stage 3'!L62","v":0},{"$f":"+'Stage 4'!K62","v":0},{"$f":"+'Stage 4'!L62","v":0},{"$f":"+'Stage 5'!K62","v":0},{"$f":"+'Stage 5'!L62","v":0},{"$f":"+'Stage 6'!K62","v":0},{"$f":"+'Stage 6'!L62","v":0},{"$f":"+'Stage 7'!K62","v":0},{"$f":"+'Stage 7'!L62","v":0},{"$f":"+'Stage 8'!K62","v":0},{"$f":"+'Stage 8'!L62","v":0},{"$f":"+'Stage 9'!K62","v":0},{"$f":"+'Stage 9'!L62","v":0},{"$f":"+'Stage 10'!K62","v":0},{"$f":"+'Stage 10'!L62","v":0},{"$f":"+'Stage 11'!K62","v":0},{"$f":"+'Stage 11'!L62","v":0},{"$f":"+'Stage 12'!K62","v":0},{"$f":"+'Stage 12'!L62","v":0},0,0,{"$f":"IF(ISBLANK('Shooter Information'!B64),,IF(SUM('Stage 1'!M62,'Stage 2'!M62,'Stage 3'!M62,'Stage 4'!M62,'Stage 5'!M62,'Stage 6'!M62,'Stage 7'!M62,'Stage 8'!M62,'Stage 9'!M62,'Stage 10'!M62,'Stage 11'!M62,'Stage 12'!M62)=0,\"Yes\",\"No\"))","v":0},{"$f":"IF(ISBLANK('Shooter Information'!B64),,IF(AK63>=2,\"No\",\"Yes\"))","v":0},99999,99999,{"$f":"IF(ISBLANK('Shooter Information'!C64),\"ZZZZZZZZZZ\",C63)","v":"ZZZZZZZZZZ"},{"$f":"CELL(\"row\",'Shooter Information'!B64)","v":64},{"$f":"SUM('Stage 1'!I62,'Stage 2'!I62,'Stage 3'!I62,'Stage 4'!I62,'Stage 5'!I62,'Stage 6'!I62,'Stage 7'!I62,'Stage 8'!I62,'Stage 9'!I62,'Stage 10'!I62,'Stage 11'!I62,'Stage 12'!I62)","v":0}]
[{"$f":"IF(AF64=\"Yes\",IF('Shooter Information'!$C$2=\"R\",(SUMPRODUCT(--(AD64>$AD$5:$AD$79),--(\"Yes\"=$AF$5:$AF$79))+1),(SUMPRODUCT(--(AC64>$AC$5:$AC$79),--(\"Yes\"=$AF$5:$AF$79))+1)),0)","v":0},{"$f":"'Shooter Information'!B65","v":0},{"$f":"'Shooter Information'!C65","v":0},{"$f":"IF(AF64=\"Yes\",IF('Shooter Information'!$C$2=\"R\",(SUMPRODUCT(--(C64=$C$5:$C$79),--(AD64>$AD$5:$AD$79),--(\"Yes\"=$AF$5:$AF$79))+1),(SUMPRODUCT(--(C64=$C$5:$C$79),--(AC64>$AC$5:$AC$79),--(\"Yes\"=$AF$5:$AF$79))+1)),0)","v":0},{"$f":"+'Stage 1'!K63","v":0},{"$f":"+'Stage 1'!L63","v":0},{"$f":"+'Stage 2'!K63","v":0},{"$f":"+'Stage 2'!L63","v":0},{"$f":"+'Stage 3'!K63","v":0},{"$f":"+'Stage 3'!L63","v":0},{"$f":"+'Stage 4'!K63","v":0},{"$f":"+'Stage 4'!L63","v":0},{"$f":"+'Stage 5'!K63","v":0},{"$f":"+'Stage 5'!L63","v":0},{"$f":"+'Stage 6'!K63","v":0},{"$f":"+'Stage 6'!L63","v":0},{"$f":"+'Stage 7'!K63","v":0},{"$f":"+'Stage 7'!L63","v":0},{"$f":"+'Stage 8'!K63","v":0},{"$f":"+'Stage 8'!L63","v":0},{"$f":"+'Stage 9'!K63","v":0},{"$f":"+'Stage 9'!L63","v":0},{"$f":"+'Stage 10'!K63","v":0},{"$f":"+'Stage 10'!L63","v":0},{"$f":"+'Stage 11'!K63","v":0},{"$f":"+'Stage 11'!L63","v":0},{"$f":"+'Stage 12'!K63","v":0},{"$f":"+'Stage 12'!L63","v":0},0,0,{"$f":"IF(ISBLANK('Shooter Information'!B65),,IF(SUM('Stage 1'!M63,'Stage 2'!M63,'Stage 3'!M63,'Stage 4'!M63,'Stage 5'!M63,'Stage 6'!M63,'Stage 7'!M63,'Stage 8'!M63,'Stage 9'!M63,'Stage 10'!M63,'Stage 11'!M63,'Stage 12'!M63)=0,\"Yes\",\"No\"))","v":0},{"$f":"IF(ISBLANK('Shooter Information'!B65),,IF(AK64>=2,\"No\",\"Yes\"))","v":0},99999,99999,{"$f":"IF(ISBLANK('Shooter Information'!C65),\"ZZZZZZZZZZ\",C64)","v":"ZZZZZZZZZZ"},{"$f":"CELL(\"row\",'Shooter Information'!B65)","v":65},{"$f":"SUM('Stage 1'!I63,'Stage 2'!I63,'Stage 3'!I63,'Stage 4'!I63,'Stage 5'!I63,'Stage 6'!I63,'Stage 7'!I63,'Stage 8'!I63,'Stage 9'!I63,'Stage 10'!I63,'Stage 11'!I63,'Stage 12'!I63)","v":0}]
[{"$f":"IF(AF65=\"Yes\",IF('Shooter Information'!$C$2=\"R\",(SUMPRODUCT(--(AD65>$AD$5:$AD$79),--(\"Yes\"=$AF$5:$AF$79))+1),(SUMPRODUCT(--(AC65>$AC$5:$AC$79),--(\"Yes\"=$AF$5:$AF$79))+1)),0)","v":0},{"$f":"'Shooter Information'!B66","v":0},{"$f":"'Shooter Information'!C66","v":0},{"$f":"IF(AF65=\"Yes\",IF('Shooter Information'!$C$2=\"R\",(SUMPRODUCT(--(C65=$C$5:$C$79),--(AD65>$AD$5:$AD$79),--(\"Yes\"=$AF$5:$AF$79))+1),(SUMPRODUCT(--(C65=$C$5:$C$79),--(AC65>$AC$5:$AC$79),--(\"Yes\"=$AF$5:$AF$79))+1)),0)","v":0},{"$f":"+'Stage 1'!K64","v":0},{"$f":"+'Stage 1'!L64","v":0},{"$f":"+'Stage 2'!K64","v":0},{"$f":"+'Stage 2'!L64","v":0},{"$f":"+'Stage 3'!K64","v":0},{"$f":"+'Stage 3'!L64","v":0},{"$f":"+'Stage 4'!K64","v":0},{"$f":"+'Stage 4'!L64","v":0},{"$f":"+'Stage 5'!K64","v":0},{"$f":"+'Stage 5'!L64","v":0},{"$f":"+'Stage 6'!K64","v":0},{"$f":"+'Stage 6'!L64","v":0},{"$f":"+'Stage 7'!K64","v":0},{"$f":"+'Stage 7'!L64","v":0},{"$f":"+'Stage 8'!K64","v":0},{"$f":"+'Stage 8'!L64","v":0},{"$f":"+'Stage 9'!K64","v":0},{"$f":"+'Stage 9'!L64","v":0},{"$f":"+'Stage 10'!K64","v":0},{"$f":"+'Stage 10'!L64","v":0},{"$f":"+'Stage 11'!K64","v":0},{"$f":"+'Stage 11'!L64","v":0},{"$f":"+'Stage 12'!K64","v":0},{"$f":"+'Stage 12'!L64","v":0},0,0,{"$f":"IF(ISBLANK('Shooter Information'!B66),,IF(SUM('Stage 1'!M64,'Stage 2'!M64,'Stage 3'!M64,'Stage 4'!M64,'Stage 5'!M64,'Stage 6'!M64,'Stage 7'!M64,'Stage 8'!M64,'Stage 9'!M64,'Stage 10'!M64,'Stage 11'!M64,'Stage 12'!M64)=0,\"Yes\",\"No\"))","v":0},{"$f":"IF(ISBLANK('Shooter Information'!B66),,IF(AK65>=2,\"No\",\"Yes\"))","v":0},99999,99999,{"$f":"IF(ISBLANK('Shooter Information'!C66),\"ZZZZZZZZZZ\",C65)","v":"ZZZZZZZZZZ"},{"$f":"CELL(\"row\",'Shooter Information'!B66)","v":66},{"$f":"SUM('Stage 1'!I64,'Stage 2'!I64,'Stage 3'!I64,'Stage 4'!I64,'Stage 5'!I64,'Stage 6'!I64,'Stage 7'!I64,'Stage 8'!I64,'Stage 9'!I64,'Stage 10'!I64,'Stage 11'!I64,'Stage 12'!I64)","v":0}]
[{"$f":"IF(AF66=\"Yes\",IF('Shooter Information'!$C$2=\"R\",(SUMPRODUCT(--(AD66>$AD$5:$AD$79),--(\"Yes\"=$AF$5:$AF$79))+1),(SUMPRODUCT(--(AC66>$AC$5:$AC$79),--(\"Yes\"=$AF$5:$AF$79))+1)),0)","v":0},{"$f":"'Shooter Information'!B67","v":0},{"$f":"'Shooter Information'!C67","v":0},{"$f":"IF(AF66=\"Yes\",IF('Shooter Information'!$C$2=\"R\",(SUMPRODUCT(--(C66=$C$5:$C$79),--(AD66>$AD$5:$AD$79),--(\"Yes\"=$AF$5:$AF$79))+1),(SUMPRODUCT(--(C66=$C$5:$C$79),--(AC66>$AC$5:$AC$79),--(\"Yes\"=$AF$5:$AF$79))+1)),0)","v":0},{"$f":"+'Stage 1'!K65","v":0},{"$f":"+'Stage 1'!L65","v":0},{"$f":"+'Stage 2'!K65","v":0},{"$f":"+'Stage 2'!L65","v":0},{"$f":"+'Stage 3'!K65","v":0},{"$f":"+'Stage 3'!L65","v":0},{"$f":"+'Stage 4'!K65","v":0},{"$f":"+'Stage 4'!L65","v":0},{"$f":"+'Stage 5'!K65","v":0},{"$f":"+'Stage 5'!L65","v":0},{"$f":"+'Stage 6'!K65","v":0},{"$f":"+'Stage 6'!L65","v":0},{"$f":"+'Stage 7'!K65","v":0},{"$f":"+'Stage 7'!L65","v":0},{"$f":"+'Stage 8'!K65","v":0},{"$f":"+'Stage 8'!L65","v":0},{"$f":"+'Stage 9'!K65","v":0},{"$f":"+'Stage 9'!L65","v":0},{"$f":"+'Stage 10'!K65","v":0},{"$f":"+'Stage 10'!L65","v":0},{"$f":"+'Stage 11'!K65","v":0},{"$f":"+'Stage 11'!L65","v":0},{"$f":"+'Stage 12'!K65","v":0},{"$f":"+'Stage 12'!L65","v":0},0,0,{"$f":"IF(ISBLANK('Shooter Information'!B67),,IF(SUM('Stage 1'!M65,'Stage 2'!M65,'Stage 3'!M65,'Stage 4'!M65,'Stage 5'!M65,'Stage 6'!M65,'Stage 7'!M65,'Stage 8'!M65,'Stage 9'!M65,'Stage 10'!M65,'Stage 11'!M65,'Stage 12'!M65)=0,\"Yes\",\"No\"))","v":0},{"$f":"IF(ISBLANK('Shooter Information'!B67),,IF(AK66>=2,\"No\",\"Yes\"))","v":0},99999,99999,{"$f":"IF(ISBLANK('Shooter Information'!C67),\"ZZZZZZZZZZ\",C66)","v":"ZZZZZZZZZZ"},{"$f":"CELL(\"row\",'Shooter Information'!B67)","v":67},{"$f":"SUM('Stage 1'!I65,'Stage 2'!I65,'Stage 3'!I65,'Stage 4'!I65,'Stage 5'!I65,'Stage 6'!I65,'Stage 7'!I65,'Stage 8'!I65,'Stage 9'!I65,'Stage 10'!I65,'Stage 11'!I65,'Stage 12'!I65)","v":0}]
[{"$f":"IF(AF67=\"Yes\",IF('Shooter Information'!$C$2=\"R\",(SUMPRODUCT(--(AD67>$AD$5:$AD$79),--(\"Yes\"=$AF$5:$AF$79))+1),(SUMPRODUCT(--(AC67>$AC$5:$AC$79),--(\"Yes\"=$AF$5:$AF$79))+1)),0)","v":0},{"$f":"'Shooter Information'!B68","v":0},{"$f":"'Shooter Information'!C68","v":0},{"$f":"IF(AF67=\"Yes\",IF('Shooter Information'!$C$2=\"R\",(SUMPRODUCT(--(C67=$C$5:$C$79),--(AD67>$AD$5:$AD$79),--(\"Yes\"=$AF$5:$AF$79))+1),(SUMPRODUCT(--(C67=$C$5:$C$79),--(AC67>$AC$5:$AC$79),--(\"Yes\"=$AF$5:$AF$79))+1)),0)","v":0},{"$f":"+'Stage 1'!K66","v":0},{"$f":"+'Stage 1'!L66","v":0},{"$f":"+'Stage 2'!K66","v":0},{"$f":"+'Stage 2'!L66","v":0},{"$f":"+'Stage 3'!K66","v":0},{"$f":"+'Stage 3'!L66","v":0},{"$f":"+'Stage 4'!K66","v":0},{"$f":"+'Stage 4'!L66","v":0},{"$f":"+'Stage 5'!K66","v":0},{"$f":"+'Stage 5'!L66","v":0},{"$f":"+'Stage 6'!K66","v":0},{"$f":"+'Stage 6'!L66","v":0},{"$f":"+'Stage 7'!K66","v":0},{"$f":"+'Stage 7'!L66","v":0},{"$f":"+'Stage 8'!K66","v":0},{"$f":"+'Stage 8'!L66","v":0},{"$f":"+'Stage 9'!K66","v":0},{"$f":"+'Stage 9'!L66","v":0},{"$f":"+'Stage 10'!K66","v":0},{"$f":"+'Stage 10'!L66","v":0},{"$f":"+'Stage 11'!K66","v":0},{"$f":"+'Stage 11'!L66","v":0},{"$f":"+'Stage 12'!K66","v":0},{"$f":"+'Stage 12'!L66","v":0},0,0,{"$f":"IF(ISBLANK('Shooter Information'!B68),,IF(SUM('Stage 1'!M66,'Stage 2'!M66,'Stage 3'!M66,'Stage 4'!M66,'Stage 5'!M66,'Stage 6'!M66,'Stage 7'!M66,'Stage 8'!M66,'Stage 9'!M66,'Stage 10'!M66,'Stage 11'!M66,'Stage 12'!M66)=0,\"Yes\",\"No\"))","v":0},{"$f":"IF(ISBLANK('Shooter Information'!B68),,IF(AK67>=2,\"No\",\"Yes\"))","v":0},99999,99999,{"$f":"IF(ISBLANK('Shooter Information'!C68),\"ZZZZZZZZZZ\",C67)","v":"ZZZZZZZZZZ"},{"$f":"CELL(\"row\",'Shooter Information'!B68)","v":68},{"$f":"SUM('Stage 1'!I66,'Stage 2'!I66,'Stage 3'!I66,'Stage 4'!I66,'Stage 5'!I66,'Stage 6'!I66,'Stage 7'!I66,'Stage 8'!I66,'Stage 9'!I66,'Stage 10'!I66,'Stage 11'!I66,'Stage 12'!I66)","v":0}]
[{"$f":"IF(AF68=\"Yes\",IF('Shooter Information'!$C$2=\"R\",(SUMPRODUCT(--(AD68>$AD$5:$AD$79),--(\"Yes\"=$AF$5:$AF$79))+1),(SUMPRODUCT(--(AC68>$AC$5:$AC$79),--(\"Yes\"=$AF$5:$AF$79))+1)),0)","v":0},{"$f":"'Shooter Information'!B69","v":0},{"$f":"'Shooter Information'!C69","v":0},{"$f":"IF(AF68=\"Yes\",IF('Shooter Information'!$C$2=\"R\",(SUMPRODUCT(--(C68=$C$5:$C$79),--(AD68>$AD$5:$AD$79),--(\"Yes\"=$AF$5:$AF$79))+1),(SUMPRODUCT(--(C68=$C$5:$C$79),--(AC68>$AC$5:$AC$79),--(\"Yes\"=$AF$5:$AF$79))+1)),0)","v":0},{"$f":"+'Stage 1'!K67","v":0},{"$f":"+'Stage 1'!L67","v":0},{"$f":"+'Stage 2'!K67","v":0},{"$f":"+'Stage 2'!L67","v":0},{"$f":"+'Stage 3'!K67","v":0},{"$f":"+'Stage 3'!L67","v":0},{"$f":"+'Stage 4'!K67","v":0},{"$f":"+'Stage 4'!L67","v":0},{"$f":"+'Stage 5'!K67","v":0},{"$f":"+'Stage 5'!L67","v":0},{"$f":"+'Stage 6'!K67","v":0},{"$f":"+'Stage 6'!L67","v":0},{"$f":"+'Stage 7'!K67","v":0},{"$f":"+'Stage 7'!L67","v":0},{"$f":"+'Stage 8'!K67","v":0},{"$f":"+'Stage 8'!L67","v":0},{"$f":"+'Stage 9'!K67","v":0},{"$f":"+'Stage 9'!L67","v":0},{"$f":"+'Stage 10'!K67","v":0},{"$f":"+'Stage 10'!L67","v":0},{"$f":"+'Stage 11'!K67","v":0},{"$f":"+'Stage 11'!L67","v":0},{"$f":"+'Stage 12'!K67","v":0},{"$f":"+'Stage 12'!L67","v":0},0,0,{"$f":"IF(ISBLANK('Shooter Information'!B69),,IF(SUM('Stage 1'!M67,'Stage 2'!M67,'Stage 3'!M67,'Stage 4'!M67,'Stage 5'!M67,'Stage 6'!M67,'Stage 7'!M67,'Stage 8'!M67,'Stage 9'!M67,'Stage 10'!M67,'Stage 11'!M67,'Stage 12'!M67)=0,\"Yes\",\"No\"))","v":0},{"$f":"IF(ISBLANK('Shooter Information'!B69),,IF(AK68>=2,\"No\",\"Yes\"))","v":0},99999,99999,{"$f":"IF(ISBLANK('Shooter Information'!C69),\"ZZZZZZZZZZ\",C68)","v":"ZZZZZZZZZZ"},{"$f":"CELL(\"row\",'Shooter Information'!B69)","v":69},{"$f":"SUM('Stage 1'!I67,'Stage 2'!I67,'Stage 3'!I67,'Stage 4'!I67,'Stage 5'!I67,'Stage 6'!I67,'Stage 7'!I67,'Stage 8'!I67,'Stage 9'!I67,'Stage 10'!I67,'Stage 11'!I67,'Stage 12'!I67)","v":0}]
[{"$f":"IF(AF69=\"Yes\",IF('Shooter Information'!$C$2=\"R\",(SUMPRODUCT(--(AD69>$AD$5:$AD$79),--(\"Yes\"=$AF$5:$AF$79))+1),(SUMPRODUCT(--(AC69>$AC$5:$AC$79),--(\"Yes\"=$AF$5:$AF$79))+1)),0)","v":0},{"$f":"'Shooter Information'!B70","v":0},{"$f":"'Shooter Information'!C70","v":0},{"$f":"IF(AF69=\"Yes\",IF('Shooter Information'!$C$2=\"R\",(SUMPRODUCT(--(C69=$C$5:$C$79),--(AD69>$AD$5:$AD$79),--(\"Yes\"=$AF$5:$AF$79))+1),(SUMPRODUCT(--(C69=$C$5:$C$79),--(AC69>$AC$5:$AC$79),--(\"Yes\"=$AF$5:$AF$79))+1)),0)","v":0},{"$f":"+'Stage 1'!K68","v":0},{"$f":"+'Stage 1'!L68","v":0},{"$f":"+'Stage 2'!K68","v":0},{"$f":"+'Stage 2'!L68","v":0},{"$f":"+'Stage 3'!K68","v":0},{"$f":"+'Stage 3'!L68","v":0},{"$f":"+'Stage 4'!K68","v":0},{"$f":"+'Stage 4'!L68","v":0},{"$f":"+'Stage 5'!K68","v":0},{"$f":"+'Stage 5'!L68","v":0},{"$f":"+'Stage 6'!K68","v":0},{"$f":"+'Stage 6'!L68","v":0},{"$f":"+'Stage 7'!K68","v":0},{"$f":"+'Stage 7'!L68","v":0},{"$f":"+'Stage 8'!K68","v":0},{"$f":"+'Stage 8'!L68","v":0},{"$f":"+'Stage 9'!K68","v":0},{"$f":"+'Stage 9'!L68","v":0},{"$f":"+'Stage 10'!K68","v":0},{"$f":"+'Stage 10'!L68","v":0},{"$f":"+'Stage 11'!K68","v":0},{"$f":"+'Stage 11'!L68","v":0},{"$f":"+'Stage 12'!K68","v":0},{"$f":"+'Stage 12'!L68","v":0},{"$f":"+E69+G69+I69+K69+M69+O69+Q69+S69+U69+W69+Y69+AA69","v":0},{"$f":"+F69+H69+J69+L69+N69+P69+R69+T69+V69+X69+Z69+AB69","v":0},{"$f":"IF(ISBLANK('Shooter Information'!B70),,IF(SUM('Stage 1'!M68,'Stage 2'!M68,'Stage 3'!M68,'Stage 4'!M68,'Stage 5'!M68,'Stage 6'!M68,'Stage 7'!M68,'Stage 8'!M68,'Stage 9'!M68,'Stage 10'!M68,'Stage 11'!M68,'Stage 12'!M68)=0,\"Yes\",\"No\"))","v":0},{"$f":"IF(ISBLANK('Shooter Information'!B70),,IF(AK69>=2,\"No\",\"Yes\"))","v":0},{"$f":"IF(AC69=0,99999,AC69)","v":99999},{"$f":"IF(AD69=0,99999,AD69)","v":99999},{"$f":"IF(ISBLANK('Shooter Information'!C70),\"ZZZZZZZZZZ\",C69)","v":"ZZZZZZZZZZ"},{"$f":"CELL(\"row\",'Shooter Information'!B70)","v":70},{"$f":"SUM('Stage 1'!I68,'Stage 2'!I68,'Stage 3'!I68,'Stage 4'!I68,'Stage 5'!I68,'Stage 6'!I68,'Stage 7'!I68,'Stage 8'!I68,'Stage 9'!I68,'Stage 10'!I68,'Stage 11'!I68,'Stage 12'!I68)","v":0}]
[{"$f":"IF(AF70=\"Yes\",IF('Shooter Information'!$C$2=\"R\",(SUMPRODUCT(--(AD70>$AD$5:$AD$79),--(\"Yes\"=$AF$5:$AF$79))+1),(SUMPRODUCT(--(AC70>$AC$5:$AC$79),--(\"Yes\"=$AF$5:$AF$79))+1)),0)","v":0},{"$f":"'Shooter Information'!B71","v":0},{"$f":"'Shooter Information'!C71","v":0},{"$f":"IF(AF70=\"Yes\",IF('Shooter Information'!$C$2=\"R\",(SUMPRODUCT(--(C70=$C$5:$C$79),--(AD70>$AD$5:$AD$79),--(\"Yes\"=$AF$5:$AF$79))+1),(SUMPRODUCT(--(C70=$C$5:$C$79),--(AC70>$AC$5:$AC$79),--(\"Yes\"=$AF$5:$AF$79))+1)),0)","v":0},{"$f":"+'Stage 1'!K69","v":0},{"$f":"+'Stage 1'!L69","v":0},{"$f":"+'Stage 2'!K69","v":0},{"$f":"+'Stage 2'!L69","v":0},{"$f":"+'Stage 3'!K69","v":0},{"$f":"+'Stage 3'!L69","v":0},{"$f":"+'Stage 4'!K69","v":0},{"$f":"+'Stage 4'!L69","v":0},{"$f":"+'Stage 5'!K69","v":0},{"$f":"+'Stage 5'!L69","v":0},{"$f":"+'Stage 6'!K69","v":0},{"$f":"+'Stage 6'!L69","v":0},{"$f":"+'Stage 7'!K69","v":0},{"$f":"+'Stage 7'!L69","v":0},{"$f":"+'Stage 8'!K69","v":0},{"$f":"+'Stage 8'!L69","v":0},{"$f":"+'Stage 9'!K69","v":0},{"$f":"+'Stage 9'!L69","v":0},{"$f":"+'Stage 10'!K69","v":0},{"$f":"+'Stage 10'!L69","v":0},{"$f":"+'Stage 11'!K69","v":0},{"$f":"+'Stage 11'!L69","v":0},{"$f":"+'Stage 12'!K69","v":0},{"$f":"+'Stage 12'!L69","v":0},0,0,{"$f":"IF(ISBLANK('Shooter Information'!B71),,IF(SUM('Stage 1'!M69,'Stage 2'!M69,'Stage 3'!M69,'Stage 4'!M69,'Stage 5'!M69,'Stage 6'!M69,'Stage 7'!M69,'Stage 8'!M69,'Stage 9'!M69,'Stage 10'!M69,'Stage 11'!M69,'Stage 12'!M69)=0,\"Yes\",\"No\"))","v":0},{"$f":"IF(ISBLANK('Shooter Information'!B71),,IF(AK70>=2,\"No\",\"Yes\"))","v":0},99999,99999,{"$f":"IF(ISBLANK('Shooter Information'!C71),\"ZZZZZZZZZZ\",C70)","v":"ZZZZZZZZZZ"},{"$f":"CELL(\"row\",'Shooter Information'!B71)","v":71},{"$f":"SUM('Stage 1'!I69,'Stage 2'!I69,'Stage 3'!I69,'Stage 4'!I69,'Stage 5'!I69,'Stage 6'!I69,'Stage 7'!I69,'Stage 8'!I69,'Stage 9'!I69,'Stage 10'!I69,'Stage 11'!I69,'Stage 12'!I69)","v":0}]
[{"$f":"IF(AF71=\"Yes\",IF('Shooter Information'!$C$2=\"R\",(SUMPRODUCT(--(AD71>$AD$5:$AD$79),--(\"Yes\"=$AF$5:$AF$79))+1),(SUMPRODUCT(--(AC71>$AC$5:$AC$79),--(\"Yes\"=$AF$5:$AF$79))+1)),0)","v":0},{"$f":"'Shooter Information'!B72","v":0},{"$f":"'Shooter Information'!C72","v":0},{"$f":"IF(AF71=\"Yes\",IF('Shooter Information'!$C$2=\"R\",(SUMPRODUCT(--(C71=$C$5:$C$79),--(AD71>$AD$5:$AD$79),--(\"Yes\"=$AF$5:$AF$79))+1),(SUMPRODUCT(--(C71=$C$5:$C$79),--(AC71>$AC$5:$AC$79),--(\"Yes\"=$AF$5:$AF$79))+1)),0)","v":0},{"$f":"+'Stage 1'!K70","v":0},{"$f":"+'Stage 1'!L70","v":0},{"$f":"+'Stage 2'!K70","v":0},{"$f":"+'Stage 2'!L70","v":0},{"$f":"+'Stage 3'!K70","v":0},{"$f":"+'Stage 3'!L70","v":0},{"$f":"+'Stage 4'!K70","v":0},{"$f":"+'Stage 4'!L70","v":0},{"$f":"+'Stage 5'!K70","v":0},{"$f":"+'Stage 5'!L70","v":0},{"$f":"+'Stage 6'!K70","v":0},{"$f":"+'Stage 6'!L70","v":0},{"$f":"+'Stage 7'!K70","v":0},{"$f":"+'Stage 7'!L70","v":0},{"$f":"+'Stage 8'!K70","v":0},{"$f":"+'Stage 8'!L70","v":0},{"$f":"+'Stage 9'!K70","v":0},{"$f":"+'Stage 9'!L70","v":0},{"$f":"+'Stage 10'!K70","v":0},{"$f":"+'Stage 10'!L70","v":0},{"$f":"+'Stage 11'!K70","v":0},{"$f":"+'Stage 11'!L70","v":0},{"$f":"+'Stage 12'!K70","v":0},{"$f":"+'Stage 12'!L70","v":0},0,0,{"$f":"IF(ISBLANK('Shooter Information'!B72),,IF(SUM('Stage 1'!M70,'Stage 2'!M70,'Stage 3'!M70,'Stage 4'!M70,'Stage 5'!M70,'Stage 6'!M70,'Stage 7'!M70,'Stage 8'!M70,'Stage 9'!M70,'Stage 10'!M70,'Stage 11'!M70,'Stage 12'!M70)=0,\"Yes\",\"No\"))","v":0},{"$f":"IF(ISBLANK('Shooter Information'!B72),,IF(AK71>=2,\"No\",\"Yes\"))","v":0},99999,99999,{"$f":"IF(ISBLANK('Shooter Information'!C72),\"ZZZZZZZZZZ\",C71)","v":"ZZZZZZZZZZ"},{"$f":"CELL(\"row\",'Shooter Information'!B72)","v":72},{"$f":"SUM('Stage 1'!I70,'Stage 2'!I70,'Stage 3'!I70,'Stage 4'!I70,'Stage 5'!I70,'Stage 6'!I70,'Stage 7'!I70,'Stage 8'!I70,'Stage 9'!I70,'Stage 10'!I70,'Stage 11'!I70,'Stage 12'!I70)","v":0}]
[{"$f":"IF(AF72=\"Yes\",IF('Shooter Information'!$C$2=\"R\",(SUMPRODUCT(--(AD72>$AD$5:$AD$79),--(\"Yes\"=$AF$5:$AF$79))+1),(SUMPRODUCT(--(AC72>$AC$5:$AC$79),--(\"Yes\"=$AF$5:$AF$79))+1)),0)","v":0},{"$f":"'Shooter Information'!B73","v":0},{"$f":"'Shooter Information'!C73","v":0},{"$f":"IF(AF72=\"Yes\",IF('Shooter Information'!$C$2=\"R\",(SUMPRODUCT(--(C72=$C$5:$C$79),--(AD72>$AD$5:$AD$79),--(\"Yes\"=$AF$5:$AF$79))+1),(SUMPRODUCT(--(C72=$C$5:$C$79),--(AC72>$AC$5:$AC$79),--(\"Yes\"=$AF$5:$AF$79))+1)),0)","v":0},{"$f":"+'Stage 1'!K71","v":0},{"$f":"+'Stage 1'!L71","v":0},{"$f":"+'Stage 2'!K71","v":0},{"$f":"+'Stage 2'!L71","v":0},{"$f":"+'Stage 3'!K71","v":0},{"$f":"+'Stage 3'!L71","v":0},{"$f":"+'Stage 4'!K71","v":0},{"$f":"+'Stage 4'!L71","v":0},{"$f":"+'Stage 5'!K71","v":0},{"$f":"+'Stage 5'!L71","v":0},{"$f":"+'Stage 6'!K71","v":0},{"$f":"+'Stage 6'!L71","v":0},{"$f":"+'Stage 7'!K71","v":0},{"$f":"+'Stage 7'!L71","v":0},{"$f":"+'Stage 8'!K71","v":0},{"$f":"+'Stage 8'!L71","v":0},{"$f":"+'Stage 9'!K71","v":0},{"$f":"+'Stage 9'!L71","v":0},{"$f":"+'Stage 10'!K71","v":0},{"$f":"+'Stage 10'!L71","v":0},{"$f":"+'Stage 11'!K71","v":0},{"$f":"+'Stage 11'!L71","v":0},{"$f":"+'Stage 12'!K71","v":0},{"$f":"+'Stage 12'!L71","v":0},0,0,{"$f":"IF(ISBLANK('Shooter Information'!B73),,IF(SUM('Stage 1'!M71,'Stage 2'!M71,'Stage 3'!M71,'Stage 4'!M71,'Stage 5'!M71,'Stage 6'!M71,'Stage 7'!M71,'Stage 8'!M71,'Stage 9'!M71,'Stage 10'!M71,'Stage 11'!M71,'Stage 12'!M71)=0,\"Yes\",\"No\"))","v":0},{"$f":"IF(ISBLANK('Shooter Information'!B73),,IF(AK72>=2,\"No\",\"Yes\"))","v":0},99999,99999,{"$f":"IF(ISBLANK('Shooter Information'!C73),\"ZZZZZZZZZZ\",C72)","v":"ZZZZZZZZZZ"},{"$f":"CELL(\"row\",'Shooter Information'!B73)","v":73},{"$f":"SUM('Stage 1'!I71,'Stage 2'!I71,'Stage 3'!I71,'Stage 4'!I71,'Stage 5'!I71,'Stage 6'!I71,'Stage 7'!I71,'Stage 8'!I71,'Stage 9'!I71,'Stage 10'!I71,'Stage 11'!I71,'Stage 12'!I71)","v":0}]
[{"$f":"IF(AF73=\"Yes\",IF('Shooter Information'!$C$2=\"R\",(SUMPRODUCT(--(AD73>$AD$5:$AD$79),--(\"Yes\"=$AF$5:$AF$79))+1),(SUMPRODUCT(--(AC73>$AC$5:$AC$79),--(\"Yes\"=$AF$5:$AF$79))+1)),0)","v":0},{"$f":"'Shooter Information'!B74","v":0},{"$f":"'Shooter Information'!C74","v":0},{"$f":"IF(AF73=\"Yes\",IF('Shooter Information'!$C$2=\"R\",(SUMPRODUCT(--(C73=$C$5:$C$79),--(AD73>$AD$5:$AD$79),--(\"Yes\"=$AF$5:$AF$79))+1),(SUMPRODUCT(--(C73=$C$5:$C$79),--(AC73>$AC$5:$AC$79),--(\"Yes\"=$AF$5:$AF$79))+1)),0)","v":0},{"$f":"+'Stage 1'!K72","v":0},{"$f":"+'Stage 1'!L72","v":0},{"$f":"+'Stage 2'!K72","v":0},{"$f":"+'Stage 2'!L72","v":0},{"$f":"+'Stage 3'!K72","v":0},{"$f":"+'Stage 3'!L72","v":0},{"$f":"+'Stage 4'!K72","v":0},{"$f":"+'Stage 4'!L72","v":0},{"$f":"+'Stage 5'!K72","v":0},{"$f":"+'Stage 5'!L72","v":0},{"$f":"+'Stage 6'!K72","v":0},{"$f":"+'Stage 6'!L72","v":0},{"$f":"+'Stage 7'!K72","v":0},{"$f":"+'Stage 7'!L72","v":0},{"$f":"+'Stage 8'!K72","v":0},{"$f":"+'Stage 8'!L72","v":0},{"$f":"+'Stage 9'!K72","v":0},{"$f":"+'Stage 9'!L72","v":0},{"$f":"+'Stage 10'!K72","v":0},{"$f":"+'Stage 10'!L72","v":0},{"$f":"+'Stage 11'!K72","v":0},{"$f":"+'Stage 11'!L72","v":0},{"$f":"+'Stage 12'!K72","v":0},{"$f":"+'Stage 12'!L72","v":0},0,0,{"$f":"IF(ISBLANK('Shooter Information'!B74),,IF(SUM('Stage 1'!M72,'Stage 2'!M72,'Stage 3'!M72,'Stage 4'!M72,'Stage 5'!M72,'Stage 6'!M72,'Stage 7'!M72,'Stage 8'!M72,'Stage 9'!M72,'Stage 10'!M72,'Stage 11'!M72,'Stage 12'!M72)=0,\"Yes\",\"No\"))","v":0},{"$f":"IF(ISBLANK('Shooter Information'!B74),,IF(AK73>=2,\"No\",\"Yes\"))","v":0},99999,99999,{"$f":"IF(ISBLANK('Shooter Information'!C74),\"ZZZZZZZZZZ\",C73)","v":"ZZZZZZZZZZ"},{"$f":"CELL(\"row\",'Shooter Information'!B74)","v":74},{"$f":"SUM('Stage 1'!I72,'Stage 2'!I72,'Stage 3'!I72,'Stage 4'!I72,'Stage 5'!I72,'Stage 6'!I72,'Stage 7'!I72,'Stage 8'!I72,'Stage 9'!I72,'Stage 10'!I72,'Stage 11'!I72,'Stage 12'!I72)","v":0}]
[{"$f":"IF(AF74=\"Yes\",IF('Shooter Information'!$C$2=\"R\",(SUMPRODUCT(--(AD74>$AD$5:$AD$79),--(\"Yes\"=$AF$5:$AF$79))+1),(SUMPRODUCT(--(AC74>$AC$5:$AC$79),--(\"Yes\"=$AF$5:$AF$79))+1)),0)","v":0},{"$f":"'Shooter Information'!B75","v":0},{"$f":"'Shooter Information'!C75","v":0},{"$f":"IF(AF74=\"Yes\",IF('Shooter Information'!$C$2=\"R\",(SUMPRODUCT(--(C74=$C$5:$C$79),--(AD74>$AD$5:$AD$79),--(\"Yes\"=$AF$5:$AF$79))+1),(SUMPRODUCT(--(C74=$C$5:$C$79),--(AC74>$AC$5:$AC$79),--(\"Yes\"=$AF$5:$AF$79))+1)),0)","v":0},{"$f":"+'Stage 1'!K73","v":0},{"$f":"+'Stage 1'!L73","v":0},{"$f":"+'Stage 2'!K73","v":0},{"$f":"+'Stage 2'!L73","v":0},{"$f":"+'Stage 3'!K73","v":0},{"$f":"+'Stage 3'!L73","v":0},{"$f":"+'Stage 4'!K73","v":0},{"$f":"+'Stage 4'!L73","v":0},{"$f":"+'Stage 5'!K73","v":0},{"$f":"+'Stage 5'!L73","v":0},{"$f":"+'Stage 6'!K73","v":0},{"$f":"+'Stage 6'!L73","v":0},{"$f":"+'Stage 7'!K73","v":0},{"$f":"+'Stage 7'!L73","v":0},{"$f":"+'Stage 8'!K73","v":0},{"$f":"+'Stage 8'!L73","v":0},{"$f":"+'Stage 9'!K73","v":0},{"$f":"+'Stage 9'!L73","v":0},{"$f":"+'Stage 10'!K73","v":0},{"$f":"+'Stage 10'!L73","v":0},{"$f":"+'Stage 11'!K73","v":0},{"$f":"+'Stage 11'!L73","v":0},{"$f":"+'Stage 12'!K73","v":0},{"$f":"+'Stage 12'!L73","v":0},0,0,{"$f":"IF(ISBLANK('Shooter Information'!B75),,IF(SUM('Stage 1'!M73,'Stage 2'!M73,'Stage 3'!M73,'Stage 4'!M73,'Stage 5'!M73,'Stage 6'!M73,'Stage 7'!M73,'Stage 8'!M73,'Stage 9'!M73,'Stage 10'!M73,'Stage 11'!M73,'Stage 12'!M73)=0,\"Yes\",\"No\"))","v":0},{"$f":"IF(ISBLANK('Shooter Information'!B75),,IF(AK74>=2,\"No\",\"Yes\"))","v":0},99999,99999,{"$f":"IF(ISBLANK('Shooter Information'!C75),\"ZZZZZZZZZZ\",C74)","v":"ZZZZZZZZZZ"},{"$f":"CELL(\"row\",'Shooter Information'!B75)","v":75},{"$f":"SUM('Stage 1'!I73,'Stage 2'!I73,'Stage 3'!I73,'Stage 4'!I73,'Stage 5'!I73,'Stage 6'!I73,'Stage 7'!I73,'Stage 8'!I73,'Stage 9'!I73,'Stage 10'!I73,'Stage 11'!I73,'Stage 12'!I73)","v":0}]
[{"$f":"IF(AF75=\"Yes\",IF('Shooter Information'!$C$2=\"R\",(SUMPRODUCT(--(AD75>$AD$5:$AD$79),--(\"Yes\"=$AF$5:$AF$79))+1),(SUMPRODUCT(--(AC75>$AC$5:$AC$79),--(\"Yes\"=$AF$5:$AF$79))+1)),0)","v":0},{"$f":"'Shooter Information'!B76","v":0},{"$f":"'Shooter Information'!C76","v":0},{"$f":"IF(AF75=\"Yes\",IF('Shooter Information'!$C$2=\"R\",(SUMPRODUCT(--(C75=$C$5:$C$79),--(AD75>$AD$5:$AD$79),--(\"Yes\"=$AF$5:$AF$79))+1),(SUMPRODUCT(--(C75=$C$5:$C$79),--(AC75>$AC$5:$AC$79),--(\"Yes\"=$AF$5:$AF$79))+1)),0)","v":0},{"$f":"+'Stage 1'!K74","v":0},{"$f":"+'Stage 1'!L74","v":0},{"$f":"+'Stage 2'!K74","v":0},{"$f":"+'Stage 2'!L74","v":0},{"$f":"+'Stage 3'!K74","v":0},{"$f":"+'Stage 3'!L74","v":0},{"$f":"+'Stage 4'!K74","v":0},{"$f":"+'Stage 4'!L74","v":0},{"$f":"+'Stage 5'!K74","v":0},{"$f":"+'Stage 5'!L74","v":0},{"$f":"+'Stage 6'!K74","v":0},{"$f":"+'Stage 6'!L74","v":0},{"$f":"+'Stage 7'!K74","v":0},{"$f":"+'Stage 7'!L74","v":0},{"$f":"+'Stage 8'!K74","v":0},{"$f":"+'Stage 8'!L74","v":0},{"$f":"+'Stage 9'!K74","v":0},{"$f":"+'Stage 9'!L74","v":0},{"$f":"+'Stage 10'!K74","v":0},{"$f":"+'Stage 10'!L74","v":0},{"$f":"+'Stage 11'!K74","v":0},{"$f":"+'Stage 11'!L74","v":0},{"$f":"+'Stage 12'!K74","v":0},{"$f":"+'Stage 12'!L74","v":0},0,0,{"$f":"IF(ISBLANK('Shooter Information'!B76),,IF(SUM('Stage 1'!M74,'Stage 2'!M74,'Stage 3'!M74,'Stage 4'!M74,'Stage 5'!M74,'Stage 6'!M74,'Stage 7'!M74,'Stage 8'!M74,'Stage 9'!M74,'Stage 10'!M74,'Stage 11'!M74,'Stage 12'!M74)=0,\"Yes\",\"No\"))","v":0},{"$f":"IF(ISBLANK('Shooter Information'!B76),,IF(AK75>=2,\"No\",\"Yes\"))","v":0},99999,99999,{"$f":"IF(ISBLANK('Shooter Information'!C76),\"ZZZZZZZZZZ\",C75)","v":"ZZZZZZZZZZ"},{"$f":"CELL(\"row\",'Shooter Information'!B76)","v":76},{"$f":"SUM('Stage 1'!I74,'Stage 2'!I74,'Stage 3'!I74,'Stage 4'!I74,'Stage 5'!I74,'Stage 6'!I74,'Stage 7'!I74,'Stage 8'!I74,'Stage 9'!I74,'Stage 10'!I74,'Stage 11'!I74,'Stage 12'!I74)","v":0}]
[{"$f":"IF(AF76=\"Yes\",IF('Shooter Information'!$C$2=\"R\",(SUMPRODUCT(--(AD76>$AD$5:$AD$79),--(\"Yes\"=$AF$5:$AF$79))+1),(SUMPRODUCT(--(AC76>$AC$5:$AC$79),--(\"Yes\"=$AF$5:$AF$79))+1)),0)","v":0},{"$f":"'Shooter Information'!B77","v":0},{"$f":"'Shooter Information'!C77","v":0},{"$f":"IF(AF76=\"Yes\",IF('Shooter Information'!$C$2=\"R\",(SUMPRODUCT(--(C76=$C$5:$C$79),--(AD76>$AD$5:$AD$79),--(\"Yes\"=$AF$5:$AF$79))+1),(SUMPRODUCT(--(C76=$C$5:$C$79),--(AC76>$AC$5:$AC$79),--(\"Yes\"=$AF$5:$AF$79))+1)),0)","v":0},{"$f":"+'Stage 1'!K75","v":0},{"$f":"+'Stage 1'!L75","v":0},{"$f":"+'Stage 2'!K75","v":0},{"$f":"+'Stage 2'!L75","v":0},{"$f":"+'Stage 3'!K75","v":0},{"$f":"+'Stage 3'!L75","v":0},{"$f":"+'Stage 4'!K75","v":0},{"$f":"+'Stage 4'!L75","v":0},{"$f":"+'Stage 5'!K75","v":0},{"$f":"+'Stage 5'!L75","v":0},{"$f":"+'Stage 6'!K75","v":0},{"$f":"+'Stage 6'!L75","v":0},{"$f":"+'Stage 7'!K75","v":0},{"$f":"+'Stage 7'!L75","v":0},{"$f":"+'Stage 8'!K75","v":0},{"$f":"+'Stage 8'!L75","v":0},{"$f":"+'Stage 9'!K75","v":0},{"$f":"+'Stage 9'!L75","v":0},{"$f":"+'Stage 10'!K75","v":0},{"$f":"+'Stage 10'!L75","v":0},{"$f":"+'Stage 11'!K75","v":0},{"$f":"+'Stage 11'!L75","v":0},{"$f":"+'Stage 12'!K75","v":0},{"$f":"+'Stage 12'!L75","v":0},0,0,{"$f":"IF(ISBLANK('Shooter Information'!B77),,IF(SUM('Stage 1'!M75,'Stage 2'!M75,'Stage 3'!M75,'Stage 4'!M75,'Stage 5'!M75,'Stage 6'!M75,'Stage 7'!M75,'Stage 8'!M75,'Stage 9'!M75,'Stage 10'!M75,'Stage 11'!M75,'Stage 12'!M75)=0,\"Yes\",\"No\"))","v":0},{"$f":"IF(ISBLANK('Shooter Information'!B77),,IF(AK76>=2,\"No\",\"Yes\"))","v":0},99999,99999,{"$f":"IF(ISBLANK('Shooter Information'!C77),\"ZZZZZZZZZZ\",C76)","v":"ZZZZZZZZZZ"},{"$f":"CELL(\"row\",'Shooter Information'!B77)","v":77},{"$f":"SUM('Stage 1'!I75,'Stage 2'!I75,'Stage 3'!I75,'Stage 4'!I75,'Stage 5'!I75,'Stage 6'!I75,'Stage 7'!I75,'Stage 8'!I75,'Stage 9'!I75,'Stage 10'!I75,'Stage 11'!I75,'Stage 12'!I75)","v":0}]
[{"$f":"IF(AF77=\"Yes\",IF('Shooter Information'!$C$2=\"R\",(SUMPRODUCT(--(AD77>$AD$5:$AD$79),--(\"Yes\"=$AF$5:$AF$79))+1),(SUMPRODUCT(--(AC77>$AC$5:$AC$79),--(\"Yes\"=$AF$5:$AF$79))+1)),0)","v":0},{"$f":"'Shooter Information'!B78","v":0},{"$f":"'Shooter Information'!C78","v":0},{"$f":"IF(AF77=\"Yes\",IF('Shooter Information'!$C$2=\"R\",(SUMPRODUCT(--(C77=$C$5:$C$79),--(AD77>$AD$5:$AD$79),--(\"Yes\"=$AF$5:$AF$79))+1),(SUMPRODUCT(--(C77=$C$5:$C$79),--(AC77>$AC$5:$AC$79),--(\"Yes\"=$AF$5:$AF$79))+1)),0)","v":0},{"$f":"+'Stage 1'!K76","v":0},{"$f":"+'Stage 1'!L76","v":0},{"$f":"+'Stage 2'!K76","v":0},{"$f":"+'Stage 2'!L76","v":0},{"$f":"+'Stage 3'!K76","v":0},{"$f":"+'Stage 3'!L76","v":0},{"$f":"+'Stage 4'!K76","v":0},{"$f":"+'Stage 4'!L76","v":0},{"$f":"+'Stage 5'!K76","v":0},{"$f":"+'Stage 5'!L76","v":0},{"$f":"+'Stage 6'!K76","v":0},{"$f":"+'Stage 6'!L76","v":0},{"$f":"+'Stage 7'!K76","v":0},{"$f":"+'Stage 7'!L76","v":0},{"$f":"+'Stage 8'!K76","v":0},{"$f":"+'Stage 8'!L76","v":0},{"$f":"+'Stage 9'!K76","v":0},{"$f":"+'Stage 9'!L76","v":0},{"$f":"+'Stage 10'!K76","v":0},{"$f":"+'Stage 10'!L76","v":0},{"$f":"+'Stage 11'!K76","v":0},{"$f":"+'Stage 11'!L76","v":0},{"$f":"+'Stage 12'!K76","v":0},{"$f":"+'Stage 12'!L76","v":0},0,0,{"$f":"IF(ISBLANK('Shooter Information'!B78),,IF(SUM('Stage 1'!M76,'Stage 2'!M76,'Stage 3'!M76,'Stage 4'!M76,'Stage 5'!M76,'Stage 6'!M76,'Stage 7'!M76,'Stage 8'!M76,'Stage 9'!M76,'Stage 10'!M76,'Stage 11'!M76,'Stage 12'!M76)=0,\"Yes\",\"No\"))","v":0},{"$f":"IF(ISBLANK('Shooter Information'!B78),,IF(AK77>=2,\"No\",\"Yes\"))","v":0},99999,99999,{"$f":"IF(ISBLANK('Shooter Information'!C78),\"ZZZZZZZZZZ\",C77)","v":"ZZZZZZZZZZ"},{"$f":"CELL(\"row\",'Shooter Information'!B78)","v":78},{"$f":"SUM('Stage 1'!I76,'Stage 2'!I76,'Stage 3'!I76,'Stage 4'!I76,'Stage 5'!I76,'Stage 6'!I76,'Stage 7'!I76,'Stage 8'!I76,'Stage 9'!I76,'Stage 10'!I76,'Stage 11'!I76,'Stage 12'!I76)","v":0}]
[{"$f":"IF(AF78=\"Yes\",IF('Shooter Information'!$C$2=\"R\",(SUMPRODUCT(--(AD78>$AD$5:$AD$79),--(\"Yes\"=$AF$5:$AF$79))+1),(SUMPRODUCT(--(AC78>$AC$5:$AC$79),--(\"Yes\"=$AF$5:$AF$79))+1)),0)","v":0},{"$f":"'Shooter Information'!B79","v":0},{"$f":"'Shooter Information'!C79","v":0},{"$f":"IF(AF78=\"Yes\",IF('Shooter Information'!$C$2=\"R\",(SUMPRODUCT(--(C78=$C$5:$C$79),--(AD78>$AD$5:$AD$79),--(\"Yes\"=$AF$5:$AF$79))+1),(SUMPRODUCT(--(C78=$C$5:$C$79),--(AC78>$AC$5:$AC$79),--(\"Yes\"=$AF$5:$AF$79))+1)),0)","v":0},{"$f":"+'Stage 1'!K77","v":0},{"$f":"+'Stage 1'!L77","v":0},{"$f":"+'Stage 2'!K77","v":0},{"$f":"+'Stage 2'!L77","v":0},{"$f":"+'Stage 3'!K77","v":0},{"$f":"+'Stage 3'!L77","v":0},{"$f":"+'Stage 4'!K77","v":0},{"$f":"+'Stage 4'!L77","v":0},{"$f":"+'Stage 5'!K77","v":0},{"$f":"+'Stage 5'!L77","v":0},{"$f":"+'Stage 6'!K77","v":0},{"$f":"+'Stage 6'!L77","v":0},{"$f":"+'Stage 7'!K77","v":0},{"$f":"+'Stage 7'!L77","v":0},{"$f":"+'Stage 8'!K77","v":0},{"$f":"+'Stage 8'!L77","v":0},{"$f":"+'Stage 9'!K77","v":0},{"$f":"+'Stage 9'!L77","v":0},{"$f":"+'Stage 10'!K77","v":0},{"$f":"+'Stage 10'!L77","v":0},{"$f":"+'Stage 11'!K77","v":0},{"$f":"+'Stage 11'!L77","v":0},{"$f":"+'Stage 12'!K77","v":0},{"$f":"+'Stage 12'!L77","v":0},0,0,{"$f":"IF(ISBLANK('Shooter Information'!B79),,IF(SUM('Stage 1'!M77,'Stage 2'!M77,'Stage 3'!M77,'Stage 4'!M77,'Stage 5'!M77,'Stage 6'!M77,'Stage 7'!M77,'Stage 8'!M77,'Stage 9'!M77,'Stage 10'!M77,'Stage 11'!M77,'Stage 12'!M77)=0,\"Yes\",\"No\"))","v":0},{"$f":"IF(ISBLANK('Shooter Information'!B79),,IF(AK78>=2,\"No\",\"Yes\"))","v":0},99999,99999,{"$f":"IF(ISBLANK('Shooter Information'!C79),\"ZZZZZZZZZZ\",C78)","v":"ZZZZZZZZZZ"},{"$f":"CELL(\"row\",'Shooter Information'!B79)","v":79},{"$f":"SUM('Stage 1'!I77,'Stage 2'!I77,'Stage 3'!I77,'Stage 4'!I77,'Stage 5'!I77,'Stage 6'!I77,'Stage 7'!I77,'Stage 8'!I77,'Stage 9'!I77,'Stage 10'!I77,'Stage 11'!I77,'Stage 12'!I77)","v":0}]
[{"$f":"IF(AF79=\"Yes\",IF('Shooter Information'!$C$2=\"R\",(SUMPRODUCT(--(AD79>$AD$5:$AD$79),--(\"Yes\"=$AF$5:$AF$79))+1),(SUMPRODUCT(--(AC79>$AC$5:$AC$79),--(\"Yes\"=$AF$5:$AF$79))+1)),0)","v":0},{"$f":"'Shooter Information'!B80","v":0},{"$f":"'Shooter Information'!C80","v":0},{"$f":"IF(AF79=\"Yes\",IF('Shooter Information'!$C$2=\"R\",(SUMPRODUCT(--(C79=$C$5:$C$79),--(AD79>$AD$5:$AD$79),--(\"Yes\"=$AF$5:$AF$79))+1),(SUMPRODUCT(--(C79=$C$5:$C$79),--(AC79>$AC$5:$AC$79),--(\"Yes\"=$AF$5:$AF$79))+1)),0)","v":0},{"$f":"+'Stage 1'!K78","v":0},{"$f":"+'Stage 1'!L78","v":0},{"$f":"+'Stage 2'!K78","v":0},{"$f":"+'Stage 2'!L78","v":0},{"$f":"+'Stage 3'!K78","v":0},{"$f":"+'Stage 3'!L78","v":0},{"$f":"+'Stage 4'!K78","v":0},{"$f":"+'Stage 4'!L78","v":0},{"$f":"+'Stage 5'!K78","v":0},{"$f":"+'Stage 5'!L78","v":0},{"$f":"+'Stage 6'!K78","v":0},{"$f":"+'Stage 6'!L78","v":0},{"$f":"+'Stage 7'!K78","v":0},{"$f":"+'Stage 7'!L78","v":0},{"$f":"+'Stage 8'!K78","v":0},{"$f":"+'Stage 8'!L78","v":0},{"$f":"+'Stage 9'!K78","v":0},{"$f":"+'Stage 9'!L78","v":0},{"$f":"+'Stage 10'!K78","v":0},{"$f":"+'Stage 10'!L78","v":0},{"$f":"+'Stage 11'!K78","v":0},{"$f":"+'Stage 11'!L78","v":0},{"$f":"+'Stage 12'!K78","v":0},{"$f":"+'Stage 12'!L78","v":0},0,0,{"$f":"IF(ISBLANK('Shooter Information'!B80),,IF(SUM('Stage 1'!M78,'Stage 2'!M78,'Stage 3'!M78,'Stage 4'!M78,'Stage 5'!M78,'Stage 6'!M78,'Stage 7'!M78,'Stage 8'!M78,'Stage 9'!M78,'Stage 10'!M78,'Stage 11'!M78,'Stage 12'!M78)=0,\"Yes\",\"No\"))","v":0},{"$f":"IF(ISBLANK('Shooter Information'!B80),,IF(AK79>=2,\"No\",\"Yes\"))","v":0},99999,99999,{"$f":"IF(ISBLANK('Shooter Information'!C80),\"ZZZZZZZZZZ\",C79)","v":"ZZZZZZZZZZ"},{"$f":"CELL(\"row\",'Shooter Information'!B80)","v":80},{"$f":"SUM('Stage 1'!I78,'Stage 2'!I78,'Stage 3'!I78,'Stage 4'!I78,'Stage 5'!I78,'Stage 6'!I78,'Stage 7'!I78,'Stage 8'!I78,'Stage 9'!I78,'Stage 10'!I78,'Stage 11'!I78,'Stage 12'!I78)","v":0}]

{"sheet":"Match Stats","index":14,"n_rows":35,"n_cols":19,"rows_kept":35,"cut":false,"hidden":true,"merged":[]}
[]
[]
[]
[null,null,"Stage Misses & Penalties",null,null,null,null,null,null,null,"Match Shooter Times"]
[null,null,"Total Misses","10 Sec Penalties","30 Sec Penalties","DNF Penalties","DQ Penalties",null,null,null,"Raw Minimum","Raw Median","Raw Maximum","Raw STDEVA",null,"Final Minimum","Final Median","Final Maximum","Final STDEVA"]
[null,"Stage 01",{"$f":"SUM('Stage 1'!D4:D78)","v":7},{"$f":"SUM('Stage 1'!G4:G78)","v":0},{"$f":"SUM('Stage 1'!H4:H78)","v":0},{"$f":"SUM('Stage 1'!I4:I78)","v":0},{"$f":"SUM('Stage 1'!J4:J78)","v":0},null,null,"Stage 01",{"$f":"MIN(IF('Stage 1'!$E$4:$E$78<999,IF('Stage 1'!$E$4:$E$78>0,'Stage 1'!$E$4:$E$78)))","v":25.84},{"$f":"MEDIAN(IF('Stage 1'!$E$4:$E$78<999,IF('Stage 1'!$E$4:$E$78>0,'Stage 1'!$E$4:$E$78)))","v":35.51},{"$f":"MAX(IF('Stage 1'!$E$4:$E$78<999,IF('Stage 1'!$E$4:$E$78>0,'Stage 1'!$E$4:$E$78)))","v":118.15},{"$f":"STDEVA(IF('Stage 1'!$E$4:$E$78<999,IF('Stage 1'!$E$4:$E$78>0,'Stage 1'!$E$4:$E$78)))","v":25.451091322845272},null,{"$f":"MIN(IF('Stage 1'!$K$4:$K$78<999,IF('Stage 1'!$K$4:$K$78>0,'Stage 1'!$K$4:$K$78)))","v":25.84},{"$f":"MEDIAN(IF('Stage 1'!$K$4:$K$78<999,IF('Stage 1'!$K$4:$K$78>0,'Stage 1'!$K$4:$K$78)))","v":36.17},{"$f":"MAX(IF('Stage 1'!$K$4:$K$78<999,IF('Stage 1'!$K$4:$K$78>0,'Stage 1'!$K$4:$K$78)))","v":128.15},{"$f":"STDEVA(IF('Stage 1'!$K$4:$K$78<999,IF('Stage 1'!$K$4:$K$78>0,'Stage 1'!$K$4:$K$78)))","v":26.945888492804745}]
[null,"Stage 02",{"$f":"SUM('Stage 2'!D4:D78)","v":3},{"$f":"SUM('Stage 2'!G4:G78)","v":1},{"$f":"SUM('Stage 2'!H4:H78)","v":0},{"$f":"SUM('Stage 2'!I4:I78)","v":1},{"$f":"SUM('Stage 2'!J4:J78)","v":0},null,null,"Stage 02",{"$f":"MIN(IF('Stage 2'!$E$4:$E$78<999,IF('Stage 2'!$E$4:$E$78>0,'Stage 2'!$E$4:$E$78)))","v":25.89},{"$f":"MEDIAN(IF('Stage 2'!$E$4:$E$78<999,IF('Stage 2'!$E$4:$E$78>0,'Stage 2'!$E$4:$E$78)))","v":34.99},{"$f":"MAX(IF('Stage 2'!$E$4:$E$78<999,IF('Stage 2'!$E$4:$E$78>0,'Stage 2'!$E$4:$E$78)))","v":95.26},{"$f":"STDEVA(IF('Stage 2'!$E$4:$E$78<999,IF('Stage 2'!$E$4:$E$78>0,'Stage 2'!$E$4:$E$78)))","v":17.191119880544523},null,{"$f":"MIN(IF('Stage 2'!$K$4:$K$78<999,IF('Stage 2'!$K$4:$K$78>0,'Stage 2'!$K$4:$K$78)))","v":25.89},{"$f":"MEDIAN(IF('Stage 2'!$K$4:$K$78<999,IF('Stage 2'!$K$4:$K$78>0,'Stage 2'!$K$4:$K$78)))","v":36.380000000000003},{"$f":"MAX(IF('Stage 2'!$K$4:$K$78<999,IF('Stage 2'!$K$4:$K$78>0,'Stage 2'!$K$4:$K$78)))","v":95.26},{"$f":"STDEVA(IF('Stage 2'!$K$4:$K$78<999,IF('Stage 2'!$K$4:$K$78>0,'Stage 2'!$K$4:$K$78)))","v":17.018089551357455}]
[null,"Stage 03",{"$f":"SUM('Stage 3'!D4:D78)","v":2},{"$f":"SUM('Stage 3'!G4:G78)","v":0},{"$f":"SUM('Stage 3'!H4:H78)","v":0},{"$f":"SUM('Stage 3'!I4:I78)","v":1},{"$f":"SUM('Stage 3'!J4:J78)","v":0},null,null,"Stage 03",{"$f":"MIN(IF('Stage 3'!$E$4:$E$78<999,IF('Stage 3'!$E$4:$E$78>0,'Stage 3'!$E$4:$E$78)))","v":30.93},{"$f":"MEDIAN(IF('Stage 3'!$E$4:$E$78<999,IF('Stage 3'!$E$4:$E$78>0,'Stage 3'!$E$4:$E$78)))","v":39.36},{"$f":"MAX(IF('Stage 3'!$E$4:$E$78<999,IF('Stage 3'!$E$4:$E$78>0,'Stage 3'!$E$4:$E$78)))","v":92.7},{"$f":"STDEVA(IF('Stage 3'!$E$4:$E$78<999,IF('Stage 3'!$E$4:$E$78>0,'Stage 3'!$E$4:$E$78)))","v":15.339300258407588},null,{"$f":"MIN(IF('Stage 3'!$K$4:$K$78<999,IF('Stage 3'!$K$4:$K$78>0,'Stage 3'!$K$4:$K$78)))","v":30.93},{"$f":"MEDIAN(IF('Stage 3'!$K$4:$K$78<999,IF('Stage 3'!$K$4:$K$78>0,'Stage 3'!$K$4:$K$78)))","v":39.36},{"$f":"MAX(IF('Stage 3'!$K$4:$K$78<999,IF('Stage 3'!$K$4:$K$78>0,'Stage 3'!$K$4:$K$78)))","v":97.7},{"$f":"STDEVA(IF('Stage 3'!$K$4:$K$78<999,IF('Stage 3'!$K$4:$K$78>0,'Stage 3'!$K$4:$K$78)))","v":16.39172467777837}]
[null,"Stage 04",{"$f":"SUM('Stage 4'!D4:D78)","v":5},{"$f":"SUM('Stage 4'!G4:G78)","v":2},{"$f":"SUM('Stage 4'!H4:H78)","v":0},{"$f":"SUM('Stage 4'!I4:I78)","v":0},{"$f":"SUM('Stage 4'!J4:J78)","v":0},null,null,"Stage 04",{"$f":"MIN(IF('Stage 4'!$E$4:$E$78<999,IF('Stage 4'!$E$4:$E$78>0,'Stage 4'!$E$4:$E$78)))","v":25.47},{"$f":"MEDIAN(IF('Stage 4'!$E$4:$E$78<999,IF('Stage 4'!$E$4:$E$78>0,'Stage 4'!$E$4:$E$78)))","v":34.270000000000003},{"$f":"MAX(IF('Stage 4'!$E$4:$E$78<999,IF('Stage 4'!$E$4:$E$78>0,'Stage 4'!$E$4:$E$78)))","v":69.87},{"$f":"STDEVA(IF('Stage 4'!$E$4:$E$78<999,IF('Stage 4'!$E$4:$E$78>0,'Stage 4'!$E$4:$E$78)))","v":10.800587153351586},null,{"$f":"MIN(IF('Stage 4'!$K$4:$K$78<999,IF('Stage 4'!$K$4:$K$78>0,'Stage 4'!$K$4:$K$78)))","v":25.47},{"$f":"MEDIAN(IF('Stage 4'!$K$4:$K$78<999,IF('Stage 4'!$K$4:$K$78>0,'Stage 4'!$K$4:$K$78)))","v":36.33},{"$f":"MAX(IF('Stage 4'!$K$4:$K$78<999,IF('Stage 4'!$K$4:$K$78>0,'Stage 4'!$K$4:$K$78)))","v":79.87},{"$f":"STDEVA(IF('Stage 4'!$K$4:$K$78<999,IF('Stage 4'!$K$4:$K$78>0,'Stage 4'!$K$4:$K$78)))","v":13.330892050314688}]
[null,"Stage 05",{"$f":"SUM('Stage 5'!D4:D78)","v":1},{"$f":"SUM('Stage 5'!G4:G78)","v":0},{"$f":"SUM('Stage 5'!H4:H78)","v":0},{"$f":"SUM('Stage 5'!I4:I78)","v":0},{"$f":"SUM('Stage 5'!J4:J78)","v":0},null,null,"Stage 05",{"$f":"MIN(IF('Stage 5'!$E$4:$E$78<999,IF('Stage 5'!$E$4:$E$78>0,'Stage 5'!$E$4:$E$78)))","v":25.98},{"$f":"MEDIAN(IF('Stage 5'!$E$4:$E$78<999,IF('Stage 5'!$E$4:$E$78>0,'Stage 5'!$E$4:$E$78)))","v":32.909999999999997},{"$f":"MAX(IF('Stage 5'!$E$4:$E$78<999,IF('Stage 5'!$E$4:$E$78>0,'Stage 5'!$E$4:$E$78)))","v":72.33},{"$f":"STDEVA(IF('Stage 5'!$E$4:$E$78<999,IF('Stage 5'!$E$4:$E$78>0,'Stage 5'!$E$4:$E$78)))","v":11.192869839236732},null,{"$f":"MIN(IF('Stage 5'!$K$4:$K$78<999,IF('Stage 5'!$K$4:$K$78>0,'Stage 5'!$K$4:$K$78)))","v":26.75},{"$f":"MEDIAN(IF('Stage 5'!$K$4:$K$78<999,IF('Stage 5'!$K$4:$K$78>0,'Stage 5'!$K$4:$K$78)))","v":32.909999999999997},{"$f":"MAX(IF('Stage 5'!$K$4:$K$78<999,IF('Stage 5'!$K$4:$K$78>0,'Stage 5'!$K$4:$K$78)))","v":72.33},{"$f":"STDEVA(IF('Stage 5'!$K$4:$K$78<999,IF('Stage 5'!$K$4:$K$78>0,'Stage 5'!$K$4:$K$78)))","v":10.974921715742067}]
[null,"Stage 06",{"$f":"SUM('Stage 6'!D4:D78)","v":2},{"$f":"SUM('Stage 6'!G4:G78)","v":3},{"$f":"SUM('Stage 6'!H4:H78)","v":0},{"$f":"SUM('Stage 6'!I4:I78)","v":0},{"$f":"SUM('Stage 6'!J4:J78)","v":0},null,null,"Stage 06",{"$f":"MIN(IF('Stage 6'!$E$4:$E$78<999,IF('Stage 6'!$E$4:$E$78>0,'Stage 6'!$E$4:$E$78)))","v":23.75},{"$f":"MEDIAN(IF('Stage 6'!$E$4:$E$78<999,IF('Stage 6'!$E$4:$E$78>0,'Stage 6'!$E$4:$E$78)))","v":34.06},{"$f":"MAX(IF('Stage 6'!$E$4:$E$78<999,IF('Stage 6'!$E$4:$E$78>0,'Stage 6'!$E$4:$E$78)))","v":76.87},{"$f":"STDEVA(IF('Stage 6'!$E$4:$E$78<999,IF('Stage 6'!$E$4:$E$78>0,'Stage 6'!$E$4:$E$78)))","v":12.727377801978141},null,{"$f":"MIN(IF('Stage 6'!$K$4:$K$78<999,IF('Stage 6'!$K$4:$K$78>0,'Stage 6'!$K$4:$K$78)))","v":23.75},{"$f":"MEDIAN(IF('Stage 6'!$K$4:$K$78<999,IF('Stage 6'!$K$4:$K$78>0,'Stage 6'!$K$4:$K$78)))","v":35.46},{"$f":"MAX(IF('Stage 6'!$K$4:$K$78<999,IF('Stage 6'!$K$4:$K$78>0,'Stage 6'!$K$4:$K$78)))","v":76.87},{"$f":"STDEVA(IF('Stage 6'!$K$4:$K$78<999,IF('Stage 6'!$K$4:$K$78>0,'Stage 6'!$K$4:$K$78)))","v":14.721168852402737}]
[null,"Stage 07",{"$f":"SUM('Stage 7'!D4:D78)","v":0},{"$f":"SUM('Stage 7'!G4:G78)","v":0},{"$f":"SUM('Stage 7'!H4:H78)","v":0},{"$f":"SUM('Stage 7'!I4:I78)","v":0},{"$f":"SUM('Stage 7'!J4:J78)","v":0},null,null,"Stage 07",{"$f":"MIN(IF('Stage 7'!$E$4:$E$78<999,IF('Stage 7'!$E$4:$E$78>0,'Stage 7'!$E$4:$E$78)))","v":0},{"$f":"MEDIAN(IF('Stage 7'!$E$4:$E$78<999,IF('Stage 7'!$E$4:$E$78>0,'Stage 7'!$E$4:$E$78)))","v":{"$error":"#NUM!"}},{"$f":"MAX(IF('Stage 7'!$E$4:$E$78<999,IF('Stage 7'!$E$4:$E$78>0,'Stage 7'!$E$4:$E$78)))","v":0},{"$f":"STDEVA(IF('Stage 7'!$E$4:$E$78<999,IF('Stage 7'!$E$4:$E$78>0,'Stage 7'!$E$4:$E$78)))","v":{"$error":"#DIV/0!"}},null,{"$f":"MIN(IF('Stage 7'!$K$4:$K$78<999,IF('Stage 7'!$K$4:$K$78>0,'Stage 7'!$K$4:$K$78)))","v":0},{"$f":"MEDIAN(IF('Stage 7'!$K$4:$K$78<999,IF('Stage 7'!$K$4:$K$78>0,'Stage 7'!$K$4:$K$78)))","v":{"$error":"#NUM!"}},{"$f":"MAX(IF('Stage 7'!$K$4:$K$78<999,IF('Stage 7'!$K$4:$K$78>0,'Stage 7'!$K$4:$K$78)))","v":0},{"$f":"STDEVA(IF('Stage 7'!$K$4:$K$78<999,IF('Stage 7'!$K$4:$K$78>0,'Stage 7'!$K$4:$K$78)))","v":{"$error":"#DIV/0!"}}]
[null,"Stage 08",{"$f":"SUM('Stage 8'!D4:D78)","v":0},{"$f":"SUM('Stage 8'!G4:G78)","v":0},{"$f":"SUM('Stage 8'!H4:H78)","v":0},{"$f":"SUM('Stage 8'!I4:I78)","v":0},{"$f":"SUM('Stage 8'!J4:J78)","v":0},null,null,"Stage 08",{"$f":"MIN(IF('Stage 8'!$E$4:$E$78<999,IF('Stage 8'!$E$4:$E$78>0,'Stage 8'!$E$4:$E$78)))","v":0},{"$f":"MEDIAN(IF('Stage 8'!$E$4:$E$78<999,IF('Stage 8'!$E$4:$E$78>0,'Stage 8'!$E$4:$E$78)))","v":{"$error":"#NUM!"}},{"$f":"MAX(IF('Stage 8'!$E$4:$E$78<999,IF('Stage 8'!$E$4:$E$78>0,'Stage 8'!$E$4:$E$78)))","v":0},{"$f":"STDEVA(IF('Stage 8'!$E$4:$E$78<999,IF('Stage 8'!$E$4:$E$78>0,'Stage 8'!$E$4:$E$78)))","v":{"$error":"#DIV/0!"}},null,{"$f":"MIN(IF('Stage 8'!$K$4:$K$78<999,IF('Stage 8'!$K$4:$K$78>0,'Stage 8'!$K$4:$K$78)))","v":0},{"$f":"MEDIAN(IF('Stage 8'!$K$4:$K$78<999,IF('Stage 8'!$K$4:$K$78>0,'Stage 8'!$K$4:$K$78)))","v":{"$error":"#NUM!"}},{"$f":"MAX(IF('Stage 8'!$K$4:$K$78<999,IF('Stage 8'!$K$4:$K$78>0,'Stage 8'!$K$4:$K$78)))","v":0},{"$f":"STDEVA(IF('Stage 8'!$K$4:$K$78<999,IF('Stage 8'!$K$4:$K$78>0,'Stage 8'!$K$4:$K$78)))","v":{"$error":"#DIV/0!"}}]
[null,"Stage 09",{"$f":"SUM('Stage 9'!D4:D78)","v":0},{"$f":"SUM('Stage 9'!G4:G78)","v":0},{"$f":"SUM('Stage 9'!H4:H78)","v":0},{"$f":"SUM('Stage 9'!I4:I78)","v":0},{"$f":"SUM('Stage 9'!J4:J78)","v":0},null,null,"Stage 09",{"$f":"MIN(IF('Stage 9'!$E$4:$E$78<999,IF('Stage 9'!$E$4:$E$78>0,'Stage 9'!$E$4:$E$78)))","v":0},{"$f":"MEDIAN(IF('Stage 9'!$E$4:$E$78<999,IF('Stage 9'!$E$4:$E$78>0,'Stage 9'!$E$4:$E$78)))","v":{"$error":"#NUM!"}},{"$f":"MAX(IF('Stage 9'!$E$4:$E$78<999,IF('Stage 9'!$E$4:$E$78>0,'Stage 9'!$E$4:$E$78)))","v":0},{"$f":"STDEVA(IF('Stage 9'!$E$4:$E$78<999,IF('Stage 9'!$E$4:$E$78>0,'Stage 9'!$E$4:$E$78)))","v":{"$error":"#DIV/0!"}},null,{"$f":"MIN(IF('Stage 9'!$K$4:$K$78<999,IF('Stage 9'!$K$4:$K$78>0,'Stage 9'!$K$4:$K$78)))","v":0},{"$f":"MEDIAN(IF('Stage 9'!$K$4:$K$78<999,IF('Stage 9'!$K$4:$K$78>0,'Stage 9'!$K$4:$K$78)))","v":{"$error":"#NUM!"}},{"$f":"MAX(IF('Stage 9'!$K$4:$K$78<999,IF('Stage 9'!$K$4:$K$78>0,'Stage 9'!$K$4:$K$78)))","v":0},{"$f":"STDEVA(IF('Stage 9'!$K$4:$K$78<999,IF('Stage 9'!$K$4:$K$78>0,'Stage 9'!$K$4:$K$78)))","v":{"$error":"#DIV/0!"}}]
[null,"Stage 10",{"$f":"SUM('Stage 10'!D4:D78)","v":0},{"$f":"SUM('Stage 10'!G4:G78)","v":0},{"$f":"SUM('Stage 10'!H4:H78)","v":0},{"$f":"SUM('Stage 10'!I4:I78)","v":0},{"$f":"SUM('Stage 10'!J4:J78)","v":0},null,null,"Stage 10",{"$f":"MIN(IF('Stage 10'!$E$4:$E$78<999,IF('Stage 10'!$E$4:$E$78>0,'Stage 10'!$E$4:$E$78)))","v":0},{"$f":"MEDIAN(IF('Stage 10'!$E$4:$E$78<999,IF('Stage 10'!$E$4:$E$78>0,'Stage 10'!$E$4:$E$78)))","v":{"$error":"#NUM!"}},{"$f":"MAX(IF('Stage 10'!$E$4:$E$78<999,IF('Stage 10'!$E$4:$E$78>0,'Stage 10'!$E$4:$E$78)))","v":0},{"$f":"STDEVA(IF('Stage 10'!$E$4:$E$78<999,IF('Stage 10'!$E$4:$E$78>0,'Stage 10'!$E$4:$E$78)))","v":{"$error":"#DIV/0!"}},null,{"$f":"MIN(IF('Stage 10'!$K$4:$K$78<999,IF('Stage 10'!$K$4:$K$78>0,'Stage 10'!$K$4:$K$78)))","v":0},{"$f":"MEDIAN(IF('Stage 10'!$K$4:$K$78<999,IF('Stage 10'!$K$4:$K$78>0,'Stage 10'!$K$4:$K$78)))","v":{"$error":"#NUM!"}},{"$f":"MAX(IF('Stage 10'!$K$4:$K$78<999,IF('Stage 10'!$K$4:$K$78>0,'Stage 10'!$K$4:$K$78)))","v":0},{"$f":"STDEVA(IF('Stage 10'!$K$4:$K$78<999,IF('Stage 10'!$K$4:$K$78>0,'Stage 10'!$K$4:$K$78)))","v":{"$error":"#DIV/0!"}}]
[null,"Stage 11",{"$f":"SUM('Stage 11'!D4:D78)","v":0},{"$f":"SUM('Stage 11'!G4:G78)","v":0},{"$f":"SUM('Stage 11'!H4:H78)","v":0},{"$f":"SUM('Stage 11'!I4:I78)","v":0},{"$f":"SUM('Stage 11'!J4:J78)","v":0},null,null,"Stage 11",{"$f":"MIN(IF('Stage 11'!$E$4:$E$78<999,IF('Stage 11'!$E$4:$E$78>0,'Stage 11'!$E$4:$E$78)))","v":0},{"$f":"MEDIAN(IF('Stage 11'!$E$4:$E$78<999,IF('Stage 11'!$E$4:$E$78>0,'Stage 11'!$E$4:$E$78)))","v":{"$error":"#NUM!"}},{"$f":"MAX(IF('Stage 11'!$E$4:$E$78<999,IF('Stage 11'!$E$4:$E$78>0,'Stage 11'!$E$4:$E$78)))","v":0},{"$f":"STDEVA(IF('Stage 11'!$E$4:$E$78<999,IF('Stage 11'!$E$4:$E$78>0,'Stage 11'!$E$4:$E$78)))","v":{"$error":"#DIV/0!"}},null,{"$f":"MIN(IF('Stage 11'!$K$4:$K$78<999,IF('Stage 11'!$K$4:$K$78>0,'Stage 11'!$K$4:$K$78)))","v":0},{"$f":"MEDIAN(IF('Stage 11'!$K$4:$K$78<999,IF('Stage 11'!$K$4:$K$78>0,'Stage 11'!$K$4:$K$78)))","v":{"$error":"#NUM!"}},{"$f":"MAX(IF('Stage 11'!$K$4:$K$78<999,IF('Stage 11'!$K$4:$K$78>0,'Stage 11'!$K$4:$K$78)))","v":0},{"$f":"STDEVA(IF('Stage 11'!$K$4:$K$78<999,IF('Stage 11'!$K$4:$K$78>0,'Stage 11'!$K$4:$K$78)))","v":{"$error":"#DIV/0!"}}]
[null,"Stage 12",{"$f":"SUM('Stage 12'!D4:D78)","v":0},{"$f":"SUM('Stage 12'!G4:G78)","v":0},{"$f":"SUM('Stage 12'!H4:H78)","v":0},{"$f":"SUM('Stage 12'!I4:I78)","v":0},{"$f":"SUM('Stage 12'!J4:J78)","v":0},null,null,"Stage 12",{"$f":"MIN(IF('Stage 12'!$E$4:$E$78<999,IF('Stage 12'!$E$4:$E$78>0,'Stage 12'!$E$4:$E$78)))","v":0},{"$f":"MEDIAN(IF('Stage 12'!$E$4:$E$78<999,IF('Stage 12'!$E$4:$E$78>0,'Stage 12'!$E$4:$E$78)))","v":{"$error":"#NUM!"}},{"$f":"MAX(IF('Stage 12'!$E$4:$E$78<999,IF('Stage 12'!$E$4:$E$78>0,'Stage 12'!$E$4:$E$78)))","v":0},{"$f":"STDEVA(IF('Stage 12'!$E$4:$E$78<999,IF('Stage 12'!$E$4:$E$78>0,'Stage 12'!$E$4:$E$78)))","v":{"$error":"#DIV/0!"}},null,{"$f":"MIN(IF('Stage 12'!$K$4:$K$78<999,IF('Stage 12'!$K$4:$K$78>0,'Stage 12'!$K$4:$K$78)))","v":0},{"$f":"MEDIAN(IF('Stage 12'!$K$4:$K$78<999,IF('Stage 12'!$K$4:$K$78>0,'Stage 12'!$K$4:$K$78)))","v":{"$error":"#NUM!"}},{"$f":"MAX(IF('Stage 12'!$K$4:$K$78<999,IF('Stage 12'!$K$4:$K$78>0,'Stage 12'!$K$4:$K$78)))","v":0},{"$f":"STDEVA(IF('Stage 12'!$K$4:$K$78<999,IF('Stage 12'!$K$4:$K$78>0,'Stage 12'!$K$4:$K$78)))","v":{"$error":"#DIV/0!"}}]
[null,"Match Totals",{"$f":"SUM(C6:C17)","v":20},{"$f":"SUM(D6:D17)","v":6},{"$f":"SUM(E6:E17)","v":0},{"$f":"SUM(F6:F17)","v":2},{"$f":"SUM(G6:G17)","v":0},null,null,"Match Average",{"$f":"AVERAGE(K6:K17)","v":13.154999999999999},{"$f":"AVERAGE(L6:L17)","v":{"$error":"#NUM!"}},43.765000000000008,{"$error":"#DIV/0!"},null,{"$f":"AVERAGE(P6:P17)","v":13.219166666666666},{"$f":"AVERAGE(Q6:Q17)","v":{"$error":"#NUM!"}},{"$f":"AVERAGE(R6:R17)","v":45.848333333333336},{"$error":"#DIV/0!"}]
[]
[]
[null,null,"Aggergate Stage Times",null,null,null,null,null,null,null,"Aggergate Bay Times"]
[null,null,"Raw Total Seconds","Raw Total Time","Final Total Seconds","Final Total Time","Penalty Seconds","Penalty Time",null,null,"Raw Total Seconds","Raw Total Time","Final Total Seconds","Final Total Time"]
[null,"Stage 01",{"$f":"SUM(IF('Stage 1'!$E$4:$E$78<999,IF('Stage 1'!$E$4:$E$78>0,'Stage 1'!$E$4:$E$78)))","v":649.01},{"$f":"TIME(0,0,C23)","v":"00:10:49"},{"$f":"SUM(IF('Stage 1'!$K$4:$K$78<999,IF('Stage 1'!$K$4:$K$78>0,'Stage 1'!$K$4:$K$78)))","v":684.01},{"$f":"TIME(0,0,E23)","v":"00:11:24"},{"$f":"E23-C23","v":35},{"$f":"TIME(0,0,ABS(G23))","v":"00:00:35"},null,"Sat. Bay #1",{"$f":"C23+C24","v":1186.5},{"$f":"TIME(0,0,K23)","v":"00:19:46"},{"$f":"E23+E24","v":1246.5},{"$f":"TIME(0,0,M23)","v":"00:20:46"}]
[null,"Stage 02",{"$f":"SUM(IF('Stage 2'!$E$4:$E$78<999,IF('Stage 2'!$E$4:$E$78>0,'Stage 2'!$E$4:$E$78)))","v":537.49},{"$f":"TIME(0,0,C24)","v":"00:08:57"},{"$f":"SUM(IF('Stage 2'!$K$4:$K$78<999,IF('Stage 2'!$K$4:$K$78>0,'Stage 2'!$K$4:$K$78)))","v":562.49},"00:09:22",{"$f":"E24-C24","v":25},"00:00:25"]
[null,"Stage 03",{"$f":"SUM(IF('Stage 3'!$E$4:$E$78<999,IF('Stage 3'!$E$4:$E$78>0,'Stage 3'!$E$4:$E$78)))","v":610.34999999999991},"00:10:10",{"$f":"SUM(IF('Stage 3'!$K$4:$K$78<999,IF('Stage 3'!$K$4:$K$78>0,'Stage 3'!$K$4:$K$78)))","v":620.34999999999991},"00:10:20",10,"00:00:10",null,"Sat. Bay #2",{"$f":"C25+C26","v":1167.5099999999998},{"$f":"TIME(0,0,K25)","v":"00:19:27"},{"$f":"E25+E26","v":1222.5099999999998},{"$f":"TIME(0,0,M25)","v":"00:20:22"}]
[null,"Stage 04",{"$f":"SUM(IF('Stage 4'!$E$4:$E$78<999,IF('Stage 4'!$E$4:$E$78>0,'Stage 4'!$E$4:$E$78)))","v":557.16},"00:09:17",{"$f":"SUM(IF('Stage 4'!$K$4:$K$78<999,IF('Stage 4'!$K$4:$K$78>0,'Stage 4'!$K$4:$K$78)))","v":602.16},"00:10:02",45,"00:00:45"]
[null,"Stage 05",{"$f":"SUM(IF('Stage 5'!$E$4:$E$78<999,IF('Stage 5'!$E$4:$E$78>0,'Stage 5'!$E$4:$E$78)))","v":526.16},"00:08:46",{"$f":"SUM(IF('Stage 5'!$K$4:$K$78<999,IF('Stage 5'!$K$4:$K$78>0,'Stage 5'!$K$4:$K$78)))","v":531.16},"00:08:51",5,"00:00:05",null,"Sat. Bay #3",{"$f":"C27+C28","v":1065.29},"00:17:45",{"$f":"E27+E28","v":1110.29},"00:18:30"]
[null,"Stage 06",{"$f":"SUM(IF('Stage 6'!$E$4:$E$78<999,IF('Stage 6'!$E$4:$E$78>0,'Stage 6'!$E$4:$E$78)))","v":539.13},"00:08:59",{"$f":"SUM(IF('Stage 6'!$K$4:$K$78<999,IF('Stage 6'!$K$4:$K$78>0,'Stage 6'!$K$4:$K$78)))","v":579.13},"00:09:39",40,"00:00:40"]
[null,"Stage 07",{"$f":"SUM(IF('Stage 7'!$E$4:$E$78<999,IF('Stage 7'!$E$4:$E$78>0,'Stage 7'!$E$4:$E$78)))","v":0},"00:00:00",{"$f":"SUM(IF('Stage 7'!$K$4:$K$78<999,IF('Stage 7'!$K$4:$K$78>0,'Stage 7'!$K$4:$K$78)))","v":0},"00:00:00",{"$f":"E29-C29","v":0},"00:00:00",null,"Sun. Bay #1",{"$f":"C29+C30","v":0},"00:00:00",{"$f":"E29+E30","v":0},"00:00:00"]
[null,"Stage 08",{"$f":"SUM(IF('Stage 8'!$E$4:$E$78<999,IF('Stage 8'!$E$4:$E$78>0,'Stage 8'!$E$4:$E$78)))","v":0},"00:00:00",{"$f":"SUM(IF('Stage 8'!$K$4:$K$78<999,IF('Stage 8'!$K$4:$K$78>0,'Stage 8'!$K$4:$K$78)))","v":0},"00:00:00",0,"00:00:00"]
[null,"Stage 09",{"$f":"SUM(IF('Stage 9'!$E$4:$E$78<999,IF('Stage 9'!$E$4:$E$78>0,'Stage 9'!$E$4:$E$78)))","v":0},"00:00:00",{"$f":"SUM(IF('Stage 9'!$K$4:$K$78<999,IF('Stage 9'!$K$4:$K$78>0,'Stage 9'!$K$4:$K$78)))","v":0},"00:00:00",0,"00:00:00",null,"Sun. Bay #2",{"$f":"C31+C32","v":0},"00:00:00",{"$f":"E31+E32","v":0},"00:00:00"]
[null,"Stage 10",{"$f":"SUM(IF('Stage 10'!$E$4:$E$78<999,IF('Stage 10'!$E$4:$E$78>0,'Stage 10'!$E$4:$E$78)))","v":0},"00:00:00",{"$f":"SUM(IF('Stage 10'!$K$4:$K$78<999,IF('Stage 10'!$K$4:$K$78>0,'Stage 10'!$K$4:$K$78)))","v":0},"00:00:00",0,"00:00:00"]
[null,"Stage 11",{"$f":"SUM(IF('Stage 11'!$E$4:$E$78<999,IF('Stage 11'!$E$4:$E$78>0,'Stage 11'!$E$4:$E$78)))","v":0},"00:00:00",{"$f":"SUM(IF('Stage 11'!$K$4:$K$78<999,IF('Stage 11'!$K$4:$K$78>0,'Stage 11'!$K$4:$K$78)))","v":0},"00:00:00",0,"00:00:00",null,"Sun. Bay #3",{"$f":"C33+C34","v":0},"00:00:00",{"$f":"E33+E34","v":0},"00:00:00"]
[null,"Stage 12",{"$f":"SUM(IF('Stage 12'!$E$4:$E$78<999,IF('Stage 12'!$E$4:$E$78>0,'Stage 12'!$E$4:$E$78)))","v":0},"00:00:00",{"$f":"SUM(IF('Stage 12'!$K$4:$K$78<999,IF('Stage 12'!$K$4:$K$78>0,'Stage 12'!$K$4:$K$78)))","v":0},"00:00:00",0,"00:00:00"]
[null,"Match Total",{"$f":"SUM(C23:C34)","v":3419.2999999999997},"00:56:59",{"$f":"SUM(E23:E34)","v":3579.2999999999997},"00:59:39",{"$f":"SUM(G23:G34)","v":160},"00:02:40",null,"Match Total",{"$f":"SUM(K23:K34)","v":3419.2999999999997},{"$f":"TIME(0,0,K35)","v":"00:56:59"},{"$f":"SUM(M23:M34)","v":3579.2999999999997},{"$f":"TIME(0,0,M35)","v":"00:59:39"}]

{"sheet":"Data Ranges","index":15,"n_rows":60,"n_cols":6,"rows_kept":60,"cut":false,"hidden":false,"merged":[]}
["R",null,49,"49er (49+)",null,"Anne Bonney"]
["T",null,"BK","Buckaroo (13 and less)",null,"B. S. Walker"]
[null,null,"BKG","Buckarette (13 and less)",null,"Badwater Bill"]
[null,null,"BW","B-Western",null,"Beartooth"]
[null,null,"CB","Cowboy (Any Age)",null,"Bucksaw Bob"]
[null,null,"CBAR","Cattle Baron (75+)",null,"Carolina Charlie"]
[null,null,"CC","Classic Cowboy",null,"Cassie La Rue"]
[null,null,"CCG","Classic Cowgirl",null,"Cockroach"]
[null,null,"CG","Cowgirl (Lady Any Age)",null,"Cody Maverick"]
[null,null,"D","Duelist",null,"Cold Blue Mike"]
[null,null,"ES","Elder Statesmen (70+)",null,"Cotton Connie"]
[null,null,"FC","Frontier Cartridge",null,"Deadwood Doc Ross"]
[null,null,"FCD","Frontier Cartridge Duelist",null,"Deringer Dan"]
[null,null,"FCGF","Frontier Cartridge Gunfighter",null,"Dixie Gunslinger"]
[null,null,"FT","Frontiersman",null,"Doc Keep'um"]
[null,null,"GD","Grand Dames (70+)",null,"Doc Pill Filler"]
[null,null,"GF","Gunfighter",null,"El Perro Loco"]
[null,null,"L49","Lady 49er (49+)",null,"Enid City Kid"]
[null,null,"LBW","Lady B-Western",null,"Feather"]
[null,null,"LD","Lady Duelist",null,"Festos Nevada"]
[null,null,"LS","Lady Senior (60+)",null,"Filthy Five"]
[null,null,"LSD","Lady Senior Duelist",null,"Flatboat Bob"]
[null,null,"LSS","Lady Silver Senior (65+)",null,"Goosefoot"]
[null,null,"LW","Lady Wrangler (36+)",null,"Hobble Along"]
[null,null,"S","Senior (60+)",null,"Hotshod"]
[null,null,"SD","Senior Duelist (60+)",null,"Irish Don"]
[null,null,"SS","Silver Senior (65+)",null,"Judge NO Hart"]
[null,null,"W","Wrangler (36+)",null,"Kid Wolf"]
[null,null,"YG","Young Gun (14-16)",null,"Kuba Kid"]
[null,null,"YGG","Young Gun Girl (14-16)",null,"Lefty Spurmaker"]
[null,null,null,null,null,"Little Roy"]
[null,null,null,null,null,"Loco Linda"]
[null,null,null,null,null,"Mad Dog Savage"]
[null,null,null,null,null,"Miss Kala"]
[null,null,null,null,null,"Missouri Marshall"]
[null,null,null,null,null,"Morgan Dollar"]
[null,null,null,null,null,"Mustang Shelby"]
[null,null,null,null,null,"One Eyed Jane"]
[null,null,null,null,null,"One Eyed Rooster"]
[null,null,null,null,null,"PITA"]
[null,null,null,null,null,"Poney Racer"]
[null,null,null,null,null,"Potter County Kid"]
[null,null,null,null,null,"Prairie City Slim"]
[null,null,null,null,null,"Quilla Star"]
[null,null,null,null,null,"Ramblin Royce"]
[null,null,null,null,null,"Red Cavanaugh"]
[null,null,null,null,null,"Ridgeback Jack"]
[null,null,null,null,null,"Robert Greywolf"]
[null,null,null,null,null,"Salty John"]
[null,null,null,null,null,"Sassy Shooting Sours"]
[null,null,null,null,null,"Striker"]
[null,null,null,null,null,"Swifty McDraw"]
[null,null,null,null,null,"Trapper Dan"]
[null,null,null,null,null,"Virginia Blue Steel"]
[null,null,null,null,null,"Virginia Rifleman"]
[null,null,null,null,null,"Wendover Kid"]
[null,null,null,null,null,"Will Sonnet"]
[null,null,null,null,null,"Windhorse Rider"]
[null,null,null,null,null,"Wistful McClintock"]
[null,null,null,null,null,"Podo"]